cayenne-commits mailing list archives

Site index · List index
Message view « Date » · « Thread »
Top « Date » · « Thread »
From Apache Jenkins Server <jenk...@builds.apache.org>
Subject Build failed in Jenkins: cayenne-master » derby,JDK 1.8 (latest),Ubuntu #355
Date Wed, 17 Aug 2016 15:32:47 GMT
See <https://builds.apache.org/job/cayenne-master/cayenneTestConnection=derby,jdk=JDK%201.8%20(latest),label=Ubuntu/355/changes>

Changes:

[andrus] enabling failsafe plugin at the top level

------------------------------------------
[...truncated 49311 lines...]
[main] INFO org.apache.cayenne.test.jdbc.UtilityLogger - INSERT INTO PAINTING (PAINTING_ID,
ARTIST_ID, PAINTING_TITLE) VALUES (?, ?, ?)
[main] INFO org.apache.cayenne.test.jdbc.UtilityLogger - INSERT INTO PAINTING (PAINTING_ID,
ARTIST_ID, PAINTING_TITLE) VALUES (?, ?, ?)
[main] INFO org.apache.cayenne.test.jdbc.UtilityLogger - INSERT INTO PAINTING (PAINTING_ID,
ARTIST_ID, PAINTING_TITLE) VALUES (?, ?, ?)
[main] INFO org.apache.cayenne.test.jdbc.UtilityLogger - INSERT INTO PAINTING (PAINTING_ID,
ARTIST_ID, PAINTING_TITLE) VALUES (?, ?, ?)
[main] INFO org.apache.cayenne.test.jdbc.UtilityLogger - INSERT INTO PAINTING (PAINTING_ID,
ARTIST_ID, PAINTING_TITLE) VALUES (?, ?, ?)
[main] INFO org.apache.cayenne.test.jdbc.UtilityLogger - INSERT INTO PAINTING (PAINTING_ID,
ARTIST_ID, PAINTING_TITLE) VALUES (?, ?, ?)
[main] INFO org.apache.cayenne.test.jdbc.UtilityLogger - INSERT INTO PAINTING (PAINTING_ID,
ARTIST_ID, PAINTING_TITLE) VALUES (?, ?, ?)
[main] INFO org.apache.cayenne.test.jdbc.UtilityLogger - INSERT INTO PAINTING (PAINTING_ID,
ARTIST_ID, PAINTING_TITLE) VALUES (?, ?, ?)
[main] INFO org.apache.cayenne.test.jdbc.UtilityLogger - INSERT INTO PAINTING (PAINTING_ID,
ARTIST_ID, PAINTING_TITLE) VALUES (?, ?, ?)
[main] INFO org.apache.cayenne.test.jdbc.UtilityLogger - INSERT INTO PAINTING (PAINTING_ID,
ARTIST_ID, PAINTING_TITLE) VALUES (?, ?, ?)
[main] INFO org.apache.cayenne.test.jdbc.UtilityLogger - INSERT INTO PAINTING (PAINTING_ID,
ARTIST_ID, PAINTING_TITLE) VALUES (?, ?, ?)
[main] INFO org.apache.cayenne.test.jdbc.UtilityLogger - INSERT INTO PAINTING (PAINTING_ID,
ARTIST_ID, PAINTING_TITLE) VALUES (?, ?, ?)
[main] INFO org.apache.cayenne.test.jdbc.UtilityLogger - INSERT INTO PAINTING (PAINTING_ID,
ARTIST_ID, PAINTING_TITLE) VALUES (?, ?, ?)
[main] INFO org.apache.cayenne.test.jdbc.UtilityLogger - INSERT INTO PAINTING (PAINTING_ID,
ARTIST_ID, PAINTING_TITLE) VALUES (?, ?, ?)
[main] INFO org.apache.cayenne.test.jdbc.UtilityLogger - INSERT INTO PAINTING (PAINTING_ID,
ARTIST_ID, PAINTING_TITLE) VALUES (?, ?, ?)
[main] INFO org.apache.cayenne.test.jdbc.UtilityLogger - INSERT INTO PAINTING (PAINTING_ID,
ARTIST_ID, PAINTING_TITLE) VALUES (?, ?, ?)
[main] INFO org.apache.cayenne.test.jdbc.UtilityLogger - INSERT INTO PAINTING (PAINTING_ID,
ARTIST_ID, PAINTING_TITLE) VALUES (?, ?, ?)
[main] INFO org.apache.cayenne.test.jdbc.UtilityLogger - INSERT INTO PAINTING (PAINTING_ID,
ARTIST_ID, PAINTING_TITLE) VALUES (?, ?, ?)
[main] INFO org.apache.cayenne.test.jdbc.UtilityLogger - INSERT INTO PAINTING (PAINTING_ID,
ARTIST_ID, PAINTING_TITLE) VALUES (?, ?, ?)
[main] INFO org.apache.cayenne.test.jdbc.UtilityLogger - INSERT INTO PAINTING (PAINTING_ID,
ARTIST_ID, PAINTING_TITLE) VALUES (?, ?, ?)
[main] INFO org.apache.cayenne.test.jdbc.UtilityLogger - INSERT INTO PAINTING (PAINTING_ID,
ARTIST_ID, PAINTING_TITLE) VALUES (?, ?, ?)
[main] INFO org.apache.cayenne.test.jdbc.UtilityLogger - INSERT INTO PAINTING (PAINTING_ID,
ARTIST_ID, PAINTING_TITLE) VALUES (?, ?, ?)
[main] INFO org.apache.cayenne.log.CommonsJdbcEventLogger - --- transaction started.
[main] INFO org.apache.cayenne.log.CommonsJdbcEventLogger - SELECT t0.PAINTING_ID FROM PAINTING
t0 
[main] INFO org.apache.cayenne.log.CommonsJdbcEventLogger - === returned 100 rows. - took
2 ms.
[main] INFO org.apache.cayenne.log.CommonsJdbcEventLogger - +++ transaction committed.
[main] INFO org.apache.cayenne.log.CommonsJdbcEventLogger - --- transaction started.
[main] INFO org.apache.cayenne.log.CommonsJdbcEventLogger - SELECT t0.ESTIMATED_PRICE, t0.PAINTING_DESCRIPTION,
t0.PAINTING_TITLE, t0.ARTIST_ID, t0.GALLERY_ID, t0.PAINTING_ID FROM PAINTING t0 WHERE (t0.PAINTING_ID
= ?) OR (t0.PAINTING_ID = ?) OR (t0.PAINTING_ID = ?) OR (t0.PAINTING_ID = ?) OR (t0.PAINTING_ID
= ?) OR (t0.PAINTING_ID = ?) OR (t0.PAINTING_ID = ?) OR (t0.PAINTING_ID = ?) OR (t0.PAINTING_ID
= ?) OR (t0.PAINTING_ID = ?) OR (t0.PAINTING_ID = ?) OR (t0.PAINTING_ID = ?) OR (t0.PAINTING_ID
= ?) OR (t0.PAINTING_ID = ?) OR (t0.PAINTING_ID = ?) OR (t0.PAINTING_ID = ?) OR (t0.PAINTING_ID
= ?) OR (t0.PAINTING_ID = ?) OR (t0.PAINTING_ID = ?) OR (t0.PAINTING_ID = ?) OR (t0.PAINTING_ID
= ?) OR (t0.PAINTING_ID = ?) OR (t0.PAINTING_ID = ?) OR (t0.PAINTING_ID = ?) OR (t0.PAINTING_ID
= ?) OR (t0.PAINTING_ID = ?) OR (t0.PAINTING_ID = ?) OR (t0.PAINTING_ID = ?) OR (t0.PAINTING_ID
= ?) OR (t0.PAINTING_ID = ?) OR (t0.PAINTING_ID = ?) OR (t0.PAINTING_ID = ?) OR (t0.PAINTING_ID
= ?) OR (t0.PAINTING_ID = ?) OR (t0.PAINTING_ID = ?) OR (t0.PAINTING_ID = ?) OR (t0.PAINTING_ID
= ?) OR (t0.PAINTING_ID = ?) OR (t0.PAINTING_ID = ?) OR (t0.PAINTING_ID = ?) OR (t0.PAINTING_ID
= ?) OR (t0.PAINTING_ID = ?) OR (t0.PAINTING_ID = ?) OR (t0.PAINTING_ID = ?) OR (t0.PAINTING_ID
= ?) OR (t0.PAINTING_ID = ?) OR (t0.PAINTING_ID = ?) OR (t0.PAINTING_ID = ?) OR (t0.PAINTING_ID
= ?) OR (t0.PAINTING_ID = ?) OR (t0.PAINTING_ID = ?) OR (t0.PAINTING_ID = ?) OR (t0.PAINTING_ID
= ?) OR (t0.PAINTING_ID = ?) OR (t0.PAINTING_ID = ?) OR (t0.PAINTING_ID = ?) OR (t0.PAINTING_ID
= ?) OR (t0.PAINTING_ID = ?) OR (t0.PAINTING_ID = ?) OR (t0.PAINTING_ID = ?) OR (t0.PAINTING_ID
= ?) OR (t0.PAINTING_ID = ?) OR (t0.PAINTING_ID = ?) OR (t0.PAINTING_ID = ?) OR (t0.PAINTING_ID
= ?) OR (t0.PAINTING_ID = ?) OR (t0.PAINTING_ID = ?) OR (t0.PAINTING_ID = ?) OR (t0.PAINTING_ID
= ?) OR (t0.PAINTING_ID = ?) OR (t0.PAINTING_ID = ?) OR (t0.PAINTING_ID = ?) OR (t0.PAINTING_ID
= ?) OR (t0.PAINTING_ID = ?) OR (t0.PAINTING_ID = ?) OR (t0.PAINTING_ID = ?) OR (t0.PAINTING_ID
= ?) OR (t0.PAINTING_ID = ?) OR (t0.PAINTING_ID = ?) OR (t0.PAINTING_ID = ?) OR (t0.PAINTING_ID
= ?) OR (t0.PAINTING_ID = ?) OR (t0.PAINTING_ID = ?) OR (t0.PAINTING_ID = ?) OR (t0.PAINTING_ID
= ?) OR (t0.PAINTING_ID = ?) OR (t0.PAINTING_ID = ?) OR (t0.PAINTING_ID = ?) OR (t0.PAINTING_ID
= ?) OR (t0.PAINTING_ID = ?) OR (t0.PAINTING_ID = ?) OR (t0.PAINTING_ID = ?) OR (t0.PAINTING_ID
= ?) OR (t0.PAINTING_ID = ?) OR (t0.PAINTING_ID = ?) OR (t0.PAINTING_ID = ?) OR (t0.PAINTING_ID
= ?) OR (t0.PAINTING_ID = ?) OR (t0.PAINTING_ID = ?) OR (t0.PAINTING_ID = ?) [bind: 1->PAINTING_ID:1,
2->PAINTING_ID:2, 3->PAINTING_ID:3, 4->PAINTING_ID:4, 5->PAINTING_ID:5, 6->PAINTING_ID:6,
7->PAINTING_ID:7, 8->PAINTING_ID:8, 9->PAINTING_ID:9, 10->PAINTING_ID:10, 11->PAINTING_ID:11,
12->PAINTING_ID:12, 13->PAINTING_ID:13, 14->PAINTING_ID:14, 15->PAINTING_ID:15,
16->PAINTING_ID:16, 17->PAINTING_ID:17, 18->PAINTING_ID:18, 19->PAINTING_ID:19,
20->PAINTING_ID:20, 21->PAINTING_ID:21, 22->PAINTING_ID:22, 23->PAINTING_ID:23,
24->PAINTING_ID:24, 25->PAINTING_ID:25, 26->PAINTING_ID:26, 27->PAINTING_ID:27,
28->PAINTING_ID:28, 29->PAINTING_ID:29, 30->PAINTING_ID:30, 31->PAINTING_ID:31,
32->PAINTING_ID:32, 33->PAINTING_ID:33, 34->PAINTING_ID:34, 35->PAINTING_ID:35,
36->PAINTING_ID:36, 37->PAINTING_ID:37, 38->PAINTING_ID:38, 39->PAINTING_ID:39,
40->PAINTING_ID:40, 41->PAINTING_ID:41, 42->PAINTING_ID:42, 43->PAINTING_ID:43,
44->PAINTING_ID:44, 45->PAINTING_ID:45, 46->PAINTING_ID:46, 47->PAINTING_ID:47,
48->PAINTING_ID:48, 49->PAINTING_ID:49, 50->PAINTING_ID:50, 51->PAINTING_ID:51,
52->PAINTING_ID:52, 53->PAINTING_ID:53, 54->PAINTING_ID:54, 55->PAINTING_ID:55,
56->PAINTING_ID:56, 57->PAINTING_ID:57, 58->PAINTING_ID:58, 59->PAINTING_ID:59,
60->PAINTING_ID:60, 61->PAINTING_ID:61, 62->PAINTING_ID:62, 63->PAINTING_ID:63,
64->PAINTING_ID:64, 65->PAINTING_ID:65, 66->PAINTING_ID:66, 67->PAINTING_ID:67,
68->PAINTING_ID:68, 69->PAINTING_ID:69, 70->PAINTING_ID:70, 71->PAINTING_ID:71,
72->PAINTING_ID:72, 73->PAINTING_ID:73, 74->PAINTING_ID:74, 75->PAINTING_ID:75,
76->PAINTING_ID:76, 77->PAINTING_ID:77, 78->PAINTING_ID:78, 79->PAINTING_ID:79,
80->PAINTING_ID:80, 81->PAINTING_ID:81, 82->PAINTING_ID:82, 83->PAINTING_ID:83,
84->PAINTING_ID:84, 85->PAINTING_ID:85, 86->PAINTING_ID:86, 87->PAINTING_ID:87,
88->PAINTING_ID:88, 89->PAINTING_ID:89, 90->PAINTING_ID:90, 91->PAINTING_ID:91,
92->PAINTING_ID:92, 93->PAINTING_ID:93, 94->PAINTING_ID:94, 95->PAINTING_ID:95,
96->PAINTING_ID:96, 97->PAINTING_ID:97, 98->PAINTING_ID:98, 99->PAINTING_ID:99,
100->PAINTING_ID:100]
[main] INFO org.apache.cayenne.log.CommonsJdbcEventLogger - === returned 100 rows. - took
3 ms.
[main] INFO org.apache.cayenne.log.CommonsJdbcEventLogger - +++ transaction committed.
Tests run: 7, Failures: 0, Errors: 0, Skipped: 0, Time elapsed: 38.998 sec - in org.apache.cayenne.DataContextMaxIdQualifierIT
Running org.apache.cayenne.CayenneDataObjectValidationIT
[main] INFO org.apache.cayenne.configuration.XMLDataChannelDescriptorLoader - Loading XML
configuration resource from <https://builds.apache.org/job/cayenne-master/cayenneTestConnection=derby,jdk=JDK%201.8%20(latest),label=Ubuntu/ws/cayenne-server/target/test-classes/cayenne-testmap.xml>
[main] INFO org.apache.cayenne.configuration.XMLDataChannelDescriptorLoader - Loading XML
DataMap resource from <https://builds.apache.org/job/cayenne-master/cayenneTestConnection=derby,jdk=JDK%201.8%20(latest),label=Ubuntu/ws/cayenne-server/target/test-classes/testmap.map.xml>
[main] INFO org.apache.cayenne.map.EntityResolver - added runtime complimentary DbRelationship
from ARTIST to PAINTING1
[main] INFO org.apache.cayenne.configuration.XMLDataChannelDescriptorLoader - Loading XML
configuration resource from <https://builds.apache.org/job/cayenne-master/cayenneTestConnection=derby,jdk=JDK%201.8%20(latest),label=Ubuntu/ws/cayenne-server/target/test-classes/cayenne-testmap.xml>
[main] INFO org.apache.cayenne.configuration.XMLDataChannelDescriptorLoader - Loading XML
DataMap resource from <https://builds.apache.org/job/cayenne-master/cayenneTestConnection=derby,jdk=JDK%201.8%20(latest),label=Ubuntu/ws/cayenne-server/target/test-classes/testmap.map.xml>
[main] INFO org.apache.cayenne.test.jdbc.UtilityLogger - delete from PAINTING1
[main] INFO org.apache.cayenne.test.jdbc.UtilityLogger - delete from ARTIST_EXHIBIT
[main] INFO org.apache.cayenne.test.jdbc.UtilityLogger - delete from PAINTING_INFO
[main] INFO org.apache.cayenne.test.jdbc.UtilityLogger - delete from EXHIBIT
[main] INFO org.apache.cayenne.test.jdbc.UtilityLogger - delete from PAINTING
[main] INFO org.apache.cayenne.test.jdbc.UtilityLogger - delete from ARTIST_CT
[main] INFO org.apache.cayenne.test.jdbc.UtilityLogger - delete from ARTIST_GROUP
[main] INFO org.apache.cayenne.test.jdbc.UtilityLogger - delete from ARTIST
[main] INFO org.apache.cayenne.test.jdbc.UtilityLogger - delete from GALLERY
[main] INFO org.apache.cayenne.test.jdbc.UtilityLogger - delete from ARTGROUP
[main] INFO org.apache.cayenne.test.jdbc.UtilityLogger - delete from GENERATED_COLUMN
[main] INFO org.apache.cayenne.test.jdbc.UtilityLogger - delete from NULL_TEST
[main] INFO org.apache.cayenne.configuration.XMLDataChannelDescriptorLoader - Loading XML
configuration resource from <https://builds.apache.org/job/cayenne-master/cayenneTestConnection=derby,jdk=JDK%201.8%20(latest),label=Ubuntu/ws/cayenne-server/target/test-classes/cayenne-testmap.xml>
[main] INFO org.apache.cayenne.configuration.XMLDataChannelDescriptorLoader - Loading XML
DataMap resource from <https://builds.apache.org/job/cayenne-master/cayenneTestConnection=derby,jdk=JDK%201.8%20(latest),label=Ubuntu/ws/cayenne-server/target/test-classes/testmap.map.xml>
[main] INFO org.apache.cayenne.map.EntityResolver - added runtime complimentary DbRelationship
from ARTIST to PAINTING1
[main] INFO org.apache.cayenne.configuration.XMLDataChannelDescriptorLoader - Loading XML
configuration resource from <https://builds.apache.org/job/cayenne-master/cayenneTestConnection=derby,jdk=JDK%201.8%20(latest),label=Ubuntu/ws/cayenne-server/target/test-classes/cayenne-testmap.xml>
[main] INFO org.apache.cayenne.configuration.XMLDataChannelDescriptorLoader - Loading XML
DataMap resource from <https://builds.apache.org/job/cayenne-master/cayenneTestConnection=derby,jdk=JDK%201.8%20(latest),label=Ubuntu/ws/cayenne-server/target/test-classes/testmap.map.xml>
[main] INFO org.apache.cayenne.test.jdbc.UtilityLogger - delete from PAINTING1
[main] INFO org.apache.cayenne.test.jdbc.UtilityLogger - delete from ARTIST_EXHIBIT
[main] INFO org.apache.cayenne.test.jdbc.UtilityLogger - delete from PAINTING_INFO
[main] INFO org.apache.cayenne.test.jdbc.UtilityLogger - delete from EXHIBIT
[main] INFO org.apache.cayenne.test.jdbc.UtilityLogger - delete from PAINTING
[main] INFO org.apache.cayenne.test.jdbc.UtilityLogger - delete from ARTIST_CT
[main] INFO org.apache.cayenne.test.jdbc.UtilityLogger - delete from ARTIST_GROUP
[main] INFO org.apache.cayenne.test.jdbc.UtilityLogger - delete from ARTIST
[main] INFO org.apache.cayenne.test.jdbc.UtilityLogger - delete from GALLERY
[main] INFO org.apache.cayenne.test.jdbc.UtilityLogger - delete from ARTGROUP
[main] INFO org.apache.cayenne.test.jdbc.UtilityLogger - delete from GENERATED_COLUMN
[main] INFO org.apache.cayenne.test.jdbc.UtilityLogger - delete from NULL_TEST
[main] INFO org.apache.cayenne.configuration.XMLDataChannelDescriptorLoader - Loading XML
configuration resource from <https://builds.apache.org/job/cayenne-master/cayenneTestConnection=derby,jdk=JDK%201.8%20(latest),label=Ubuntu/ws/cayenne-server/target/test-classes/cayenne-testmap.xml>
[main] INFO org.apache.cayenne.configuration.XMLDataChannelDescriptorLoader - Loading XML
DataMap resource from <https://builds.apache.org/job/cayenne-master/cayenneTestConnection=derby,jdk=JDK%201.8%20(latest),label=Ubuntu/ws/cayenne-server/target/test-classes/testmap.map.xml>
[main] INFO org.apache.cayenne.map.EntityResolver - added runtime complimentary DbRelationship
from ARTIST to PAINTING1
[main] INFO org.apache.cayenne.configuration.XMLDataChannelDescriptorLoader - Loading XML
configuration resource from <https://builds.apache.org/job/cayenne-master/cayenneTestConnection=derby,jdk=JDK%201.8%20(latest),label=Ubuntu/ws/cayenne-server/target/test-classes/cayenne-testmap.xml>
[main] INFO org.apache.cayenne.configuration.XMLDataChannelDescriptorLoader - Loading XML
DataMap resource from <https://builds.apache.org/job/cayenne-master/cayenneTestConnection=derby,jdk=JDK%201.8%20(latest),label=Ubuntu/ws/cayenne-server/target/test-classes/testmap.map.xml>
[main] INFO org.apache.cayenne.test.jdbc.UtilityLogger - delete from PAINTING1
[main] INFO org.apache.cayenne.test.jdbc.UtilityLogger - delete from ARTIST_EXHIBIT
[main] INFO org.apache.cayenne.test.jdbc.UtilityLogger - delete from PAINTING_INFO
[main] INFO org.apache.cayenne.test.jdbc.UtilityLogger - delete from EXHIBIT
[main] INFO org.apache.cayenne.test.jdbc.UtilityLogger - delete from PAINTING
[main] INFO org.apache.cayenne.test.jdbc.UtilityLogger - delete from ARTIST_CT
[main] INFO org.apache.cayenne.test.jdbc.UtilityLogger - delete from ARTIST_GROUP
[main] INFO org.apache.cayenne.test.jdbc.UtilityLogger - delete from ARTIST
[main] INFO org.apache.cayenne.test.jdbc.UtilityLogger - delete from GALLERY
[main] INFO org.apache.cayenne.test.jdbc.UtilityLogger - delete from ARTGROUP
[main] INFO org.apache.cayenne.test.jdbc.UtilityLogger - delete from GENERATED_COLUMN
[main] INFO org.apache.cayenne.test.jdbc.UtilityLogger - delete from NULL_TEST
Tests run: 3, Failures: 0, Errors: 0, Skipped: 0, Time elapsed: 0.071 sec - in org.apache.cayenne.CayenneDataObjectValidationIT
Running org.apache.cayenne.PersistentObjectIT
[main] INFO org.apache.cayenne.configuration.XMLDataChannelDescriptorLoader - Loading XML
configuration resource from <https://builds.apache.org/job/cayenne-master/cayenneTestConnection=derby,jdk=JDK%201.8%20(latest),label=Ubuntu/ws/cayenne-server/target/test-classes/cayenne-testmap.xml>
[main] INFO org.apache.cayenne.configuration.XMLDataChannelDescriptorLoader - Loading XML
DataMap resource from <https://builds.apache.org/job/cayenne-master/cayenneTestConnection=derby,jdk=JDK%201.8%20(latest),label=Ubuntu/ws/cayenne-server/target/test-classes/testmap.map.xml>
[main] INFO org.apache.cayenne.map.EntityResolver - added runtime complimentary DbRelationship
from ARTIST to PAINTING1
[main] INFO org.apache.cayenne.configuration.XMLDataChannelDescriptorLoader - Loading XML
configuration resource from <https://builds.apache.org/job/cayenne-master/cayenneTestConnection=derby,jdk=JDK%201.8%20(latest),label=Ubuntu/ws/cayenne-server/target/test-classes/cayenne-testmap.xml>
[main] INFO org.apache.cayenne.configuration.XMLDataChannelDescriptorLoader - Loading XML
DataMap resource from <https://builds.apache.org/job/cayenne-master/cayenneTestConnection=derby,jdk=JDK%201.8%20(latest),label=Ubuntu/ws/cayenne-server/target/test-classes/testmap.map.xml>
[main] INFO org.apache.cayenne.test.jdbc.UtilityLogger - delete from PAINTING1
[main] INFO org.apache.cayenne.test.jdbc.UtilityLogger - delete from ARTIST_EXHIBIT
[main] INFO org.apache.cayenne.test.jdbc.UtilityLogger - delete from PAINTING_INFO
[main] INFO org.apache.cayenne.test.jdbc.UtilityLogger - delete from EXHIBIT
[main] INFO org.apache.cayenne.test.jdbc.UtilityLogger - delete from PAINTING
[main] INFO org.apache.cayenne.test.jdbc.UtilityLogger - delete from ARTIST_CT
[main] INFO org.apache.cayenne.test.jdbc.UtilityLogger - delete from ARTIST_GROUP
[main] INFO org.apache.cayenne.test.jdbc.UtilityLogger - delete from ARTIST
[main] INFO org.apache.cayenne.test.jdbc.UtilityLogger - delete from GALLERY
[main] INFO org.apache.cayenne.test.jdbc.UtilityLogger - delete from ARTGROUP
[main] INFO org.apache.cayenne.test.jdbc.UtilityLogger - delete from GENERATED_COLUMN
[main] INFO org.apache.cayenne.test.jdbc.UtilityLogger - delete from NULL_TEST
[main] INFO org.apache.cayenne.configuration.XMLDataChannelDescriptorLoader - Loading XML
configuration resource from <https://builds.apache.org/job/cayenne-master/cayenneTestConnection=derby,jdk=JDK%201.8%20(latest),label=Ubuntu/ws/cayenne-server/target/test-classes/cayenne-testmap.xml>
[main] INFO org.apache.cayenne.configuration.XMLDataChannelDescriptorLoader - Loading XML
DataMap resource from <https://builds.apache.org/job/cayenne-master/cayenneTestConnection=derby,jdk=JDK%201.8%20(latest),label=Ubuntu/ws/cayenne-server/target/test-classes/testmap.map.xml>
[main] INFO org.apache.cayenne.map.EntityResolver - added runtime complimentary DbRelationship
from ARTIST to PAINTING1
[main] INFO org.apache.cayenne.configuration.XMLDataChannelDescriptorLoader - Loading XML
configuration resource from <https://builds.apache.org/job/cayenne-master/cayenneTestConnection=derby,jdk=JDK%201.8%20(latest),label=Ubuntu/ws/cayenne-server/target/test-classes/cayenne-testmap.xml>
[main] INFO org.apache.cayenne.configuration.XMLDataChannelDescriptorLoader - Loading XML
DataMap resource from <https://builds.apache.org/job/cayenne-master/cayenneTestConnection=derby,jdk=JDK%201.8%20(latest),label=Ubuntu/ws/cayenne-server/target/test-classes/testmap.map.xml>
[main] INFO org.apache.cayenne.test.jdbc.UtilityLogger - delete from PAINTING1
[main] INFO org.apache.cayenne.test.jdbc.UtilityLogger - delete from ARTIST_EXHIBIT
[main] INFO org.apache.cayenne.test.jdbc.UtilityLogger - delete from PAINTING_INFO
[main] INFO org.apache.cayenne.test.jdbc.UtilityLogger - delete from EXHIBIT
[main] INFO org.apache.cayenne.test.jdbc.UtilityLogger - delete from PAINTING
[main] INFO org.apache.cayenne.test.jdbc.UtilityLogger - delete from ARTIST_CT
[main] INFO org.apache.cayenne.test.jdbc.UtilityLogger - delete from ARTIST_GROUP
[main] INFO org.apache.cayenne.test.jdbc.UtilityLogger - delete from ARTIST
[main] INFO org.apache.cayenne.test.jdbc.UtilityLogger - delete from GALLERY
[main] INFO org.apache.cayenne.test.jdbc.UtilityLogger - delete from ARTGROUP
[main] INFO org.apache.cayenne.test.jdbc.UtilityLogger - delete from GENERATED_COLUMN
[main] INFO org.apache.cayenne.test.jdbc.UtilityLogger - delete from NULL_TEST
[main] INFO org.apache.cayenne.configuration.XMLDataChannelDescriptorLoader - Loading XML
configuration resource from <https://builds.apache.org/job/cayenne-master/cayenneTestConnection=derby,jdk=JDK%201.8%20(latest),label=Ubuntu/ws/cayenne-server/target/test-classes/cayenne-testmap.xml>
[main] INFO org.apache.cayenne.configuration.XMLDataChannelDescriptorLoader - Loading XML
DataMap resource from <https://builds.apache.org/job/cayenne-master/cayenneTestConnection=derby,jdk=JDK%201.8%20(latest),label=Ubuntu/ws/cayenne-server/target/test-classes/testmap.map.xml>
[main] INFO org.apache.cayenne.map.EntityResolver - added runtime complimentary DbRelationship
from ARTIST to PAINTING1
[main] INFO org.apache.cayenne.configuration.XMLDataChannelDescriptorLoader - Loading XML
configuration resource from <https://builds.apache.org/job/cayenne-master/cayenneTestConnection=derby,jdk=JDK%201.8%20(latest),label=Ubuntu/ws/cayenne-server/target/test-classes/cayenne-testmap.xml>
[main] INFO org.apache.cayenne.configuration.XMLDataChannelDescriptorLoader - Loading XML
DataMap resource from <https://builds.apache.org/job/cayenne-master/cayenneTestConnection=derby,jdk=JDK%201.8%20(latest),label=Ubuntu/ws/cayenne-server/target/test-classes/testmap.map.xml>
[main] INFO org.apache.cayenne.test.jdbc.UtilityLogger - delete from PAINTING1
[main] INFO org.apache.cayenne.test.jdbc.UtilityLogger - delete from ARTIST_EXHIBIT
[main] INFO org.apache.cayenne.test.jdbc.UtilityLogger - delete from PAINTING_INFO
[main] INFO org.apache.cayenne.test.jdbc.UtilityLogger - delete from EXHIBIT
[main] INFO org.apache.cayenne.test.jdbc.UtilityLogger - delete from PAINTING
[main] INFO org.apache.cayenne.test.jdbc.UtilityLogger - delete from ARTIST_CT
[main] INFO org.apache.cayenne.test.jdbc.UtilityLogger - delete from ARTIST_GROUP
[main] INFO org.apache.cayenne.test.jdbc.UtilityLogger - delete from ARTIST
[main] INFO org.apache.cayenne.test.jdbc.UtilityLogger - delete from GALLERY
[main] INFO org.apache.cayenne.test.jdbc.UtilityLogger - delete from ARTGROUP
[main] INFO org.apache.cayenne.test.jdbc.UtilityLogger - delete from GENERATED_COLUMN
[main] INFO org.apache.cayenne.test.jdbc.UtilityLogger - delete from NULL_TEST
Tests run: 3, Failures: 0, Errors: 0, Skipped: 0, Time elapsed: 0.043 sec - in org.apache.cayenne.PersistentObjectIT

Results :

Failed tests: 
  DataContextEJBQLQueryIT.testSelectDbPath:215 expected:<3000> but was:<3000.00>

Tests run: 1505, Failures: 1, Errors: 0, Skipped: 0

[INFO] 
[INFO] --- maven-failsafe-plugin:2.17:verify (integration-test) @ cayenne-server ---
[INFO] Failsafe report directory: <https://builds.apache.org/job/cayenne-master/cayenneTestConnection=derby,jdk=JDK%201.8%20(latest),label=Ubuntu/ws/cayenne-server/target/failsafe-reports>
[INFO] ------------------------------------------------------------------------
[INFO] Reactor Summary:
[INFO] 
[INFO] Cayenne ............................................ SUCCESS [  0.762 s]
[INFO] Cayenne Build Tools Parent ......................... SUCCESS [  0.013 s]
[INFO] Cayenne License and Notice Bundle .................. SUCCESS [  2.425 s]
[INFO] Common Unit Test Utilities ......................... SUCCESS [  1.468 s]
[INFO] Cayenne Code Checkers .............................. SUCCESS [  0.099 s]
[INFO] Cayenne Dependency Injection Container ............. SUCCESS [ 14.139 s]
[INFO] Cayenne Server ..................................... FAILURE [10:37 min]
[INFO] Cayenne ROP Client ................................. SKIPPED
[INFO] Cayenne Project .................................... SKIPPED
[INFO] Cayenne Tools ...................................... SKIPPED
[INFO] Cayenne Lifecycle Utilities ........................ SKIPPED
[INFO] Cayenne Maven Plugins .............................. SKIPPED
[INFO] Cayenne Maven Plugin ............................... SKIPPED
[INFO] Cayenne Cryptography Extensions .................... SKIPPED
[INFO] Cayenne Joda Extensions ............................ SKIPPED
[INFO] Cayenne DBCP2 Extension ............................ SKIPPED
[INFO] Cayenne Integration Tests Parent ................... SKIPPED
[INFO] Integration Tests - Cayenne Tools .................. SKIPPED
[INFO] Cayenne Modeler Parent ............................. SKIPPED
[INFO] Cayenne WebObjects Compatibility Library ........... SKIPPED
[INFO] Cayenne Modeler .................................... SKIPPED
[INFO] Cayenne Modeler Generic and Windows Extensions ..... SKIPPED
[INFO] Cayenne Modeler Generic ............................ SKIPPED
[INFO] Cayenne Modeler Mac OS X Extensions ................ SKIPPED
[INFO] Cayenne Modeler Mac OS X ........................... SKIPPED
[INFO] Cayenne Modeler Windows ............................ SKIPPED
[INFO] Cayenne Modeler Maven Plugin ....................... SKIPPED
[INFO] Cayenne Tutorials .................................. SKIPPED
[INFO] Cayenne Tutorial ................................... SKIPPED
[INFO] Cayenne ROP Server Tutorial ........................ SKIPPED
[INFO] Cayenne ROP Client Tutorial ........................ SKIPPED
[INFO] Cayenne Java8 Extensions ........................... SKIPPED
[INFO] Cayenne Protostuff Extension ....................... SKIPPED
[INFO] Cayenne ROP HTTP/2 Server Tutorial ................. SKIPPED
[INFO] Cayenne ROP Client (Jetty) ......................... SKIPPED
[INFO] Cayenne ROP HTTP/2 Client Tutorial ................. SKIPPED
[INFO] Cayenne Documenation Parent ........................ SKIPPED
[INFO] Cayenne Documentation .............................. SKIPPED
[INFO] Cayenne Docbook Documentation ...................... SKIPPED
[INFO] Docbook: Cayenne Stylesheets ....................... SKIPPED
[INFO] Docbook: Cayenne Guide ............................. SKIPPED
[INFO] Docbook: Getting Started with Cayenne .............. SKIPPED
[INFO] Docbook: Getting Started with Cayenne ROP .......... SKIPPED
[INFO] Docbook: Cayenne New Features and Upgrade Guide .... SKIPPED
[INFO] Cayenne Release Assembly ........................... SKIPPED
[INFO] ------------------------------------------------------------------------
[INFO] BUILD FAILURE
[INFO] ------------------------------------------------------------------------
[INFO] Total time: 10:58 min
[INFO] Finished at: 2016-08-17T15:32:26+00:00
[INFO] Final Memory: 84M/468M
[INFO] ------------------------------------------------------------------------
[ERROR] Failed to execute goal org.apache.maven.plugins:maven-failsafe-plugin:2.17:verify
(integration-test) on project cayenne-server: There are test failures.
[ERROR] 
[ERROR] Please refer to <https://builds.apache.org/job/cayenne-master/cayenneTestConnection=derby,jdk=JDK%201.8%20(latest),label=Ubuntu/ws/cayenne-server/target/failsafe-reports>
for the individual test results.
[ERROR] -> [Help 1]
org.apache.maven.lifecycle.LifecycleExecutionException: Failed to execute goal org.apache.maven.plugins:maven-failsafe-plugin:2.17:verify
(integration-test) on project cayenne-server: There are test failures.

Please refer to <https://builds.apache.org/job/cayenne-master/cayenneTestConnection=derby,jdk=JDK%201.8%20(latest),label=Ubuntu/ws/cayenne-server/target/failsafe-reports>
for the individual test results.
	at org.apache.maven.lifecycle.internal.MojoExecutor.execute(MojoExecutor.java:212)
	at org.apache.maven.lifecycle.internal.MojoExecutor.execute(MojoExecutor.java:153)
	at org.apache.maven.lifecycle.internal.MojoExecutor.execute(MojoExecutor.java:145)
	at org.apache.maven.lifecycle.internal.LifecycleModuleBuilder.buildProject(LifecycleModuleBuilder.java:116)
	at org.apache.maven.lifecycle.internal.LifecycleModuleBuilder.buildProject(LifecycleModuleBuilder.java:80)
	at org.apache.maven.lifecycle.internal.builder.singlethreaded.SingleThreadedBuilder.build(SingleThreadedBuilder.java:51)
	at org.apache.maven.lifecycle.internal.LifecycleStarter.execute(LifecycleStarter.java:128)
	at org.apache.maven.DefaultMaven.doExecute(DefaultMaven.java:307)
	at org.apache.maven.DefaultMaven.doExecute(DefaultMaven.java:193)
	at org.apache.maven.DefaultMaven.execute(DefaultMaven.java:106)
	at org.apache.maven.cli.MavenCli.execute(MavenCli.java:863)
	at org.apache.maven.cli.MavenCli.doMain(MavenCli.java:288)
	at org.apache.maven.cli.MavenCli.main(MavenCli.java:199)
	at sun.reflect.NativeMethodAccessorImpl.invoke0(Native Method)
	at sun.reflect.NativeMethodAccessorImpl.invoke(NativeMethodAccessorImpl.java:62)
	at sun.reflect.DelegatingMethodAccessorImpl.invoke(DelegatingMethodAccessorImpl.java:43)
	at java.lang.reflect.Method.invoke(Method.java:498)
	at org.codehaus.plexus.classworlds.launcher.Launcher.launchEnhanced(Launcher.java:289)
	at org.codehaus.plexus.classworlds.launcher.Launcher.launch(Launcher.java:229)
	at org.codehaus.plexus.classworlds.launcher.Launcher.mainWithExitCode(Launcher.java:415)
	at org.codehaus.plexus.classworlds.launcher.Launcher.main(Launcher.java:356)
Caused by: org.apache.maven.plugin.MojoFailureException: There are test failures.

Please refer to <https://builds.apache.org/job/cayenne-master/cayenneTestConnection=derby,jdk=JDK%201.8%20(latest),label=Ubuntu/ws/cayenne-server/target/failsafe-reports>
for the individual test results.
	at org.apache.maven.plugin.surefire.SurefireHelper.reportExecution(SurefireHelper.java:82)
	at org.apache.maven.plugin.failsafe.VerifyMojo.execute(VerifyMojo.java:194)
	at org.apache.maven.plugin.DefaultBuildPluginManager.executeMojo(DefaultBuildPluginManager.java:134)
	at org.apache.maven.lifecycle.internal.MojoExecutor.execute(MojoExecutor.java:207)
	... 20 more
[ERROR] 
[ERROR] Re-run Maven using the -X switch to enable full debug logging.
[ERROR] 
[ERROR] For more information about the errors and possible solutions, please read the following
articles:
[ERROR] [Help 1] http://cwiki.apache.org/confluence/display/MAVEN/MojoFailureException
[ERROR] 
[ERROR] After correcting the problems, you can resume the build with the command
[ERROR]   mvn <goals> -rf :cayenne-server
Build step 'Invoke top-level Maven targets' marked build as failure
Recording test results

Mime
View raw message