cayenne-commits mailing list archives

Site index · List index
Message view « Date » · « Thread »
Top « Date » · « Thread »
From Apache Jenkins Server <jenk...@builds.apache.org>
Subject Build failed in Jenkins: cayenne-master » hsql,JDK 1.7 (latest),Ubuntu #364
Date Fri, 19 Aug 2016 11:53:42 GMT
See <https://builds.apache.org/job/cayenne-master/cayenneTestConnection=hsql,jdk=JDK%201.7%20(latest),label=Ubuntu/364/changes>

Changes:

[nordmann89] CAY-2103 cayenne-crypto: support for mapping non-String and non-binary

[nordmann89] CAY-2103 cayenne-crypto: support for mapping non-String and non-binary

[nordmann89] CAY-2103 cayenne-crypto: support for mapping non-String and non-binary

------------------------------------------
[...truncated 65874 lines...]
[INFO] org already added, skipping
[INFO] org/apache already added, skipping
[INFO] org/apache/cayenne already added, skipping
[INFO] org/apache/cayenne/tutorial already added, skipping
[INFO] org/apache/cayenne/tutorial/persistent already added, skipping
[INFO] org/apache/cayenne/tutorial/persistent/auto already added, skipping
[INFO] datamap.map.xml already added, skipping
[INFO] cayenne-project.xml already added, skipping
[INFO] Building jar: <https://builds.apache.org/job/cayenne-master/cayenneTestConnection=hsql,jdk=JDK%201.7%20(latest),label=Ubuntu/ws/tutorials/tutorial/target/tutorial-4.0.M4-SNAPSHOT-sources.jar>
[INFO] org already added, skipping
[INFO] org/apache already added, skipping
[INFO] org/apache/cayenne already added, skipping
[INFO] org/apache/cayenne/tutorial already added, skipping
[INFO] org/apache/cayenne/tutorial/persistent already added, skipping
[INFO] org/apache/cayenne/tutorial/persistent/auto already added, skipping
[INFO] datamap.map.xml already added, skipping
[INFO] cayenne-project.xml already added, skipping
[INFO] 
[INFO] --- maven-failsafe-plugin:2.17:integration-test (integration-test) @ tutorial ---
[INFO] 
[INFO] --- maven-failsafe-plugin:2.17:verify (integration-test) @ tutorial ---
[INFO] Failsafe report directory: <https://builds.apache.org/job/cayenne-master/cayenneTestConnection=hsql,jdk=JDK%201.7%20(latest),label=Ubuntu/ws/tutorials/tutorial/target/failsafe-reports>
[INFO]                                                                         
[INFO] ------------------------------------------------------------------------
[INFO] Building Cayenne ROP Server Tutorial 4.0.M4-SNAPSHOT
[INFO] ------------------------------------------------------------------------
[INFO] 
[INFO] --- maven-clean-plugin:2.5:clean (default-clean) @ tutorial-rop-server ---
[INFO] 
[INFO] --- maven-remote-resources-plugin:1.5:process (default) @ tutorial-rop-server ---
[INFO] 
[INFO] --- maven-resources-plugin:2.4.3:resources (default-resources) @ tutorial-rop-server
---
[INFO] Using 'UTF-8' encoding to copy filtered resources.
[INFO] Copying 2 resources
[INFO] Copying 4 resources
[INFO] 
[INFO] --- maven-compiler-plugin:2.3.2:compile (default-compile) @ tutorial-rop-server ---
[INFO] Compiling 16 source files to <https://builds.apache.org/job/cayenne-master/cayenneTestConnection=hsql,jdk=JDK%201.7%20(latest),label=Ubuntu/ws/tutorials/tutorial-rop-server/target/classes>
[INFO] 
[INFO] --- maven-resources-plugin:2.4.3:testResources (default-testResources) @ tutorial-rop-server
---
[INFO] Using 'UTF-8' encoding to copy filtered resources.
[INFO] Copying 1 resource
[INFO] Copying 20 resources
[INFO] 
[INFO] --- maven-compiler-plugin:2.3.2:testCompile (default-testCompile) @ tutorial-rop-server
---
[INFO] Nothing to compile - all classes are up to date
[INFO] 
[INFO] --- maven-surefire-plugin:2.5:test (default-test) @ tutorial-rop-server ---
[INFO] Surefire report directory: <https://builds.apache.org/job/cayenne-master/cayenneTestConnection=hsql,jdk=JDK%201.7%20(latest),label=Ubuntu/ws/tutorials/tutorial-rop-server/target/surefire-reports>

-------------------------------------------------------
 T E S T S
-------------------------------------------------------
There are no tests to run.

Results :

Tests run: 0, Failures: 0, Errors: 0, Skipped: 0

[INFO] 
[INFO] --- maven-war-plugin:2.2:war (default-war) @ tutorial-rop-server ---
[INFO] Packaging webapp
[INFO] Assembling webapp [tutorial-rop-server] in [<https://builds.apache.org/job/cayenne-master/cayenneTestConnection=hsql,jdk=JDK%201.7%20(latest),label=Ubuntu/ws/tutorials/tutorial-rop-server/target/tutorial-rop-server-4.0.M4-SNAPSHOT]>
[INFO] Processing war project
[INFO] Copying webapp resources [<https://builds.apache.org/job/cayenne-master/cayenneTestConnection=hsql,jdk=JDK%201.7%20(latest),label=Ubuntu/ws/tutorials/tutorial-rop-server/src/main/webapp]>
[INFO] Webapp assembled in [332 msecs]
[INFO] Building war: <https://builds.apache.org/job/cayenne-master/cayenneTestConnection=hsql,jdk=JDK%201.7%20(latest),label=Ubuntu/ws/tutorials/tutorial-rop-server/target/tutorial-rop-server-4.0.M4-SNAPSHOT.war>
[INFO] WEB-INF/web.xml already added, skipping
[INFO] 
[INFO] >>> maven-source-plugin:2.1.2:jar (bundle-source-jar) > generate-sources
@ tutorial-rop-server >>>
[INFO] 
[INFO] <<< maven-source-plugin:2.1.2:jar (bundle-source-jar) < generate-sources
@ tutorial-rop-server <<<
[INFO] 
[INFO] --- maven-source-plugin:2.1.2:jar (bundle-source-jar) @ tutorial-rop-server ---
[INFO] org already added, skipping
[INFO] org/apache already added, skipping
[INFO] org/apache/cayenne already added, skipping
[INFO] org/apache/cayenne/tutorial already added, skipping
[INFO] org/apache/cayenne/tutorial/persistent already added, skipping
[INFO] org/apache/cayenne/tutorial/persistent/auto already added, skipping
[INFO] org/apache/cayenne/tutorial/persistent/client already added, skipping
[INFO] org/apache/cayenne/tutorial/persistent/client/auto already added, skipping
[INFO] datamap.map.xml already added, skipping
[INFO] cayenne-project.xml already added, skipping
[INFO] Building jar: <https://builds.apache.org/job/cayenne-master/cayenneTestConnection=hsql,jdk=JDK%201.7%20(latest),label=Ubuntu/ws/tutorials/tutorial-rop-server/target/tutorial-rop-server-4.0.M4-SNAPSHOT-sources.jar>
[INFO] org already added, skipping
[INFO] org/apache already added, skipping
[INFO] org/apache/cayenne already added, skipping
[INFO] org/apache/cayenne/tutorial already added, skipping
[INFO] org/apache/cayenne/tutorial/persistent already added, skipping
[INFO] org/apache/cayenne/tutorial/persistent/auto already added, skipping
[INFO] org/apache/cayenne/tutorial/persistent/client already added, skipping
[INFO] org/apache/cayenne/tutorial/persistent/client/auto already added, skipping
[INFO] datamap.map.xml already added, skipping
[INFO] cayenne-project.xml already added, skipping
[INFO] 
[INFO] --- maven-failsafe-plugin:2.17:integration-test (integration-test) @ tutorial-rop-server
---
[INFO] 
[INFO] --- maven-failsafe-plugin:2.17:verify (integration-test) @ tutorial-rop-server ---
[INFO] Failsafe report directory: <https://builds.apache.org/job/cayenne-master/cayenneTestConnection=hsql,jdk=JDK%201.7%20(latest),label=Ubuntu/ws/tutorials/tutorial-rop-server/target/failsafe-reports>
[INFO]                                                                         
[INFO] ------------------------------------------------------------------------
[INFO] Building Cayenne ROP Client Tutorial 4.0.M4-SNAPSHOT
[INFO] ------------------------------------------------------------------------
[INFO] 
[INFO] --- maven-clean-plugin:2.5:clean (default-clean) @ tutorial-rop-client ---
[INFO] 
[INFO] --- maven-remote-resources-plugin:1.5:process (default) @ tutorial-rop-client ---
[INFO] 
[INFO] --- maven-resources-plugin:2.4.3:resources (default-resources) @ tutorial-rop-client
---
[INFO] Using 'UTF-8' encoding to copy filtered resources.
[INFO] Copying 1 resource
[INFO] Copying 3 resources
[INFO] 
[INFO] --- maven-compiler-plugin:2.3.2:compile (default-compile) @ tutorial-rop-client ---
[INFO] Compiling 9 source files to <https://builds.apache.org/job/cayenne-master/cayenneTestConnection=hsql,jdk=JDK%201.7%20(latest),label=Ubuntu/ws/tutorials/tutorial-rop-client/target/classes>
[INFO] ------------------------------------------------------------------------
[INFO] Reactor Summary:
[INFO] 
[INFO] Cayenne ............................................ SUCCESS [  1.327 s]
[INFO] Cayenne Build Tools Parent ......................... SUCCESS [  0.026 s]
[INFO] Cayenne License and Notice Bundle .................. SUCCESS [  2.160 s]
[INFO] Common Unit Test Utilities ......................... SUCCESS [  1.683 s]
[INFO] Cayenne Code Checkers .............................. SUCCESS [  0.177 s]
[INFO] Cayenne Dependency Injection Container ............. SUCCESS [ 17.252 s]
[INFO] Cayenne Server ..................................... SUCCESS [02:51 min]
[INFO] Cayenne ROP Client ................................. SUCCESS [ 38.449 s]
[INFO] Cayenne Project .................................... SUCCESS [ 13.345 s]
[INFO] Cayenne Tools ...................................... SUCCESS [ 20.010 s]
[INFO] Cayenne Lifecycle Utilities ........................ SUCCESS [ 19.475 s]
[INFO] Cayenne Maven Plugins .............................. SUCCESS [  1.798 s]
[INFO] Cayenne Maven Plugin ............................... SUCCESS [ 33.092 s]
[INFO] Cayenne Cryptography Extensions .................... SUCCESS [ 13.389 s]
[INFO] Cayenne Joda Extensions ............................ SUCCESS [  6.417 s]
[INFO] Cayenne DBCP2 Extension ............................ SUCCESS [  3.641 s]
[INFO] Cayenne Integration Tests Parent ................... SUCCESS [  0.013 s]
[INFO] Integration Tests - Cayenne Tools .................. SUCCESS [  4.030 s]
[INFO] Cayenne Modeler Parent ............................. SUCCESS [  0.047 s]
[INFO] Cayenne WebObjects Compatibility Library ........... SUCCESS [ 11.178 s]
[INFO] Cayenne Modeler .................................... SUCCESS [ 27.796 s]
[INFO] Cayenne Modeler Generic and Windows Extensions ..... SUCCESS [  3.298 s]
[INFO] Cayenne Modeler Generic ............................ SUCCESS [  0.873 s]
[INFO] Cayenne Modeler Mac OS X Extensions ................ SUCCESS [  2.974 s]
[INFO] Cayenne Modeler Mac OS X ........................... SUCCESS [  1.061 s]
[INFO] Cayenne Modeler Windows ............................ SUCCESS [  0.882 s]
[INFO] Cayenne Modeler Maven Plugin ....................... SUCCESS [  5.767 s]
[INFO] Cayenne Tutorials .................................. SUCCESS [  0.080 s]
[INFO] Cayenne Tutorial ................................... SUCCESS [  1.474 s]
[INFO] Cayenne ROP Server Tutorial ........................ SUCCESS [  4.329 s]
[INFO] Cayenne ROP Client Tutorial ........................ FAILURE [  3.611 s]
[INFO] Cayenne Documenation Parent ........................ SKIPPED
[INFO] Cayenne Documentation .............................. SKIPPED
[INFO] Cayenne Docbook Documentation ...................... SKIPPED
[INFO] Docbook: Cayenne Stylesheets ....................... SKIPPED
[INFO] Docbook: Cayenne Guide ............................. SKIPPED
[INFO] Docbook: Getting Started with Cayenne .............. SKIPPED
[INFO] Docbook: Getting Started with Cayenne ROP .......... SKIPPED
[INFO] Docbook: Cayenne New Features and Upgrade Guide .... SKIPPED
[INFO] ------------------------------------------------------------------------
[INFO] BUILD FAILURE
[INFO] ------------------------------------------------------------------------
[INFO] Total time: 06:52 min
[INFO] Finished at: 2016-08-19T11:52:31+00:00
[INFO] Final Memory: 45M/452M
[INFO] ------------------------------------------------------------------------
[ERROR] Failed to execute goal org.apache.maven.plugins:maven-compiler-plugin:2.3.2:compile
(default-compile) on project tutorial-rop-client: Fatal error compiling: Error while executing
the compiler. InvocationTargetException: PermGen space -> [Help 1]
org.apache.maven.lifecycle.LifecycleExecutionException: Failed to execute goal org.apache.maven.plugins:maven-compiler-plugin:2.3.2:compile
(default-compile) on project tutorial-rop-client: Fatal error compiling
	at org.apache.maven.lifecycle.internal.MojoExecutor.execute(MojoExecutor.java:212)
	at org.apache.maven.lifecycle.internal.MojoExecutor.execute(MojoExecutor.java:153)
	at org.apache.maven.lifecycle.internal.MojoExecutor.execute(MojoExecutor.java:145)
	at org.apache.maven.lifecycle.internal.LifecycleModuleBuilder.buildProject(LifecycleModuleBuilder.java:116)
	at org.apache.maven.lifecycle.internal.LifecycleModuleBuilder.buildProject(LifecycleModuleBuilder.java:80)
	at org.apache.maven.lifecycle.internal.builder.singlethreaded.SingleThreadedBuilder.build(SingleThreadedBuilder.java:51)
	at org.apache.maven.lifecycle.internal.LifecycleStarter.execute(LifecycleStarter.java:128)
	at org.apache.maven.DefaultMaven.doExecute(DefaultMaven.java:307)
	at org.apache.maven.DefaultMaven.doExecute(DefaultMaven.java:193)
	at org.apache.maven.DefaultMaven.execute(DefaultMaven.java:106)
	at org.apache.maven.cli.MavenCli.execute(MavenCli.java:863)
	at org.apache.maven.cli.MavenCli.doMain(MavenCli.java:288)
	at org.apache.maven.cli.MavenCli.main(MavenCli.java:199)
	at sun.reflect.NativeMethodAccessorImpl.invoke0(Native Method)
	at sun.reflect.NativeMethodAccessorImpl.invoke(NativeMethodAccessorImpl.java:57)
	at sun.reflect.DelegatingMethodAccessorImpl.invoke(DelegatingMethodAccessorImpl.java:43)
	at java.lang.reflect.Method.invoke(Method.java:606)
	at org.codehaus.plexus.classworlds.launcher.Launcher.launchEnhanced(Launcher.java:289)
	at org.codehaus.plexus.classworlds.launcher.Launcher.launch(Launcher.java:229)
	at org.codehaus.plexus.classworlds.launcher.Launcher.mainWithExitCode(Launcher.java:415)
	at org.codehaus.plexus.classworlds.launcher.Launcher.main(Launcher.java:356)
Caused by: org.apache.maven.plugin.MojoExecutionException: Fatal error compiling
	at org.apache.maven.plugin.AbstractCompilerMojo.execute(AbstractCompilerMojo.java:610)
	at org.apache.maven.plugin.CompilerMojo.execute(CompilerMojo.java:128)
	at org.apache.maven.plugin.DefaultBuildPluginManager.executeMojo(DefaultBuildPluginManager.java:134)
	at org.apache.maven.lifecycle.internal.MojoExecutor.execute(MojoExecutor.java:207)
	... 20 more
Caused by: org.codehaus.plexus.compiler.CompilerException: Error while executing the compiler.
	at org.codehaus.plexus.compiler.javac.JavacCompiler.compileInProcess(JavacCompiler.java:568)
	at org.codehaus.plexus.compiler.javac.JavacCompiler.compile(JavacCompiler.java:161)
	at org.apache.maven.plugin.AbstractCompilerMojo.execute(AbstractCompilerMojo.java:605)
	... 23 more
Caused by: java.lang.reflect.InvocationTargetException
	at sun.reflect.NativeMethodAccessorImpl.invoke0(Native Method)
	at sun.reflect.NativeMethodAccessorImpl.invoke(NativeMethodAccessorImpl.java:57)
	at sun.reflect.DelegatingMethodAccessorImpl.invoke(DelegatingMethodAccessorImpl.java:43)
	at java.lang.reflect.Method.invoke(Method.java:606)
	at org.codehaus.plexus.compiler.javac.JavacCompiler.compileInProcess(JavacCompiler.java:554)
	... 25 more
Caused by: java.lang.OutOfMemoryError: PermGen space
	at java.lang.ClassLoader.defineClass1(Native Method)
	at java.lang.ClassLoader.defineClass(ClassLoader.java:800)
	at java.security.SecureClassLoader.defineClass(SecureClassLoader.java:142)
	at java.net.URLClassLoader.defineClass(URLClassLoader.java:449)
	at java.net.URLClassLoader.access$100(URLClassLoader.java:71)
	at java.net.URLClassLoader$1.run(URLClassLoader.java:361)
	at java.net.URLClassLoader$1.run(URLClassLoader.java:355)
	at java.security.AccessController.doPrivileged(Native Method)
	at java.net.URLClassLoader.findClass(URLClassLoader.java:354)
	at org.codehaus.plexus.compiler.javac.IsolatedClassLoader.loadClass(IsolatedClassLoader.java:56)
	at java.util.ResourceBundle$Control.newBundle(ResourceBundle.java:2566)
	at java.util.ResourceBundle.loadBundle(ResourceBundle.java:1436)
	at java.util.ResourceBundle.findBundle(ResourceBundle.java:1400)
	at java.util.ResourceBundle.findBundle(ResourceBundle.java:1354)
	at java.util.ResourceBundle.findBundle(ResourceBundle.java:1354)
	at java.util.ResourceBundle.getBundleImpl(ResourceBundle.java:1296)
	at java.util.ResourceBundle.getBundle(ResourceBundle.java:795)
	at com.sun.tools.javac.util.JavacMessages.getBundles(JavacMessages.java:121)
	at com.sun.tools.javac.util.JavacMessages.setCurrentLocale(JavacMessages.java:73)
	at com.sun.tools.javac.util.JavacMessages.<init>(JavacMessages.java:98)
	at com.sun.tools.javac.util.JavacMessages.<init>(JavacMessages.java:88)
	at com.sun.tools.javac.main.Main.getLocalizedString(Main.java:584)
	at com.sun.tools.javac.main.Main.resourceMessage(Main.java:527)
	at com.sun.tools.javac.main.Main.compile(Main.java:459)
	at com.sun.tools.javac.main.Main.compile(Main.java:353)
	at com.sun.tools.javac.main.Main.compile(Main.java:342)
	at com.sun.tools.javac.main.Main.compile(Main.java:333)
	at com.sun.tools.javac.Main.compile(Main.java:94)
	at sun.reflect.NativeMethodAccessorImpl.invoke0(Native Method)
	at sun.reflect.NativeMethodAccessorImpl.invoke(NativeMethodAccessorImpl.java:57)
	at sun.reflect.DelegatingMethodAccessorImpl.invoke(DelegatingMethodAccessorImpl.java:43)
	at java.lang.reflect.Method.invoke(Method.java:606)
[ERROR] 
[ERROR] Re-run Maven using the -X switch to enable full debug logging.
[ERROR] 
[ERROR] For more information about the errors and possible solutions, please read the following
articles:
[ERROR] [Help 1] http://cwiki.apache.org/confluence/display/MAVEN/MojoExecutionException
[ERROR] 
[ERROR] After correcting the problems, you can resume the build with the command
[ERROR]   mvn <goals> -rf :tutorial-rop-client
Build step 'Invoke top-level Maven targets' marked build as failure
Recording test results

Mime
View raw message