cayenne-commits mailing list archives

Site index · List index
Message view « Date » · « Thread »
Top « Date » · « Thread »
From Apache Jenkins Server <jenk...@builds.apache.org>
Subject Build failed in Jenkins: cayenne-master » derby,JDK 1.8 (latest),Ubuntu #360
Date Thu, 18 Aug 2016 13:43:12 GMT
See <https://builds.apache.org/job/cayenne-master/cayenneTestConnection=derby,jdk=JDK%201.8%20(latest),label=Ubuntu/360/>

------------------------------------------
Started by upstream project "cayenne-master" build number 360
originally caused by:
 Started by user aadamchik
[EnvInject] - Loading node environment variables.
Building remotely on ubuntu-5 (Ubuntu yahoo-not-h2 ubuntu ubuntu5 docker) in workspace <https://builds.apache.org/job/cayenne-master/cayenneTestConnection=derby,jdk=JDK%201.8%20(latest),label=Ubuntu/ws/>
 > git rev-parse --is-inside-work-tree # timeout=10
Fetching changes from the remote Git repository
 > git config remote.origin.url https://git-wip-us.apache.org/repos/asf/cayenne.git # timeout=10
Fetching upstream changes from https://git-wip-us.apache.org/repos/asf/cayenne.git
 > git --version # timeout=10
 > git -c core.askpass=true fetch --tags --progress https://git-wip-us.apache.org/repos/asf/cayenne.git
+refs/heads/*:refs/remotes/origin/*
Checking out Revision e91e11a44277e6a755636a514c43691b9f2755f1 (refs/remotes/origin/master)
 > git config core.sparsecheckout # timeout=10
 > git checkout -f e91e11a44277e6a755636a514c43691b9f2755f1
 > git rev-list e91e11a44277e6a755636a514c43691b9f2755f1 # timeout=10
Cleaning workspace
 > git rev-parse --verify HEAD # timeout=10
Resetting working tree
 > git reset --hard # timeout=10
 > git clean -fdx # timeout=10
[Ubuntu] $ /home/jenkins/tools/maven/latest3/bin/mvn "-Djdk=JDK 1.8 (latest)" -Dlabel=Ubuntu
-DcayenneTestConnection=derby -v
Apache Maven 3.3.9 (bb52d8502b132ec0a5a3f4c09453c07478323dc5; 2015-11-10T16:41:47+00:00)
Maven home: /home/jenkins/tools/maven/latest3
Java version: 1.8.0_102, vendor: Oracle Corporation
Java home: /usr/local/asfpackages/java/jdk1.8.0_102/jre
Default locale: en_US, platform encoding: ISO-8859-1
OS name: "linux", version: "3.13.0-92-generic", arch: "amd64", family: "unix"
[Ubuntu] $ /home/jenkins/tools/maven/latest3/bin/mvn "-Djdk=JDK 1.8 (latest)" -Dlabel=Ubuntu
-DcayenneTestConnection=derby -e clean verify
[INFO] Error stacktraces are turned on.
[INFO] Scanning for projects...
[INFO] ------------------------------------------------------------------------
[INFO] Reactor Build Order:
[INFO] 
[INFO] Cayenne
[INFO] Cayenne Build Tools Parent
[INFO] Cayenne License and Notice Bundle
[INFO] Common Unit Test Utilities
[INFO] Cayenne Code Checkers
[INFO] Cayenne Dependency Injection Container
[INFO] Cayenne Server
[INFO] Cayenne ROP Client
[INFO] Cayenne Project
[INFO] Cayenne Tools
[INFO] Cayenne Lifecycle Utilities
[INFO] Cayenne Maven Plugins
[INFO] Cayenne Maven Plugin
[INFO] Cayenne Cryptography Extensions
[INFO] Cayenne Joda Extensions
[INFO] Cayenne DBCP2 Extension
[INFO] Cayenne Integration Tests Parent
[INFO] Integration Tests - Cayenne Tools
[INFO] Cayenne Modeler Parent
[INFO] Cayenne WebObjects Compatibility Library
[INFO] Cayenne Modeler
[INFO] Cayenne Modeler Generic and Windows Extensions
[INFO] Cayenne Modeler Generic
[INFO] Cayenne Modeler Mac OS X Extensions
[INFO] Cayenne Modeler Mac OS X
[INFO] Cayenne Modeler Windows
[INFO] Cayenne Modeler Maven Plugin
[INFO] Cayenne Tutorials
[INFO] Cayenne Tutorial
[INFO] Cayenne ROP Server Tutorial
[INFO] Cayenne ROP Client Tutorial
[INFO] Cayenne Java8 Extensions
[INFO] Cayenne Protostuff Extension
[INFO] Cayenne ROP HTTP/2 Server Tutorial
[INFO] Cayenne ROP Client (Jetty)
[INFO] Cayenne ROP HTTP/2 Client Tutorial
[INFO] Cayenne Documenation Parent
[INFO] Cayenne Documentation
[INFO] Cayenne Docbook Documentation
[INFO] Docbook: Cayenne Stylesheets
[INFO] Docbook: Cayenne Guide
[INFO] Docbook: Getting Started with Cayenne
[INFO] Docbook: Getting Started with Cayenne ROP
[INFO] Docbook: Cayenne New Features and Upgrade Guide
[INFO] Cayenne Release Assembly
[INFO]                                                                         
[INFO] ------------------------------------------------------------------------
[INFO] Building Cayenne 4.0.M4-SNAPSHOT
[INFO] ------------------------------------------------------------------------
[INFO] 
[INFO] --- maven-clean-plugin:2.5:clean (default-clean) @ cayenne-parent ---
[INFO] 
[INFO] --- maven-remote-resources-plugin:1.5:process (default) @ cayenne-parent ---
[INFO] ------------------------------------------------------------------------
[INFO] Reactor Summary:
[INFO] 
[INFO] Cayenne ............................................ FAILURE [  0.540 s]
[INFO] Cayenne Build Tools Parent ......................... SKIPPED
[INFO] Cayenne License and Notice Bundle .................. SKIPPED
[INFO] Common Unit Test Utilities ......................... SKIPPED
[INFO] Cayenne Code Checkers .............................. SKIPPED
[INFO] Cayenne Dependency Injection Container ............. SKIPPED
[INFO] Cayenne Server ..................................... SKIPPED
[INFO] Cayenne ROP Client ................................. SKIPPED
[INFO] Cayenne Project .................................... SKIPPED
[INFO] Cayenne Tools ...................................... SKIPPED
[INFO] Cayenne Lifecycle Utilities ........................ SKIPPED
[INFO] Cayenne Maven Plugins .............................. SKIPPED
[INFO] Cayenne Maven Plugin ............................... SKIPPED
[INFO] Cayenne Cryptography Extensions .................... SKIPPED
[INFO] Cayenne Joda Extensions ............................ SKIPPED
[INFO] Cayenne DBCP2 Extension ............................ SKIPPED
[INFO] Cayenne Integration Tests Parent ................... SKIPPED
[INFO] Integration Tests - Cayenne Tools .................. SKIPPED
[INFO] Cayenne Modeler Parent ............................. SKIPPED
[INFO] Cayenne WebObjects Compatibility Library ........... SKIPPED
[INFO] Cayenne Modeler .................................... SKIPPED
[INFO] Cayenne Modeler Generic and Windows Extensions ..... SKIPPED
[INFO] Cayenne Modeler Generic ............................ SKIPPED
[INFO] Cayenne Modeler Mac OS X Extensions ................ SKIPPED
[INFO] Cayenne Modeler Mac OS X ........................... SKIPPED
[INFO] Cayenne Modeler Windows ............................ SKIPPED
[INFO] Cayenne Modeler Maven Plugin ....................... SKIPPED
[INFO] Cayenne Tutorials .................................. SKIPPED
[INFO] Cayenne Tutorial ................................... SKIPPED
[INFO] Cayenne ROP Server Tutorial ........................ SKIPPED
[INFO] Cayenne ROP Client Tutorial ........................ SKIPPED
[INFO] Cayenne Java8 Extensions ........................... SKIPPED
[INFO] Cayenne Protostuff Extension ....................... SKIPPED
[INFO] Cayenne ROP HTTP/2 Server Tutorial ................. SKIPPED
[INFO] Cayenne ROP Client (Jetty) ......................... SKIPPED
[INFO] Cayenne ROP HTTP/2 Client Tutorial ................. SKIPPED
[INFO] Cayenne Documenation Parent ........................ SKIPPED
[INFO] Cayenne Documentation .............................. SKIPPED
[INFO] Cayenne Docbook Documentation ...................... SKIPPED
[INFO] Docbook: Cayenne Stylesheets ....................... SKIPPED
[INFO] Docbook: Cayenne Guide ............................. SKIPPED
[INFO] Docbook: Getting Started with Cayenne .............. SKIPPED
[INFO] Docbook: Getting Started with Cayenne ROP .......... SKIPPED
[INFO] Docbook: Cayenne New Features and Upgrade Guide .... SKIPPED
[INFO] Cayenne Release Assembly ........................... SKIPPED
[INFO] ------------------------------------------------------------------------
[INFO] BUILD FAILURE
[INFO] ------------------------------------------------------------------------
[INFO] Total time: 1.448 s
[INFO] Finished at: 2016-08-18T13:43:24+00:00
[INFO] Final Memory: 23M/491M
[INFO] ------------------------------------------------------------------------
[ERROR] Failed to execute goal org.apache.maven.plugins:maven-remote-resources-plugin:1.5:process
(default) on project cayenne-parent: Resources archive cannot be found. Could not find artifact
org.apache.cayenne.build-tools:cayenne-legal:jar:4.0.M4-SNAPSHOT
[ERROR] 
[ERROR] Try downloading the file manually from the project website.
[ERROR] 
[ERROR] Then, install it using the command:
[ERROR] mvn install:install-file -DgroupId=org.apache.cayenne.build-tools -DartifactId=cayenne-legal
-Dversion=4.0.M4-SNAPSHOT -Dpackaging=jar -Dfile=/path/to/file
[ERROR] 
[ERROR] Alternatively, if you host your own repository you can deploy the file there:
[ERROR] mvn deploy:deploy-file -DgroupId=org.apache.cayenne.build-tools -DartifactId=cayenne-legal
-Dversion=4.0.M4-SNAPSHOT -Dpackaging=jar -Dfile=/path/to/file -Durl=[url] -DrepositoryId=[id]
[ERROR] 
[ERROR] 
[ERROR] org.apache.cayenne.build-tools:cayenne-legal:jar:4.0.M4-SNAPSHOT
[ERROR] 
[ERROR] from the specified remote repositories:
[ERROR] objectstyle (http://maven.objectstyle.org/nexus/content/groups/cayenne-deps, releases=true,
snapshots=false),
[ERROR] central (https://repo.maven.apache.org/maven2, releases=true, snapshots=false)
[ERROR] -> [Help 1]
org.apache.maven.lifecycle.LifecycleExecutionException: Failed to execute goal org.apache.maven.plugins:maven-remote-resources-plugin:1.5:process
(default) on project cayenne-parent: Resources archive cannot be found.
	at org.apache.maven.lifecycle.internal.MojoExecutor.execute(MojoExecutor.java:212)
	at org.apache.maven.lifecycle.internal.MojoExecutor.execute(MojoExecutor.java:153)
	at org.apache.maven.lifecycle.internal.MojoExecutor.execute(MojoExecutor.java:145)
	at org.apache.maven.lifecycle.internal.LifecycleModuleBuilder.buildProject(LifecycleModuleBuilder.java:116)
	at org.apache.maven.lifecycle.internal.LifecycleModuleBuilder.buildProject(LifecycleModuleBuilder.java:80)
	at org.apache.maven.lifecycle.internal.builder.singlethreaded.SingleThreadedBuilder.build(SingleThreadedBuilder.java:51)
	at org.apache.maven.lifecycle.internal.LifecycleStarter.execute(LifecycleStarter.java:128)
	at org.apache.maven.DefaultMaven.doExecute(DefaultMaven.java:307)
	at org.apache.maven.DefaultMaven.doExecute(DefaultMaven.java:193)
	at org.apache.maven.DefaultMaven.execute(DefaultMaven.java:106)
	at org.apache.maven.cli.MavenCli.execute(MavenCli.java:863)
	at org.apache.maven.cli.MavenCli.doMain(MavenCli.java:288)
	at org.apache.maven.cli.MavenCli.main(MavenCli.java:199)
	at sun.reflect.NativeMethodAccessorImpl.invoke0(Native Method)
	at sun.reflect.NativeMethodAccessorImpl.invoke(NativeMethodAccessorImpl.java:62)
	at sun.reflect.DelegatingMethodAccessorImpl.invoke(DelegatingMethodAccessorImpl.java:43)
	at java.lang.reflect.Method.invoke(Method.java:498)
	at org.codehaus.plexus.classworlds.launcher.Launcher.launchEnhanced(Launcher.java:289)
	at org.codehaus.plexus.classworlds.launcher.Launcher.launch(Launcher.java:229)
	at org.codehaus.plexus.classworlds.launcher.Launcher.mainWithExitCode(Launcher.java:415)
	at org.codehaus.plexus.classworlds.launcher.Launcher.main(Launcher.java:356)
Caused by: org.apache.maven.plugin.MojoExecutionException: Resources archive cannot be found.
	at org.apache.maven.plugin.resources.remote.ProcessRemoteResourcesMojo.downloadBundles(ProcessRemoteResourcesMojo.java:1079)
	at org.apache.maven.plugin.resources.remote.ProcessRemoteResourcesMojo.execute(ProcessRemoteResourcesMojo.java:509)
	at org.apache.maven.plugin.DefaultBuildPluginManager.executeMojo(DefaultBuildPluginManager.java:134)
	at org.apache.maven.lifecycle.internal.MojoExecutor.execute(MojoExecutor.java:207)
	... 20 more
Caused by: org.apache.maven.artifact.resolver.ArtifactNotFoundException: Could not find artifact
org.apache.cayenne.build-tools:cayenne-legal:jar:4.0.M4-SNAPSHOT

Try downloading the file manually from the project website.

Then, install it using the command: 
    mvn install:install-file -DgroupId=org.apache.cayenne.build-tools -DartifactId=cayenne-legal
-Dversion=4.0.M4-SNAPSHOT -Dpackaging=jar -Dfile=/path/to/file

Alternatively, if you host your own repository you can deploy the file there: 
    mvn deploy:deploy-file -DgroupId=org.apache.cayenne.build-tools -DartifactId=cayenne-legal
-Dversion=4.0.M4-SNAPSHOT -Dpackaging=jar -Dfile=/path/to/file -Durl=[url] -DrepositoryId=[id]


  org.apache.cayenne.build-tools:cayenne-legal:jar:4.0.M4-SNAPSHOT

from the specified remote repositories:
  objectstyle (http://maven.objectstyle.org/nexus/content/groups/cayenne-deps, releases=true,
snapshots=false),
  central (https://repo.maven.apache.org/maven2, releases=true, snapshots=false)

	at org.apache.maven.artifact.resolver.DefaultArtifactResolver.resolve(DefaultArtifactResolver.java:221)
	at org.apache.maven.artifact.resolver.DefaultArtifactResolver.resolve(DefaultArtifactResolver.java:154)
	at org.apache.maven.artifact.resolver.DefaultArtifactResolver.resolve(DefaultArtifactResolver.java:555)
	at org.apache.maven.plugin.resources.remote.ProcessRemoteResourcesMojo.downloadBundles(ProcessRemoteResourcesMojo.java:1066)
	... 23 more
Caused by: org.eclipse.aether.resolution.ArtifactResolutionException: Could not find artifact
org.apache.cayenne.build-tools:cayenne-legal:jar:4.0.M4-SNAPSHOT
	at org.eclipse.aether.internal.impl.DefaultArtifactResolver.resolve(DefaultArtifactResolver.java:444)
	at org.eclipse.aether.internal.impl.DefaultArtifactResolver.resolveArtifacts(DefaultArtifactResolver.java:246)
	at org.eclipse.aether.internal.impl.DefaultArtifactResolver.resolveArtifact(DefaultArtifactResolver.java:223)
	at org.eclipse.aether.internal.impl.DefaultRepositorySystem.resolveArtifact(DefaultRepositorySystem.java:294)
	at org.apache.maven.artifact.resolver.DefaultArtifactResolver.resolve(DefaultArtifactResolver.java:215)
	... 26 more
Caused by: org.eclipse.aether.transfer.ArtifactNotFoundException: Could not find artifact
org.apache.cayenne.build-tools:cayenne-legal:jar:4.0.M4-SNAPSHOT
	at org.eclipse.aether.internal.impl.DefaultArtifactResolver.resolve(DefaultArtifactResolver.java:434)
	... 30 more
[ERROR] 
[ERROR] Re-run Maven using the -X switch to enable full debug logging.
[ERROR] 
[ERROR] For more information about the errors and possible solutions, please read the following
articles:
[ERROR] [Help 1] http://cwiki.apache.org/confluence/display/MAVEN/MojoExecutionException
Build step 'Invoke top-level Maven targets' marked build as failure
Recording test results
ERROR: Step ?Publish JUnit test result report? failed: No test report files were found. Configuration
error?

Mime
View raw message