cayenne-commits mailing list archives

Site index · List index
Message view « Date » · « Thread »
Top « Date » · « Thread »
From Apache Jenkins Server <jenk...@builds.apache.org>
Subject Build failed in Jenkins: cayenne-31 » hsql,JDK 1.5 (latest),Ubuntu #134
Date Thu, 19 May 2016 11:09:29 GMT
See <https://builds.apache.org/job/cayenne-31/cayenneTestConnection=hsql,jdk=JDK%201.5%20(latest),label=Ubuntu/134/changes>

Changes:

[andrus] CAY-2084 ObjectIdQuery - no cache access polymorphism

[andrus] CAY-2084 ObjectIdQuery - no cache access polymorphism

[andrus] CAY-2084 ObjectIdQuery - no cache access polymorphism

------------------------------------------
[...truncated 11594 lines...]
948/1292 KB   
949/1292 KB   
951/1292 KB   
952/1292 KB   
954/1292 KB   
955/1292 KB   
957/1292 KB   
959/1292 KB   
963/1292 KB   
967/1292 KB   
971/1292 KB   
975/1292 KB   
979/1292 KB   
983/1292 KB   
987/1292 KB   
991/1292 KB   
995/1292 KB   
999/1292 KB   
1003/1292 KB   
1007/1292 KB   
1011/1292 KB   
1015/1292 KB   
1019/1292 KB   
1023/1292 KB   
1026/1292 KB   
1027/1292 KB   
1029/1292 KB   
1030/1292 KB   
1031/1292 KB   
1033/1292 KB   
1034/1292 KB   
1036/1292 KB   
1037/1292 KB   
1039/1292 KB   
1040/1292 KB   
1041/1292 KB   
1044/1292 KB   
1047/1292 KB   
1048/1292 KB   
1052/1292 KB   
1056/1292 KB   
1060/1292 KB   
1064/1292 KB   
1068/1292 KB   
1072/1292 KB   
1076/1292 KB   
1080/1292 KB   
1084/1292 KB   
1088/1292 KB   
1092/1292 KB   
1096/1292 KB   
1100/1292 KB   
1104/1292 KB   
1105/1292 KB   
1106/1292 KB   
1109/1292 KB   
1111/1292 KB   
1112/1292 KB   
1113/1292 KB   
1115/1292 KB   
1116/1292 KB   
1118/1292 KB   
1119/1292 KB   
1121/1292 KB   
1122/1292 KB   
1123/1292 KB   
1125/1292 KB   
1126/1292 KB   
1128/1292 KB   
1129/1292 KB   
1130/1292 KB   
1132/1292 KB   
1133/1292 KB   
1135/1292 KB   
1136/1292 KB   
1138/1292 KB   
1140/1292 KB   
1142/1292 KB   
1146/1292 KB   
1150/1292 KB   
1154/1292 KB   
1158/1292 KB   
1162/1292 KB   
1166/1292 KB   
1170/1292 KB   
1174/1292 KB   
1178/1292 KB   
1182/1292 KB   
1186/1292 KB   
1190/1292 KB   
1194/1292 KB   
1197/1292 KB   
1198/1292 KB   
1200/1292 KB   
1201/1292 KB   
1203/1292 KB   
1204/1292 KB   
1208/1292 KB   
1208/1292 KB   
1210/1292 KB   
1211/1292 KB   
1212/1292 KB   
1214/1292 KB   
1217/1292 KB   
1218/1292 KB   
1220/1292 KB   
1221/1292 KB   
1222/1292 KB   
1224/1292 KB   
1225/1292 KB   
1227/1292 KB   
1228/1292 KB   
1229/1292 KB   
1231/1292 KB   
1232/1292 KB   
1236/1292 KB   
1236/1292 KB   
1239/1292 KB   
1243/1292 KB   
1247/1292 KB   
1251/1292 KB   
1255/1292 KB   
1259/1292 KB   
1263/1292 KB   
1267/1292 KB   
1271/1292 KB   
1275/1292 KB   
1279/1292 KB   
1283/1292 KB   
1287/1292 KB   
1291/1292 KB   
1292/1292 KB   
               
Downloaded: http://maven.objectstyle.org/nexus/content/groups/cayenne-deps/org/apache/ant/ant/1.7.1/ant-1.7.1.jar
(1292 KB at 763.6 KB/sec)
[INFO] Executing tasks
[INFO] Executed tasks
[INFO] 
[INFO] --- maven-resources-plugin:2.4.3:resources (default-resources) @ cayenne-jdk1.5-unpublished
---
[INFO] Using 'UTF-8' encoding to copy filtered resources.
[INFO] Copying 16 resources
[INFO] 
[INFO] --- maven-compiler-plugin:2.3.2:compile (default-compile) @ cayenne-jdk1.5-unpublished
---
[WARNING] File encoding has not been set, using platform encoding ISO-8859-1, i.e. build is
platform dependent!
[INFO] Compiling 942 source files to <https://builds.apache.org/job/cayenne-31/cayenneTestConnection=hsql,jdk=JDK%201.5%20(latest),label=Ubuntu/ws/framework/cayenne-jdk1.5-unpublished/target/classes>
[INFO] 
[INFO] --- maven-resources-plugin:2.4.3:testResources (default-testResources) @ cayenne-jdk1.5-unpublished
---
[INFO] Using 'UTF-8' encoding to copy filtered resources.
[INFO] Copying 96 resources
[INFO] 
[INFO] --- maven-compiler-plugin:2.3.2:testCompile (default-testCompile) @ cayenne-jdk1.5-unpublished
---
[WARNING] File encoding has not been set, using platform encoding ISO-8859-1, i.e. build is
platform dependent!
[INFO] Compiling 959 source files to <https://builds.apache.org/job/cayenne-31/cayenneTestConnection=hsql,jdk=JDK%201.5%20(latest),label=Ubuntu/ws/framework/cayenne-jdk1.5-unpublished/target/test-classes>
[INFO] -------------------------------------------------------------
[ERROR] COMPILATION ERROR : 
[INFO] -------------------------------------------------------------
[ERROR] <https://builds.apache.org/job/cayenne-31/cayenneTestConnection=hsql,jdk=JDK%201.5%20(latest),label=Ubuntu/ws/framework/cayenne-jdk1.5-unpublished/src/test/java/org/apache/cayenne/access/DataContextObjectIdQuery_PolymorphicTest.java>:[55,25]
method does not override a method from its superclass
[ERROR] <https://builds.apache.org/job/cayenne-31/cayenneTestConnection=hsql,jdk=JDK%201.5%20(latest),label=Ubuntu/ws/framework/cayenne-jdk1.5-unpublished/src/test/java/org/apache/cayenne/access/DataContextObjectIdQuery_PolymorphicTest.java>:[76,25]
method does not override a method from its superclass
[INFO] 2 errors 
[INFO] -------------------------------------------------------------
[INFO] ------------------------------------------------------------------------
[INFO] Reactor Summary:
[INFO] 
[INFO] Cayenne ........................................... SUCCESS [10.471s]
[INFO] Common Unit Test Utilities ........................ SUCCESS [33.872s]
[INFO] Cayenne Internal Build Plugin ..................... SUCCESS [46.943s]
[INFO] Cayenne Build Tools Parent ........................ SUCCESS [0.008s]
[INFO] Cayenne License and Notice Bundle ................. SUCCESS [8.230s]
[INFO] Cayenne Dependency Injection Container ............ SUCCESS [3.481s]
[INFO] Cayenne Java 1.5 Unpublished ...................... FAILURE [52.494s]
[INFO] Cayenne WebObjects Compatibility Library .......... SKIPPED
[INFO] Cayenne Aggregated Server Jar ..................... SKIPPED
[INFO] Cayenne Aggregated Client Jar ..................... SKIPPED
[INFO] Cayenne Project ................................... SKIPPED
[INFO] Cayenne Tools ..................................... SKIPPED
[INFO] Library: cayenne-lifecycle ........................ SKIPPED
[INFO] Cayenne Maven Plugin .............................. SKIPPED
[INFO] Cayenne Framework Aggregator Project .............. SKIPPED
[INFO] Cayenne Integration Tests Parent .................. SKIPPED
[INFO] Integration Tests - Cayenne Runtime ............... SKIPPED
[INFO] Integration Tests - Cayenne Tools ................. SKIPPED
[INFO] Cayenne Modeler ................................... SKIPPED
[INFO] Cayenne Modeler Maven Plugin ...................... SKIPPED
[INFO] Cayenne Modeler Generic and Windows Extensions .... SKIPPED
[INFO] Cayenne Modeler Generic ........................... SKIPPED
[INFO] Cayenne Modeler Mac OS X Extensions ............... SKIPPED
[INFO] Cayenne Modeler Mac OS X .......................... SKIPPED
[INFO] Cayenne Modeler Mac OS X - Old Apple Java ......... SKIPPED
[INFO] Cayenne Modeler Windows ........................... SKIPPED
[INFO] Cayenne Modeler Parent ............................ SKIPPED
[INFO] Cayenne Tutorial .................................. SKIPPED
[INFO] Cayenne ROP Server Tutorial ....................... SKIPPED
[INFO] Cayenne ROP Client Tutorial ....................... SKIPPED
[INFO] Cayenne Tutorials ................................. SKIPPED
[INFO] Cayenne Documentation ............................. SKIPPED
[INFO] Cayenne Documenation Parent ....................... SKIPPED
[INFO] Cayenne Docbook Documentation ..................... SKIPPED
[INFO] Docbook: Cayenne Stylesheets ...................... SKIPPED
[INFO] Docbook: Cayenne Guide ............................ SKIPPED
[INFO] Docbook: Getting Started with Cayenne ............. SKIPPED
[INFO] Docbook: Getting Started with Cayenne ROP ......... SKIPPED
[INFO] Docbook: Cayenne New Features and Upgrade Guide ... SKIPPED
[INFO] Cayenne Release Assembly .......................... SKIPPED
[INFO] ------------------------------------------------------------------------
[INFO] BUILD FAILURE
[INFO] ------------------------------------------------------------------------
[INFO] Total time: 2:42.602s
[INFO] Finished at: Thu May 19 11:09:34 GMT 2016
[INFO] Final Memory: 25M/105M
[INFO] ------------------------------------------------------------------------
[ERROR] Failed to execute goal org.apache.maven.plugins:maven-compiler-plugin:2.3.2:testCompile
(default-testCompile) on project cayenne-jdk1.5-unpublished: Compilation failure: Compilation
failure:
[ERROR] <https://builds.apache.org/job/cayenne-31/cayenneTestConnection=hsql,jdk=JDK%201.5%20(latest),label=Ubuntu/ws/framework/cayenne-jdk1.5-unpublished/src/test/java/org/apache/cayenne/access/DataContextObjectIdQuery_PolymorphicTest.java>:[55,25]
method does not override a method from its superclass
[ERROR] <https://builds.apache.org/job/cayenne-31/cayenneTestConnection=hsql,jdk=JDK%201.5%20(latest),label=Ubuntu/ws/framework/cayenne-jdk1.5-unpublished/src/test/java/org/apache/cayenne/access/DataContextObjectIdQuery_PolymorphicTest.java>:[76,25]
method does not override a method from its superclass
[ERROR] -> [Help 1]
org.apache.maven.lifecycle.LifecycleExecutionException: Failed to execute goal org.apache.maven.plugins:maven-compiler-plugin:2.3.2:testCompile
(default-testCompile) on project cayenne-jdk1.5-unpublished: Compilation failure
	at org.apache.maven.lifecycle.internal.MojoExecutor.execute(MojoExecutor.java:213)
	at org.apache.maven.lifecycle.internal.MojoExecutor.execute(MojoExecutor.java:153)
	at org.apache.maven.lifecycle.internal.MojoExecutor.execute(MojoExecutor.java:145)
	at org.apache.maven.lifecycle.internal.LifecycleModuleBuilder.buildProject(LifecycleModuleBuilder.java:84)
	at org.apache.maven.lifecycle.internal.LifecycleModuleBuilder.buildProject(LifecycleModuleBuilder.java:59)
	at org.apache.maven.lifecycle.internal.LifecycleStarter.singleThreadedBuild(LifecycleStarter.java:183)
	at org.apache.maven.lifecycle.internal.LifecycleStarter.execute(LifecycleStarter.java:161)
	at org.apache.maven.DefaultMaven.doExecute(DefaultMaven.java:320)
	at org.apache.maven.DefaultMaven.execute(DefaultMaven.java:156)
	at org.apache.maven.cli.MavenCli.execute(MavenCli.java:537)
	at org.apache.maven.cli.MavenCli.doMain(MavenCli.java:196)
	at org.apache.maven.cli.MavenCli.main(MavenCli.java:141)
	at sun.reflect.NativeMethodAccessorImpl.invoke0(Native Method)
	at sun.reflect.NativeMethodAccessorImpl.invoke(NativeMethodAccessorImpl.java:39)
	at sun.reflect.DelegatingMethodAccessorImpl.invoke(DelegatingMethodAccessorImpl.java:25)
	at java.lang.reflect.Method.invoke(Method.java:592)
	at org.codehaus.plexus.classworlds.launcher.Launcher.launchEnhanced(Launcher.java:290)
	at org.codehaus.plexus.classworlds.launcher.Launcher.launch(Launcher.java:230)
	at org.codehaus.plexus.classworlds.launcher.Launcher.mainWithExitCode(Launcher.java:409)
	at org.codehaus.plexus.classworlds.launcher.Launcher.main(Launcher.java:352)
Caused by: org.apache.maven.plugin.CompilationFailureException: Compilation failure
	at org.apache.maven.plugin.AbstractCompilerMojo.execute(AbstractCompilerMojo.java:656)
	at org.apache.maven.plugin.TestCompilerMojo.execute(TestCompilerMojo.java:161)
	at org.apache.maven.plugin.DefaultBuildPluginManager.executeMojo(DefaultBuildPluginManager.java:101)
	at org.apache.maven.lifecycle.internal.MojoExecutor.execute(MojoExecutor.java:209)
	... 19 more
[ERROR] 
[ERROR] Re-run Maven using the -X switch to enable full debug logging.
[ERROR] 
[ERROR] For more information about the errors and possible solutions, please read the following
articles:
[ERROR] [Help 1] http://cwiki.apache.org/confluence/display/MAVEN/MojoFailureException
[ERROR] 
[ERROR] After correcting the problems, you can resume the build with the command
[ERROR]   mvn <goals> -rf :cayenne-jdk1.5-unpublished
Build step 'Invoke top-level Maven targets' marked build as failure

Mime
View raw message