cayenne-commits mailing list archives

Site index · List index
Message view « Date » · « Thread »
Top « Date » · « Thread »
From Apache Jenkins Server <jenk...@builds.apache.org>
Subject Build failed in Jenkins: cayenne-31 » derby,JDK 1.5 (latest),Ubuntu #127
Date Sat, 09 Apr 2016 09:13:21 GMT
See <https://builds.apache.org/job/cayenne-31/cayenneTestConnection=derby,jdk=JDK%201.5%20(latest),label=Ubuntu/127/changes>

Changes:

[aadamchik] copyright year

[aadamchik] upgrading derby version

[aadamchik] upgrading MySQL driver

------------------------------------------
[...truncated 10267 lines...]
1167/1292 KB   
1171/1292 KB   
1175/1292 KB   
1179/1292 KB   
1183/1292 KB   
1187/1292 KB   
1191/1292 KB   
1195/1292 KB   
1198/1292 KB   
1199/1292 KB   
1201/1292 KB   
1202/1292 KB   
1203/1292 KB   
1205/1292 KB   
1209/1292 KB   
1212/1292 KB   
1213/1292 KB   
1215/1292 KB   
1216/1292 KB   
1220/1292 KB   
1220/1292 KB   
1222/1292 KB   
1226/1292 KB   
1230/1292 KB   
1234/1292 KB   
1234/1292 KB   
1236/1292 KB   
1237/1292 KB   
1240/1292 KB   
1244/1292 KB   
1244/1292 KB   
1248/1292 KB   
1252/1292 KB   
1256/1292 KB   
1257/1292 KB   
1260/1292 KB   
1264/1292 KB   
1268/1292 KB   
1268/1292 KB   
1271/1292 KB   
1275/1292 KB   
1279/1292 KB   
1283/1292 KB   
1287/1292 KB   
1291/1292 KB   
1292/1292 KB   
               
Downloaded: http://maven.objectstyle.org/nexus/content/groups/cayenne-deps/org/apache/ant/ant/1.7.1/ant-1.7.1.jar
(1292 KB at 886.8 KB/sec)
[INFO] Executing tasks
[INFO] Executed tasks
[INFO] 
[INFO] --- maven-resources-plugin:2.4.3:resources (default-resources) @ cayenne-jdk1.5-unpublished
---
[INFO] Using 'UTF-8' encoding to copy filtered resources.
[INFO] Copying 16 resources
[INFO] 
[INFO] --- maven-compiler-plugin:2.3.2:compile (default-compile) @ cayenne-jdk1.5-unpublished
---
[WARNING] File encoding has not been set, using platform encoding ISO-8859-1, i.e. build is
platform dependent!
[INFO] Compiling 942 source files to <https://builds.apache.org/job/cayenne-31/cayenneTestConnection=derby,jdk=JDK%201.5%20(latest),label=Ubuntu/ws/framework/cayenne-jdk1.5-unpublished/target/classes>
[INFO] 
[INFO] --- maven-resources-plugin:2.4.3:testResources (default-testResources) @ cayenne-jdk1.5-unpublished
---
[INFO] Using 'UTF-8' encoding to copy filtered resources.
[INFO] Copying 96 resources
[INFO] 
[INFO] --- maven-compiler-plugin:2.3.2:testCompile (default-testCompile) @ cayenne-jdk1.5-unpublished
---
[WARNING] File encoding has not been set, using platform encoding ISO-8859-1, i.e. build is
platform dependent!
[INFO] Compiling 958 source files to <https://builds.apache.org/job/cayenne-31/cayenneTestConnection=derby,jdk=JDK%201.5%20(latest),label=Ubuntu/ws/framework/cayenne-jdk1.5-unpublished/target/test-classes>
[INFO] 
[INFO] --- maven-surefire-plugin:2.5:test (default-test) @ cayenne-jdk1.5-unpublished ---
[INFO] Surefire report directory: <https://builds.apache.org/job/cayenne-31/cayenneTestConnection=derby,jdk=JDK%201.5%20(latest),label=Ubuntu/ws/framework/cayenne-jdk1.5-unpublished/target/surefire-reports>

-------------------------------------------------------
 T E S T S
-------------------------------------------------------
Running org.apache.cayenne.CayenneDataObjectValidationTest
Apr 9, 2016 9:13:28 AM org.apache.cayenne.unit.di.server.ServerCaseDataSourceInfoProvider
<init>
INFO: Loaded  0 DataSource configurations from properties file
Apr 9, 2016 9:13:28 AM org.apache.cayenne.unit.di.server.ServerCaseDataSourceInfoProvider
get
INFO: Connection key: derby
Apr 9, 2016 9:13:28 AM org.apache.cayenne.unit.di.server.ServerCaseDataSourceInfoProvider
get
INFO: loaded connection info: [org.apache.cayenne.conn.DataSourceInfo:
   user name: sa
   password: **********
   driver: org.apache.derby.jdbc.EmbeddedDriver
   db adapter class: org.apache.cayenne.dba.derby.DerbyAdapter
   url: jdbc:derby:target/testdb;create=true
   min. connections: 1
   max. connections: 1
]
org.apache.maven.surefire.booter.SurefireExecutionException: org.apache.cayenne.CayenneDataObjectValidationTest;
nested exception is java.lang.ExceptionInInitializerError: null; nested exception is org.apache.maven.surefire.testset.TestSetFailedException:
org.apache.cayenne.CayenneDataObjectValidationTest; nested exception is java.lang.ExceptionInInitializerError:
null
org.apache.maven.surefire.testset.TestSetFailedException: org.apache.cayenne.CayenneDataObjectValidationTest;
nested exception is java.lang.ExceptionInInitializerError: null
java.lang.ExceptionInInitializerError
	at sun.reflect.NativeConstructorAccessorImpl.newInstance0(Native Method)
	at sun.reflect.NativeConstructorAccessorImpl.newInstance(NativeConstructorAccessorImpl.java:39)
	at sun.reflect.DelegatingConstructorAccessorImpl.newInstance(DelegatingConstructorAccessorImpl.java:27)
	at java.lang.reflect.Constructor.newInstance(Constructor.java:501)
	at junit.framework.TestSuite.createTest(TestSuite.java:131)
	at junit.framework.TestSuite.addTestMethod(TestSuite.java:114)
	at junit.framework.TestSuite.<init>(TestSuite.java:75)
	at sun.reflect.NativeConstructorAccessorImpl.newInstance0(Native Method)
	at sun.reflect.NativeConstructorAccessorImpl.newInstance(NativeConstructorAccessorImpl.java:39)
	at sun.reflect.DelegatingConstructorAccessorImpl.newInstance(DelegatingConstructorAccessorImpl.java:27)
	at java.lang.reflect.Constructor.newInstance(Constructor.java:501)
	at org.apache.maven.surefire.junit.JUnitTestSet.constructTestObject(JUnitTestSet.java:151)
	at org.apache.maven.surefire.junit.JUnitTestSet.execute(JUnitTestSet.java:197)
	at org.apache.maven.surefire.suite.AbstractDirectoryTestSuite.executeTestSet(AbstractDirectoryTestSuite.java:115)
	at org.apache.maven.surefire.suite.AbstractDirectoryTestSuite.execute(AbstractDirectoryTestSuite.java:102)
	at org.apache.maven.surefire.Surefire.run(Surefire.java:180)
	at sun.reflect.NativeMethodAccessorImpl.invoke0(Native Method)
	at sun.reflect.NativeMethodAccessorImpl.invoke(NativeMethodAccessorImpl.java:39)
	at sun.reflect.DelegatingMethodAccessorImpl.invoke(DelegatingMethodAccessorImpl.java:25)
	at java.lang.reflect.Method.invoke(Method.java:592)
	at org.apache.maven.surefire.booter.SurefireBooter.runSuitesInProcess(SurefireBooter.java:350)
	at org.apache.maven.surefire.booter.SurefireBooter.main(SurefireBooter.java:1021)
Caused by: org.apache.cayenne.ConfigurationException: [v.3.1.1-SNAPSHOT Apr 09 2016 09:12:45]
Error instantiating class 'org.apache.cayenne.unit.di.server.ServerCaseDataSourceFactory'
	at org.apache.cayenne.di.spi.ConstructorInjectingProvider.get(ConstructorInjectingProvider.java:167)
	at org.apache.cayenne.di.spi.FieldInjectingProvider.get(FieldInjectingProvider.java:42)
	at org.apache.cayenne.di.spi.DefaultScopeProvider.get(DefaultScopeProvider.java:49)
	at org.apache.cayenne.di.spi.DefaultInjector.getInstance(DefaultInjector.java:107)
	at org.apache.cayenne.di.spi.ConstructorInjectingProvider.get(ConstructorInjectingProvider.java:155)
	at org.apache.cayenne.di.spi.FieldInjectingProvider.get(FieldInjectingProvider.java:42)
	at org.apache.cayenne.di.spi.DefaultScopeProvider.get(DefaultScopeProvider.java:49)
	at org.apache.cayenne.di.spi.DefaultInjector.getInstance(DefaultInjector.java:103)
	at org.apache.cayenne.unit.di.server.ServerCase.<clinit>(ServerCase.java:46)
	... 22 more
Caused by: java.lang.reflect.InvocationTargetException
	at sun.reflect.NativeConstructorAccessorImpl.newInstance0(Native Method)
	at sun.reflect.NativeConstructorAccessorImpl.newInstance(NativeConstructorAccessorImpl.java:39)
	at sun.reflect.DelegatingConstructorAccessorImpl.newInstance(DelegatingConstructorAccessorImpl.java:27)
	at java.lang.reflect.Constructor.newInstance(Constructor.java:501)
	at org.apache.cayenne.di.spi.ConstructorInjectingProvider.get(ConstructorInjectingProvider.java:164)
	... 30 more
Caused by: java.lang.UnsupportedClassVersionError: Bad version number in .class file
	at java.lang.ClassLoader.defineClass1(Native Method)
	at java.lang.ClassLoader.defineClass(ClassLoader.java:621)
	at java.security.SecureClassLoader.defineClass(SecureClassLoader.java:124)
	at java.net.URLClassLoader.defineClass(URLClassLoader.java:260)
	at java.net.URLClassLoader.access$100(URLClassLoader.java:56)
	at java.net.URLClassLoader$1.run(URLClassLoader.java:195)
	at java.security.AccessController.doPrivileged(Native Method)
	at java.net.URLClassLoader.findClass(URLClassLoader.java:188)
	at java.lang.ClassLoader.loadClass(ClassLoader.java:307)
	at sun.misc.Launcher$AppClassLoader.loadClass(Launcher.java:268)
	at java.lang.ClassLoader.loadClass(ClassLoader.java:252)
	at java.lang.ClassLoader.loadClassInternal(ClassLoader.java:320)
	at java.lang.Class.forName0(Native Method)
	at java.lang.Class.forName(Class.java:242)
	at org.apache.cayenne.di.spi.DefaultAdhocObjectFactory.getJavaClass(DefaultAdhocObjectFactory.java:102)
	at org.apache.cayenne.util.Util.getJavaClass(Util.java:681)
	at org.apache.cayenne.conn.DriverDataSource.loadDriver(DriverDataSource.java:59)
	at org.apache.cayenne.conn.DriverDataSource.setDriverClassName(DriverDataSource.java:256)
	at org.apache.cayenne.conn.DriverDataSource.<init>(DriverDataSource.java:101)
	at org.apache.cayenne.conn.DriverDataSource.<init>(DriverDataSource.java:87)
	at org.apache.cayenne.conn.PoolDataSource.<init>(PoolDataSource.java:50)
	at org.apache.cayenne.unit.di.server.ServerCaseDataSourceFactory.createDataSource(ServerCaseDataSourceFactory.java:72)
	at org.apache.cayenne.unit.di.server.ServerCaseDataSourceFactory.<init>(ServerCaseDataSourceFactory.java:49)
	... 35 more
[INFO] ------------------------------------------------------------------------
[INFO] Reactor Summary:
[INFO] 
[INFO] Cayenne ........................................... SUCCESS [11.227s]
[INFO] Common Unit Test Utilities ........................ SUCCESS [35.326s]
[INFO] Cayenne Internal Build Plugin ..................... SUCCESS [44.952s]
[INFO] Cayenne Build Tools Parent ........................ SUCCESS [0.006s]
[INFO] Cayenne License and Notice Bundle ................. SUCCESS [7.793s]
[INFO] Cayenne Dependency Injection Container ............ SUCCESS [2.755s]
[INFO] Cayenne Java 1.5 Unpublished ...................... FAILURE [39.444s]
[INFO] Cayenne WebObjects Compatibility Library .......... SKIPPED
[INFO] Cayenne Aggregated Server Jar ..................... SKIPPED
[INFO] Cayenne Aggregated Client Jar ..................... SKIPPED
[INFO] Cayenne Project ................................... SKIPPED
[INFO] Cayenne Tools ..................................... SKIPPED
[INFO] Library: cayenne-lifecycle ........................ SKIPPED
[INFO] Cayenne Maven Plugin .............................. SKIPPED
[INFO] Cayenne Framework Aggregator Project .............. SKIPPED
[INFO] Cayenne Integration Tests Parent .................. SKIPPED
[INFO] Integration Tests - Cayenne Runtime ............... SKIPPED
[INFO] Integration Tests - Cayenne Tools ................. SKIPPED
[INFO] Cayenne Modeler ................................... SKIPPED
[INFO] Cayenne Modeler Maven Plugin ...................... SKIPPED
[INFO] Cayenne Modeler Generic and Windows Extensions .... SKIPPED
[INFO] Cayenne Modeler Generic ........................... SKIPPED
[INFO] Cayenne Modeler Mac OS X Extensions ............... SKIPPED
[INFO] Cayenne Modeler Mac OS X .......................... SKIPPED
[INFO] Cayenne Modeler Mac OS X - Old Apple Java ......... SKIPPED
[INFO] Cayenne Modeler Windows ........................... SKIPPED
[INFO] Cayenne Modeler Parent ............................ SKIPPED
[INFO] Cayenne Tutorial .................................. SKIPPED
[INFO] Cayenne ROP Server Tutorial ....................... SKIPPED
[INFO] Cayenne ROP Client Tutorial ....................... SKIPPED
[INFO] Cayenne Tutorials ................................. SKIPPED
[INFO] Cayenne Documentation ............................. SKIPPED
[INFO] Cayenne Documenation Parent ....................... SKIPPED
[INFO] Cayenne Docbook Documentation ..................... SKIPPED
[INFO] Docbook: Cayenne Stylesheets ...................... SKIPPED
[INFO] Docbook: Cayenne Guide ............................ SKIPPED
[INFO] Docbook: Getting Started with Cayenne ............. SKIPPED
[INFO] Docbook: Getting Started with Cayenne ROP ......... SKIPPED
[INFO] Docbook: Cayenne New Features and Upgrade Guide ... SKIPPED
[INFO] Cayenne Release Assembly .......................... SKIPPED
[INFO] ------------------------------------------------------------------------
[INFO] BUILD FAILURE
[INFO] ------------------------------------------------------------------------
[INFO] Total time: 2:28.594s
[INFO] Finished at: Sat Apr 09 09:13:28 UTC 2016
[INFO] Final Memory: 25M/112M
[INFO] ------------------------------------------------------------------------
[ERROR] Failed to execute goal org.apache.maven.plugins:maven-surefire-plugin:2.5:test (default-test)
on project cayenne-jdk1.5-unpublished: There are test failures.
[ERROR] 
[ERROR] Please refer to <https://builds.apache.org/job/cayenne-31/cayenneTestConnection=derby,jdk=JDK%201.5%20(latest),label=Ubuntu/ws/framework/cayenne-jdk1.5-unpublished/target/surefire-reports>
for the individual test results.
[ERROR] -> [Help 1]
org.apache.maven.lifecycle.LifecycleExecutionException: Failed to execute goal org.apache.maven.plugins:maven-surefire-plugin:2.5:test
(default-test) on project cayenne-jdk1.5-unpublished: There are test failures.

Please refer to <https://builds.apache.org/job/cayenne-31/cayenneTestConnection=derby,jdk=JDK%201.5%20(latest),label=Ubuntu/ws/framework/cayenne-jdk1.5-unpublished/target/surefire-reports>
for the individual test results.
	at org.apache.maven.lifecycle.internal.MojoExecutor.execute(MojoExecutor.java:213)
	at org.apache.maven.lifecycle.internal.MojoExecutor.execute(MojoExecutor.java:153)
	at org.apache.maven.lifecycle.internal.MojoExecutor.execute(MojoExecutor.java:145)
	at org.apache.maven.lifecycle.internal.LifecycleModuleBuilder.buildProject(LifecycleModuleBuilder.java:84)
	at org.apache.maven.lifecycle.internal.LifecycleModuleBuilder.buildProject(LifecycleModuleBuilder.java:59)
	at org.apache.maven.lifecycle.internal.LifecycleStarter.singleThreadedBuild(LifecycleStarter.java:183)
	at org.apache.maven.lifecycle.internal.LifecycleStarter.execute(LifecycleStarter.java:161)
	at org.apache.maven.DefaultMaven.doExecute(DefaultMaven.java:320)
	at org.apache.maven.DefaultMaven.execute(DefaultMaven.java:156)
	at org.apache.maven.cli.MavenCli.execute(MavenCli.java:537)
	at org.apache.maven.cli.MavenCli.doMain(MavenCli.java:196)
	at org.apache.maven.cli.MavenCli.main(MavenCli.java:141)
	at sun.reflect.NativeMethodAccessorImpl.invoke0(Native Method)
	at sun.reflect.NativeMethodAccessorImpl.invoke(NativeMethodAccessorImpl.java:39)
	at sun.reflect.DelegatingMethodAccessorImpl.invoke(DelegatingMethodAccessorImpl.java:25)
	at java.lang.reflect.Method.invoke(Method.java:592)
	at org.codehaus.plexus.classworlds.launcher.Launcher.launchEnhanced(Launcher.java:290)
	at org.codehaus.plexus.classworlds.launcher.Launcher.launch(Launcher.java:230)
	at org.codehaus.plexus.classworlds.launcher.Launcher.mainWithExitCode(Launcher.java:409)
	at org.codehaus.plexus.classworlds.launcher.Launcher.main(Launcher.java:352)
Caused by: org.apache.maven.plugin.MojoFailureException: There are test failures.

Please refer to <https://builds.apache.org/job/cayenne-31/cayenneTestConnection=derby,jdk=JDK%201.5%20(latest),label=Ubuntu/ws/framework/cayenne-jdk1.5-unpublished/target/surefire-reports>
for the individual test results.
	at org.apache.maven.plugin.surefire.SurefirePlugin.execute(SurefirePlugin.java:629)
	at org.apache.maven.plugin.DefaultBuildPluginManager.executeMojo(DefaultBuildPluginManager.java:101)
	at org.apache.maven.lifecycle.internal.MojoExecutor.execute(MojoExecutor.java:209)
	... 19 more
[ERROR] 
[ERROR] Re-run Maven using the -X switch to enable full debug logging.
[ERROR] 
[ERROR] For more information about the errors and possible solutions, please read the following
articles:
[ERROR] [Help 1] http://cwiki.apache.org/confluence/display/MAVEN/MojoFailureException
[ERROR] 
[ERROR] After correcting the problems, you can resume the build with the command
[ERROR]   mvn <goals> -rf :cayenne-jdk1.5-unpublished
Build step 'Invoke top-level Maven targets' marked build as failure

Mime
View raw message