cayenne-commits mailing list archives

Site index · List index
Message view « Date » · « Thread »
Top « Date » · « Thread »
From Apache Jenkins Server <jenk...@builds.apache.org>
Subject Build failed in Jenkins: cayenne-31 » hsql,latest1.8,Ubuntu #129
Date Sat, 09 Apr 2016 10:13:03 GMT
See <https://builds.apache.org/job/cayenne-31/cayenneTestConnection=hsql,jdk=latest1.8,label=Ubuntu/129/changes>

Changes:

[aadamchik] back to old derby. Derby 10.12 doesn't support java 5

------------------------------------------
[...truncated 124072 lines...]
    void log(String message);
         ^
<https://builds.apache.org/job/cayenne-31/cayenneTestConnection=hsql,jdk=latest1.8,label=Ubuntu/ws/docs/doc/target/sources/org/apache/cayenne/log/JdbcEventLogger.java>:41:
warning: no @param for dataSource
    void logConnect(String dataSource);
         ^
<https://builds.apache.org/job/cayenne-31/cayenneTestConnection=hsql,jdk=latest1.8,label=Ubuntu/ws/docs/doc/target/sources/org/apache/cayenne/log/JdbcEventLogger.java>:48:
warning: no @param for dsi
    void logPoolCreated(DataSourceInfo dsi);
         ^
<https://builds.apache.org/job/cayenne-31/cayenneTestConnection=hsql,jdk=latest1.8,label=Ubuntu/ws/docs/doc/target/sources/org/apache/cayenne/log/JdbcEventLogger.java>:81:
warning: no @return
    boolean isLoggable();
            ^
<https://builds.apache.org/job/cayenne-31/cayenneTestConnection=hsql,jdk=latest1.8,label=Ubuntu/ws/docs/doc/target/sources/org/apache/cayenne/reflect/Accessor.java>:35:
warning: no @return
    String getName();
           ^
<https://builds.apache.org/job/cayenne-31/cayenneTestConnection=hsql,jdk=latest1.8,label=Ubuntu/ws/docs/doc/target/sources/org/apache/cayenne/reflect/Accessor.java>:40:
warning: no @param for object
    Object getValue(Object object) throws PropertyException;
           ^
<https://builds.apache.org/job/cayenne-31/cayenneTestConnection=hsql,jdk=latest1.8,label=Ubuntu/ws/docs/doc/target/sources/org/apache/cayenne/reflect/Accessor.java>:40:
warning: no @return
    Object getValue(Object object) throws PropertyException;
           ^
<https://builds.apache.org/job/cayenne-31/cayenneTestConnection=hsql,jdk=latest1.8,label=Ubuntu/ws/docs/doc/target/sources/org/apache/cayenne/reflect/Accessor.java>:46:
warning: no @param for object
    void setValue(Object object, Object newValue) throws PropertyException;
         ^
<https://builds.apache.org/job/cayenne-31/cayenneTestConnection=hsql,jdk=latest1.8,label=Ubuntu/ws/docs/doc/target/sources/org/apache/cayenne/reflect/Accessor.java>:46:
warning: no @param for newValue
    void setValue(Object object, Object newValue) throws PropertyException;
         ^
<https://builds.apache.org/job/cayenne-31/cayenneTestConnection=hsql,jdk=latest1.8,label=Ubuntu/ws/docs/doc/target/sources/org/apache/cayenne/reflect/ArcProperty.java>:37:
warning: no @return
    ObjRelationship getRelationship();
                    ^
<https://builds.apache.org/job/cayenne-31/cayenneTestConnection=hsql,jdk=latest1.8,label=Ubuntu/ws/docs/doc/target/sources/org/apache/cayenne/reflect/ArcProperty.java>:42:
warning: no @return
    ArcProperty getComplimentaryReverseArc();
                ^
<https://builds.apache.org/job/cayenne-31/cayenneTestConnection=hsql,jdk=latest1.8,label=Ubuntu/ws/docs/doc/target/sources/org/apache/cayenne/reflect/ArcProperty.java>:51:
warning: no @return
    ClassDescriptor getTargetDescriptor();
                    ^
<https://builds.apache.org/job/cayenne-31/cayenneTestConnection=hsql,jdk=latest1.8,label=Ubuntu/ws/docs/doc/target/sources/org/apache/cayenne/reflect/ArcProperty.java>:58:
warning: no @return
    boolean isFault(Object source);
            ^
<https://builds.apache.org/job/cayenne-31/cayenneTestConnection=hsql,jdk=latest1.8,label=Ubuntu/ws/docs/doc/target/sources/org/apache/cayenne/reflect/ArcProperty.java>:65:
warning: no @param for object
    void invalidate(Object object);
         ^
<https://builds.apache.org/job/cayenne-31/cayenneTestConnection=hsql,jdk=latest1.8,label=Ubuntu/ws/docs/doc/target/sources/org/apache/cayenne/reflect/Property.java>:33:
warning: no @return
    String getName();
           ^
<https://builds.apache.org/job/cayenne-31/cayenneTestConnection=hsql,jdk=latest1.8,label=Ubuntu/ws/docs/doc/target/sources/org/apache/cayenne/reflect/Property.java>:38:
warning: no @param for object
    Object readPropertyDirectly(Object object) throws PropertyException;
           ^
<https://builds.apache.org/job/cayenne-31/cayenneTestConnection=hsql,jdk=latest1.8,label=Ubuntu/ws/docs/doc/target/sources/org/apache/cayenne/reflect/Property.java>:38:
warning: no @return
    Object readPropertyDirectly(Object object) throws PropertyException;
           ^
<https://builds.apache.org/job/cayenne-31/cayenneTestConnection=hsql,jdk=latest1.8,label=Ubuntu/ws/docs/doc/target/sources/org/apache/cayenne/reflect/Property.java>:43:
warning: no @param for object
    Object readProperty(Object object) throws PropertyException;
           ^
<https://builds.apache.org/job/cayenne-31/cayenneTestConnection=hsql,jdk=latest1.8,label=Ubuntu/ws/docs/doc/target/sources/org/apache/cayenne/reflect/Property.java>:43:
warning: no @return
    Object readProperty(Object object) throws PropertyException;
           ^
<https://builds.apache.org/job/cayenne-31/cayenneTestConnection=hsql,jdk=latest1.8,label=Ubuntu/ws/docs/doc/target/sources/org/apache/cayenne/reflect/Property.java>:50:
warning: no @param for object
    void writePropertyDirectly(Object object, Object oldValue, Object newValue)
         ^
<https://builds.apache.org/job/cayenne-31/cayenneTestConnection=hsql,jdk=latest1.8,label=Ubuntu/ws/docs/doc/target/sources/org/apache/cayenne/reflect/Property.java>:50:
warning: no @param for oldValue
    void writePropertyDirectly(Object object, Object oldValue, Object newValue)
         ^
<https://builds.apache.org/job/cayenne-31/cayenneTestConnection=hsql,jdk=latest1.8,label=Ubuntu/ws/docs/doc/target/sources/org/apache/cayenne/reflect/Property.java>:50:
warning: no @param for newValue
    void writePropertyDirectly(Object object, Object oldValue, Object newValue)
         ^
<https://builds.apache.org/job/cayenne-31/cayenneTestConnection=hsql,jdk=latest1.8,label=Ubuntu/ws/docs/doc/target/sources/org/apache/cayenne/reflect/Property.java>:57:
warning: no @param for object
    void writeProperty(Object object, Object oldValue, Object newValue)
         ^
<https://builds.apache.org/job/cayenne-31/cayenneTestConnection=hsql,jdk=latest1.8,label=Ubuntu/ws/docs/doc/target/sources/org/apache/cayenne/reflect/Property.java>:57:
warning: no @param for oldValue
    void writeProperty(Object object, Object oldValue, Object newValue)
         ^
<https://builds.apache.org/job/cayenne-31/cayenneTestConnection=hsql,jdk=latest1.8,label=Ubuntu/ws/docs/doc/target/sources/org/apache/cayenne/reflect/Property.java>:57:
warning: no @param for newValue
    void writeProperty(Object object, Object oldValue, Object newValue)
         ^
<https://builds.apache.org/job/cayenne-31/cayenneTestConnection=hsql,jdk=latest1.8,label=Ubuntu/ws/docs/doc/target/sources/org/apache/cayenne/access/DataContext.java>:452:
error: unknown tag: T
     * @deprecated Use objectFromDataRow(Class<T> objectClass, DataRow dataRow) instead.
                                              ^
<https://builds.apache.org/job/cayenne-31/cayenneTestConnection=hsql,jdk=latest1.8,label=Ubuntu/ws/docs/doc/target/sources/org/apache/cayenne/access/DataContext.java>:537:
error: self-closing element not allowed
     * <p/>
       ^
<https://builds.apache.org/job/cayenne-31/cayenneTestConnection=hsql,jdk=latest1.8,label=Ubuntu/ws/docs/doc/target/sources/org/apache/cayenne/access/DataContext.java>:574:
error: self-closing element not allowed
     * <p/>
       ^
<https://builds.apache.org/job/cayenne-31/cayenneTestConnection=hsql,jdk=latest1.8,label=Ubuntu/ws/docs/doc/target/sources/org/apache/cayenne/ObjectContext.java>:183:
error: ')' missing in reference
     * {@link #rollbackChanges()()}, but rollback is local to this context and no
       ^
<https://builds.apache.org/job/cayenne-31/cayenneTestConnection=hsql,jdk=latest1.8,label=Ubuntu/ws/docs/doc/target/sources/org/apache/cayenne/access/QueryLogger.java>:56:
error: unexpected end tag: </p>
     * routines. In particular it will trim large values to avoid flooding the logs. </p>
                                                                                     ^
<https://builds.apache.org/job/cayenne-31/cayenneTestConnection=hsql,jdk=latest1.8,label=Ubuntu/ws/docs/doc/target/sources/org/apache/cayenne/access/QueryResult.java>:69:
error: element not closed: code
     * Returns the first update count for the query. This is a shortcut for <code>(Integer)getUpdates(query).get(0)<code>,
kind of like Google's "I'm feeling lucky".
                                                                                         
                         ^
<https://builds.apache.org/job/cayenne-31/cayenneTestConnection=hsql,jdk=latest1.8,label=Ubuntu/ws/docs/doc/target/sources/org/apache/cayenne/access/QueryResult.java>:69:
error: element not closed: code
     * Returns the first update count for the query. This is a shortcut for <code>(Integer)getUpdates(query).get(0)<code>,
kind of like Google's "I'm feeling lucky".
                                                                            ^
<https://builds.apache.org/job/cayenne-31/cayenneTestConnection=hsql,jdk=latest1.8,label=Ubuntu/ws/docs/doc/target/sources/org/apache/cayenne/access/QueryResult.java>:126:
error: element not closed: code
     * Returns the first results for the query. This is a shortcut for <code>(List)getRows(query).get(0)<code>,
kind of like Google's "I'm feeling lucky".
                                                                                         
              ^
<https://builds.apache.org/job/cayenne-31/cayenneTestConnection=hsql,jdk=latest1.8,label=Ubuntu/ws/docs/doc/target/sources/org/apache/cayenne/access/QueryResult.java>:126:
error: element not closed: code
     * Returns the first results for the query. This is a shortcut for <code>(List)getRows(query).get(0)<code>,
kind of like Google's "I'm feeling lucky".
                                                                       ^
<https://builds.apache.org/job/cayenne-31/cayenneTestConnection=hsql,jdk=latest1.8,label=Ubuntu/ws/docs/doc/target/sources/org/apache/cayenne/access/trans/QueryAssemblerHelper.java>:115:
error: unexpected end tag: </p>
     * access to this common method in order not to repeat this code. </p>
                                                                      ^
<https://builds.apache.org/job/cayenne-31/cayenneTestConnection=hsql,jdk=latest1.8,label=Ubuntu/ws/docs/doc/target/sources/org/apache/cayenne/dba/oracle/OracleQualifierTranslator.java>:37:
error: malformed HTML
 * an OR-set of INs with <= 1000 elements
                         ^
<https://builds.apache.org/job/cayenne-31/cayenneTestConnection=hsql,jdk=latest1.8,label=Ubuntu/ws/docs/doc/target/sources/org/apache/cayenne/remote/service/BaseRemoteService.java>:175:
error: self-closing element not allowed
     * <p/>
       ^
<https://builds.apache.org/job/cayenne-31/cayenneTestConnection=hsql,jdk=latest1.8,label=Ubuntu/ws/docs/doc/target/sources/org/apache/cayenne/remote/hessian/service/HessianServlet.java>:34:
error: reference not found
 * {@link HessianServletConfigurator}.
          ^
<https://builds.apache.org/job/cayenne-31/cayenneTestConnection=hsql,jdk=latest1.8,label=Ubuntu/ws/docs/doc/target/sources/org/apache/cayenne/dba/sqlserver/SQLServerAdapter.java>:39:
error: malformed HTML
 * Cayenne DbAdapter implementation for <a href="http://www.microsoft.com/sql/"Microsoft
                                        ^
<https://builds.apache.org/job/cayenne-31/cayenneTestConnection=hsql,jdk=latest1.8,label=Ubuntu/ws/docs/doc/target/sources/org/apache/cayenne/dba/sqlserver/SQLServerAdapter.java>:40:
error: unexpected end tag: </a>
 * SQL Server </a> engine. </p> <h3>Microsoft Driver Settings</h3>
              ^
<https://builds.apache.org/job/cayenne-31/cayenneTestConnection=hsql,jdk=latest1.8,label=Ubuntu/ws/docs/doc/target/sources/org/apache/cayenne/dba/sqlserver/SQLServerAdapter.java>:40:
error: unexpected end tag: </p>
 * SQL Server </a> engine. </p> <h3>Microsoft Driver Settings</h3>
                           ^
<https://builds.apache.org/job/cayenne-31/cayenneTestConnection=hsql,jdk=latest1.8,label=Ubuntu/ws/docs/doc/target/sources/org/apache/cayenne/query/SQLTemplate.java>:564:
error: self-closing element not allowed
     * <p/>
       ^
<https://builds.apache.org/job/cayenne-31/cayenneTestConnection=hsql,jdk=latest1.8,label=Ubuntu/ws/docs/doc/target/sources/org/apache/cayenne/cache/QueryCache.java>:48:
error: self-closing element not allowed
     * <p/>
       ^
<https://builds.apache.org/job/cayenne-31/cayenneTestConnection=hsql,jdk=latest1.8,label=Ubuntu/ws/docs/doc/target/sources/org/apache/cayenne/configuration/Constants.java>:32:
error: malformed HTML
     * A DI container key for the Map<String, String> storing properties used by built-in
                                     ^
<https://builds.apache.org/job/cayenne-31/cayenneTestConnection=hsql,jdk=latest1.8,label=Ubuntu/ws/docs/doc/target/sources/org/apache/cayenne/configuration/Constants.java>:32:
error: bad use of '>'
     * A DI container key for the Map<String, String> storing properties used by built-in
                                                    ^
<https://builds.apache.org/job/cayenne-31/cayenneTestConnection=hsql,jdk=latest1.8,label=Ubuntu/ws/docs/doc/target/sources/org/apache/cayenne/configuration/Constants.java>:38:
error: unknown tag: DbAdapterDetector
     * A DI container key for the List<DbAdapterDetector> that contains objects that
can
                                      ^
<https://builds.apache.org/job/cayenne-31/cayenneTestConnection=hsql,jdk=latest1.8,label=Ubuntu/ws/docs/doc/target/sources/org/apache/cayenne/configuration/Constants.java>:55:
error: unknown tag: ExtendedType
     * A DI container key for the List<ExtendedType> storing default adapter-agnostic
                                      ^
<https://builds.apache.org/job/cayenne-31/cayenneTestConnection=hsql,jdk=latest1.8,label=Ubuntu/ws/docs/doc/target/sources/org/apache/cayenne/configuration/Constants.java>:44:
error: unknown tag: DataChannelFilter
     * A DI container key for the List<DataChannelFilter> storing DataDomain filters.
                                      ^
<https://builds.apache.org/job/cayenne-31/cayenneTestConnection=hsql,jdk=latest1.8,label=Ubuntu/ws/docs/doc/target/sources/org/apache/cayenne/configuration/Constants.java>:49:
error: unknown tag: String
     * A DI container key for the List<String> storing locations of the one of more
                                      ^
<https://builds.apache.org/job/cayenne-31/cayenneTestConnection=hsql,jdk=latest1.8,label=Ubuntu/ws/docs/doc/target/sources/org/apache/cayenne/configuration/Constants.java>:73:
error: malformed HTML
     * A server-side DI container key for the Map<String, String> storing event bridge
                                                 ^
<https://builds.apache.org/job/cayenne-31/cayenneTestConnection=hsql,jdk=latest1.8,label=Ubuntu/ws/docs/doc/target/sources/org/apache/cayenne/configuration/Constants.java>:73:
error: bad use of '>'
     * A server-side DI container key for the Map<String, String> storing event bridge
                                                                ^
<https://builds.apache.org/job/cayenne-31/cayenneTestConnection=hsql,jdk=latest1.8,label=Ubuntu/ws/docs/doc/target/sources/org/apache/cayenne/configuration/Constants.java>:67:
error: unknown tag: ExtendedTypeFactory
     * A DI container key for the List<ExtendedTypeFactory> storing default and
                                      ^
<https://builds.apache.org/job/cayenne-31/cayenneTestConnection=hsql,jdk=latest1.8,label=Ubuntu/ws/docs/doc/target/sources/org/apache/cayenne/configuration/Constants.java>:61:
error: unknown tag: ExtendedType
     * A DI container key for the List<ExtendedType> storing a user-provided
                                      ^
<https://builds.apache.org/job/cayenne-31/cayenneTestConnection=hsql,jdk=latest1.8,label=Ubuntu/ws/docs/doc/target/sources/org/apache/cayenne/configuration/DataNodeDescriptor.java>:151:
error: reference not found
     * {@link DataSourceFactory} to configure a DataSource. E.g. JNDIDataSoirceFactory may
              ^
<https://builds.apache.org/job/cayenne-31/cayenneTestConnection=hsql,jdk=latest1.8,label=Ubuntu/ws/docs/doc/target/sources/org/apache/cayenne/configuration/DataNodeDescriptor.java>:160:
error: reference not found
     * {@link DataSourceFactory} to configure a DataSource. E.g. JNDIDataSoirceFactory may
              ^
<https://builds.apache.org/job/cayenne-31/cayenneTestConnection=hsql,jdk=latest1.8,label=Ubuntu/ws/docs/doc/target/sources/org/apache/cayenne/dba/mysql/MySQLAdapter.java>:63:
error: reference not found
 * {@link org.apache.cayenne.dba.JdbcAdapter#supportsFkConstraints()} will return false.
          ^
<https://builds.apache.org/job/cayenne-31/cayenneTestConnection=hsql,jdk=latest1.8,label=Ubuntu/ws/docs/doc/target/sources/org/apache/cayenne/exp/parser/PatternMatchNode.java>:54:
error: end tag missing: </code>
     * query as <code>...(t0.foo LIKE ? {escape '|'}) where the
                ^
<https://builds.apache.org/job/cayenne-31/cayenneTestConnection=hsql,jdk=latest1.8,label=Ubuntu/ws/docs/doc/target/sources/org/apache/cayenne/exp/parser/ParseException.java>:46:
error: unknown tag: result
   *     ParseException: <result of getMessage>
                         ^
<https://builds.apache.org/job/cayenne-31/cayenneTestConnection=hsql,jdk=latest1.8,label=Ubuntu/ws/docs/doc/target/sources/org/apache/cayenne/di/Binder.java>:47:
error: malformed HTML
     * Starts a binding of a java.util.Map<String, ?> distinguished by its binding name.
                                          ^
<https://builds.apache.org/job/cayenne-31/cayenneTestConnection=hsql,jdk=latest1.8,label=Ubuntu/ws/docs/doc/target/sources/org/apache/cayenne/di/Binder.java>:47:
error: bad use of '>'
     * Starts a binding of a java.util.Map<String, ?> distinguished by its binding name.
                                                    ^
<https://builds.apache.org/job/cayenne-31/cayenneTestConnection=hsql,jdk=latest1.8,label=Ubuntu/ws/docs/doc/target/sources/org/apache/cayenne/di/Binder.java>:55:
error: malformed HTML
     * Starts a binding of a java.util.List<?> distinguished by its binding name. List
                                           ^
<https://builds.apache.org/job/cayenne-31/cayenneTestConnection=hsql,jdk=latest1.8,label=Ubuntu/ws/docs/doc/target/sources/org/apache/cayenne/di/Binder.java>:55:
error: bad use of '>'
     * Starts a binding of a java.util.List<?> distinguished by its binding name. List
                                             ^
<https://builds.apache.org/job/cayenne-31/cayenneTestConnection=hsql,jdk=latest1.8,label=Ubuntu/ws/docs/doc/target/sources/org/apache/cayenne/di/MapBuilder.java>:26:
error: malformed HTML
 * A binding builder for map configurations. Creates a parameterized map of type <String,
                                                                                 ^
<https://builds.apache.org/job/cayenne-31/cayenneTestConnection=hsql,jdk=latest1.8,label=Ubuntu/ws/docs/doc/target/sources/org/apache/cayenne/di/MapBuilder.java>:27:
error: bad use of '>'
 * T>.
    ^
<https://builds.apache.org/job/cayenne-31/cayenneTestConnection=hsql,jdk=latest1.8,label=Ubuntu/ws/docs/doc/target/sources/org/apache/cayenne/access/jdbc/BindDirective.java>:52:
error: bad use of '>'
 * <code>"WHERE SOME_COLUMN > #bind($xyz)"</code> produces
                            ^
<https://builds.apache.org/job/cayenne-31/cayenneTestConnection=hsql,jdk=latest1.8,label=Ubuntu/ws/docs/doc/target/sources/org/apache/cayenne/access/jdbc/BindDirective.java>:53:
error: bad use of '>'
 * <code>"WHERE SOME_COLUMN > ?"</code> and also places the value of the "xyz"
parameter
                            ^
<https://builds.apache.org/job/cayenne-31/cayenneTestConnection=hsql,jdk=latest1.8,label=Ubuntu/ws/docs/doc/target/sources/org/apache/cayenne/access/jdbc/BindNotEqualDirective.java>:28:
error: malformed HTML
 * A custom Velocity directive to create a PreparedStatement parameter text for "<>?".
                                                                                 ^
<https://builds.apache.org/job/cayenne-31/cayenneTestConnection=hsql,jdk=latest1.8,label=Ubuntu/ws/docs/doc/target/sources/org/apache/cayenne/access/jdbc/BindNotEqualDirective.java>:28:
error: bad use of '>'
 * A custom Velocity directive to create a PreparedStatement parameter text for "<>?".
                                                                                  ^
<https://builds.apache.org/job/cayenne-31/cayenneTestConnection=hsql,jdk=latest1.8,label=Ubuntu/ws/docs/doc/target/sources/org/apache/cayenne/access/jdbc/EJBQLConditionTranslator.java>:390:
error: malformed HTML
     * For that, we'll append IS NULL or IS NOT NULL instead of =null or <>null
                                                                         ^
<https://builds.apache.org/job/cayenne-31/cayenneTestConnection=hsql,jdk=latest1.8,label=Ubuntu/ws/docs/doc/target/sources/org/apache/cayenne/access/jdbc/EJBQLConditionTranslator.java>:390:
error: bad use of '>'
     * For that, we'll append IS NULL or IS NOT NULL instead of =null or <>null
                                                                          ^
<https://builds.apache.org/job/cayenne-31/cayenneTestConnection=hsql,jdk=latest1.8,label=Ubuntu/ws/docs/doc/target/sources/org/apache/cayenne/ejbql/EJBQLExpressionVisitor.java>:140:
error: bad use of '>'
     * Called on visiting ">=" expression and also after visiting every expression child.
                           ^
<https://builds.apache.org/job/cayenne-31/cayenneTestConnection=hsql,jdk=latest1.8,label=Ubuntu/ws/docs/doc/target/sources/org/apache/cayenne/ejbql/EJBQLExpressionVisitor.java>:142:
error: bad use of '>'
     * @param expression an ">=" node being visited.
                             ^
<https://builds.apache.org/job/cayenne-31/cayenneTestConnection=hsql,jdk=latest1.8,label=Ubuntu/ws/docs/doc/target/sources/org/apache/cayenne/ejbql/EJBQLExpressionVisitor.java>:150:
error: bad use of '>'
     * Called on visiting ">=" expression and also after visiting every expression child.
                           ^
<https://builds.apache.org/job/cayenne-31/cayenneTestConnection=hsql,jdk=latest1.8,label=Ubuntu/ws/docs/doc/target/sources/org/apache/cayenne/ejbql/EJBQLExpressionVisitor.java>:152:
error: bad use of '>'
     * @param expression an ">=" node being visited.
                             ^
<https://builds.apache.org/job/cayenne-31/cayenneTestConnection=hsql,jdk=latest1.8,label=Ubuntu/ws/docs/doc/target/sources/org/apache/cayenne/ejbql/EJBQLExpressionVisitor.java>:182:
error: malformed HTML
     * Called on visiting "<=" expression and also after visiting every expression child.
                           ^
<https://builds.apache.org/job/cayenne-31/cayenneTestConnection=hsql,jdk=latest1.8,label=Ubuntu/ws/docs/doc/target/sources/org/apache/cayenne/ejbql/EJBQLExpressionVisitor.java>:184:
error: malformed HTML
     * @param expression an "<=" node being visited.
                             ^
<https://builds.apache.org/job/cayenne-31/cayenneTestConnection=hsql,jdk=latest1.8,label=Ubuntu/ws/docs/doc/target/sources/org/apache/cayenne/ejbql/EJBQLExpressionVisitor.java>:192:
error: malformed HTML
     * Called on visiting "<" expression and also after visiting every expression child.
                           ^

Command line was: /home/jenkins/jenkins-slave/tools/hudson.model.JDK/latest1.8/jre/../bin/javadoc
@options @argfile

Refer to the generated Javadoc files in '<https://builds.apache.org/job/cayenne-31/cayenneTestConnection=hsql,jdk=latest1.8,label=Ubuntu/ws/docs/doc/target/site/apidocs/doc/api'>
dir.

	at org.apache.maven.plugin.javadoc.AbstractJavadocMojo.executeJavadocCommandLine(AbstractJavadocMojo.java:5074)
	at org.apache.maven.plugin.javadoc.AbstractJavadocMojo.executeReport(AbstractJavadocMojo.java:1999)
	at org.apache.maven.plugin.javadoc.JavadocReport.generate(JavadocReport.java:130)
	at org.apache.maven.plugin.javadoc.JavadocReport.execute(JavadocReport.java:315)
	... 21 more
[ERROR] 
[ERROR] Re-run Maven using the -X switch to enable full debug logging.
[ERROR] 
[ERROR] For more information about the errors and possible solutions, please read the following
articles:
[ERROR] [Help 1] http://cwiki.apache.org/confluence/display/MAVEN/MojoExecutionException
[ERROR] 
[ERROR] After correcting the problems, you can resume the build with the command
[ERROR]   mvn <goals> -rf :cayenne-doc
Build step 'Invoke top-level Maven targets' marked build as failure

Mime
View raw message