cayenne-commits mailing list archives

Site index · List index
Message view « Date » · « Thread »
Top « Date » · « Thread »
From Apache Jenkins Server <jenk...@builds.apache.org>
Subject Build failed in Jenkins: cayenne-master » derby,latest1.8,Ubuntu #322
Date Fri, 08 Apr 2016 20:29:09 GMT
See <https://builds.apache.org/job/cayenne-master/cayenneTestConnection=derby,jdk=latest1.8,label=Ubuntu/322/changes>

Changes:

[s.kolbachev] some fixes for tutorial;

------------------------------------------
[...truncated 108517 lines...]
	at org.junit.runners.BlockJUnit4ClassRunner.runChild(BlockJUnit4ClassRunner.java:50)
	at org.junit.runners.ParentRunner$3.run(ParentRunner.java:238)
	at org.junit.runners.ParentRunner$1.schedule(ParentRunner.java:63)
	at org.junit.runners.ParentRunner.runChildren(ParentRunner.java:236)
	at org.junit.runners.ParentRunner.access$000(ParentRunner.java:53)
	at org.junit.runners.ParentRunner$2.evaluate(ParentRunner.java:229)
	at org.junit.runners.ParentRunner.run(ParentRunner.java:309)
	at org.apache.maven.surefire.junit4.JUnit4Provider.execute(JUnit4Provider.java:264)
	at org.apache.maven.surefire.junit4.JUnit4Provider.executeTestSet(JUnit4Provider.java:153)
	at org.apache.maven.surefire.junit4.JUnit4Provider.invoke(JUnit4Provider.java:124)
	at org.apache.maven.surefire.booter.ForkedBooter.invokeProviderInSameClassLoader(ForkedBooter.java:200)
	at org.apache.maven.surefire.booter.ForkedBooter.runSuitesInProcess(ForkedBooter.java:153)
	at org.apache.maven.surefire.booter.ForkedBooter.main(ForkedBooter.java:103)


Results :

Tests in error: 
  CayenneContextValidationIT>DICase.setUpLifecycleManager:35 » CayenneRuntime [v...
  CayenneContextServerDiffsIT>DICase.setUpLifecycleManager:35 » CayenneRuntime [...
  CayenneContextServerDiffsIT>DICase.setUpLifecycleManager:35 » CayenneRuntime [...
  CayenneContextServerDiffsIT>DICase.setUpLifecycleManager:35 » CayenneRuntime [...
  CayenneContextServerDiffsIT>DICase.setUpLifecycleManager:35 » CayenneRuntime [...
  CayenneContextClientChannelEventsIT.testSyncSimpleProperty:170 » CayenneRuntime
  CayenneContextClientChannelEventsIT.testSyncToManyRelationship:237 » CayenneRuntime
  CayenneContextClientChannelEventsIT.testSyncNewObjectIntoDirtyContext:140 » CayenneRuntime
  CayenneContextClientChannelEventsIT.testSyncToOneRelationship:203 » CayenneRuntime
  CayenneContextClientChannelEventsIT.testSyncNewDeletedObject:114 » CayenneRuntime
  CayenneContextClientChannelEventsIT.testSyncManyToManyRelationship:308 » CayenneRuntime
  CayenneContextClientChannelEventsIT.testSyncNewObject:88 » CayenneRuntime [v.4...
  CayenneContextClientChannelEventsIT.testSyncToManyRelationship1:271 » CayenneRuntime
  CayenneContextClientChannelEventsIT.testSyncManyToManyRelationship1:340 » CayenneRuntime
  CayenneContextWithDataContextIT>DICase.setUpLifecycleManager:35 » CayenneRuntime
  CayenneContextWithDataContextIT>DICase.setUpLifecycleManager:35 » CayenneRuntime
  CayenneContextWithDataContextIT>DICase.setUpLifecycleManager:35 » CayenneRuntime
  CayenneContextWithDataContextIT>DICase.setUpLifecycleManager:35 » CayenneRuntime
  CayenneContextWithDataContextIT>DICase.setUpLifecycleManager:35 » CayenneRuntime
  CayenneContextWithDataContextIT>DICase.setUpLifecycleManager:35 » CayenneRuntime
  CayenneContextWithDataContextIT>DICase.setUpLifecycleManager:35 » CayenneRuntime
  CayenneContextWithDataContextIT>DICase.setUpLifecycleManager:35 » CayenneRuntime
  CayenneContextWithDataContextIT>DICase.setUpLifecycleManager:35 » CayenneRuntime
  CayenneContextWithDataContextIT>DICase.setUpLifecycleManager:35 » CayenneRuntime
  CayenneContextWithDataContextIT>DICase.setUpLifecycleManager:35 » CayenneRuntime
  CayenneContextWithDataContextIT>DICase.setUpLifecycleManager:35 » CayenneRuntime
  CayenneContextWithDataContextIT>DICase.setUpLifecycleManager:35 » CayenneRuntime
  CayenneContextWithDataContextIT>DICase.setUpLifecycleManager:35 » CayenneRuntime
  CayenneContextWithDataContextIT>DICase.setUpLifecycleManager:35 » CayenneRuntime
  ClientExpressionIT>DICase.setUpLifecycleManager:35 » CayenneRuntime [v.4.0.M4-...
  ClientExpressionIT>DICase.setUpLifecycleManager:35 » CayenneRuntime [v.4.0.M4-...
  ClientExpressionIT>DICase.setUpLifecycleManager:35 » CayenneRuntime [v.4.0.M4-...
  ClientExpressionIT>DICase.setUpLifecycleManager:35 » CayenneRuntime [v.4.0.M4-...
  ClientExpressionIT>DICase.setUpLifecycleManager:35 » CayenneRuntime [v.4.0.M4-...
  ClientExpressionIT>DICase.setUpLifecycleManager:35 » CayenneRuntime [v.4.0.M4-...
  ClientExpressionIT>DICase.setUpLifecycleManager:35 » CayenneRuntime [v.4.0.M4-...
  ClientExpressionIT>DICase.setUpLifecycleManager:35 » CayenneRuntime [v.4.0.M4-...
  ClientExpressionIT>DICase.setUpLifecycleManager:35 » CayenneRuntime [v.4.0.M4-...
  ClientExpressionIT>DICase.setUpLifecycleManager:35 » CayenneRuntime [v.4.0.M4-...
  ClientSelectQueryExpressionIT>DICase.setUpLifecycleManager:35 » CayenneRuntime
  CayenneContextNamedQueryCachingIT>DICase.setUpLifecycleManager:35 » CayenneRuntime
  CayenneContextNamedQueryCachingIT>DICase.setUpLifecycleManager:35 » CayenneRuntime
  CayenneContextNamedQueryCachingIT>DICase.setUpLifecycleManager:35 » CayenneRuntime
  NestedCayenneContextIT>RemoteCayenneCase.setUpClientContext:49->RemoteCayenneCase.createROPContext:62
» CayenneRuntime
  NestedCayenneContextIT>RemoteCayenneCase.setUpClientContext:49->RemoteCayenneCase.createROPContext:62
» CayenneRuntime
  NestedCayenneContextIT>RemoteCayenneCase.setUpClientContext:49->RemoteCayenneCase.createROPContext:62
» CayenneRuntime
  NestedCayenneContextIT>RemoteCayenneCase.setUpClientContext:49->RemoteCayenneCase.createROPContext:62
» CayenneRuntime
  NestedCayenneContextIT>RemoteCayenneCase.setUpClientContext:49->RemoteCayenneCase.createROPContext:62
» CayenneRuntime
  NestedCayenneContextIT>RemoteCayenneCase.setUpClientContext:49->RemoteCayenneCase.createROPContext:62
» CayenneRuntime
  NestedCayenneContextIT>RemoteCayenneCase.setUpClientContext:49->RemoteCayenneCase.createROPContext:62
» CayenneRuntime
  NestedCayenneContextIT>RemoteCayenneCase.setUpClientContext:49->RemoteCayenneCase.createROPContext:62
» CayenneRuntime
  NestedCayenneContextIT>RemoteCayenneCase.setUpClientContext:49->RemoteCayenneCase.createROPContext:62
» CayenneRuntime
  NestedCayenneContextIT>RemoteCayenneCase.setUpClientContext:49->RemoteCayenneCase.createROPContext:62
» CayenneRuntime
  NestedCayenneContextIT>RemoteCayenneCase.setUpClientContext:49->RemoteCayenneCase.createROPContext:62
» CayenneRuntime
  NestedCayenneContextIT>RemoteCayenneCase.setUpClientContext:49->RemoteCayenneCase.createROPContext:62
» CayenneRuntime
  NestedCayenneContextIT>RemoteCayenneCase.setUpClientContext:49->RemoteCayenneCase.createROPContext:62
» CayenneRuntime
  NestedCayenneContextIT>RemoteCayenneCase.setUpClientContext:49->RemoteCayenneCase.createROPContext:62
» CayenneRuntime
  NestedCayenneContextIT>RemoteCayenneCase.setUpClientContext:49->RemoteCayenneCase.createROPContext:62
» CayenneRuntime
  PersistentObjectInContextIT>DICase.setUpLifecycleManager:35 » CayenneRuntime [...
  PersistentObjectInContextIT>DICase.setUpLifecycleManager:35 » CayenneRuntime [...
  PersistentObjectInContextIT>DICase.setUpLifecycleManager:35 » CayenneRuntime [...
  CayenneContextRelationshipsIT>DICase.setUpLifecycleManager:35 » CayenneRuntime
  CayenneContextRelationshipsIT>DICase.setUpLifecycleManager:35 » CayenneRuntime
  CayenneContextMergeHandlerIT>DICase.setUpLifecycleManager:35 » CayenneRuntime ...
  CayenneContextMergeHandlerIT>DICase.setUpLifecycleManager:35 » CayenneRuntime ...
  CayenneContextSQLTemplateIT>DICase.setUpLifecycleManager:35 » CayenneRuntime [...
  CayenneContextPaginatedListCachingIT>DICase.setUpLifecycleManager:35 » CayenneRuntime
  ClientServerChannelQueryIT>DICase.setUpLifecycleManager:35 » CayenneRuntime [v...
  ClientServerChannelQueryIT>DICase.setUpLifecycleManager:35 » CayenneRuntime [v...
  ClientServerChannelQueryIT>DICase.setUpLifecycleManager:35 » CayenneRuntime [v...
  ClientServerChannelQueryIT>DICase.setUpLifecycleManager:35 » CayenneRuntime [v...
  ClientServerChannelQueryIT>DICase.setUpLifecycleManager:35 » CayenneRuntime [v...
  ClientServerChannelQueryIT>DICase.setUpLifecycleManager:35 » CayenneRuntime [v...
  ClientServerChannelQueryIT>DICase.setUpLifecycleManager:35 » CayenneRuntime [v...
  ClientServerChannelQueryIT>DICase.setUpLifecycleManager:35 » CayenneRuntime [v...
  ClientServerChannelQueryIT>DICase.setUpLifecycleManager:35 » CayenneRuntime [v...
  ClientServerChannelQueryIT>DICase.setUpLifecycleManager:35 » CayenneRuntime [v...
  CayenneContextDeletionIT>RemoteCayenneCase.setUpClientContext:49->RemoteCayenneCase.createROPContext:62
» CayenneRuntime
  RelationshipChangeIT>RemoteCayenneCase.setUpClientContext:49->RemoteCayenneCase.createROPContext:62
» CayenneRuntime
  RelationshipChangeIT>RemoteCayenneCase.setUpClientContext:49->RemoteCayenneCase.createROPContext:62
» CayenneRuntime
  ValueInjectorIT>RemoteCayenneCase.setUpClientContext:49->RemoteCayenneCase.createROPContext:62
» CayenneRuntime
  ValueInjectorIT>RemoteCayenneCase.setUpClientContext:49->RemoteCayenneCase.createROPContext:62
» CayenneRuntime
  RemoteIncrementalFaultListIT>DICase.setUpLifecycleManager:35 » CayenneRuntime ...
  RemoteIncrementalFaultListIT>DICase.setUpLifecycleManager:35 » CayenneRuntime ...
  RemoteIncrementalFaultListIT>DICase.setUpLifecycleManager:35 » CayenneRuntime ...
  RemoteIncrementalFaultListIT>DICase.setUpLifecycleManager:35 » CayenneRuntime ...
  RemoteIncrementalFaultListIT>DICase.setUpLifecycleManager:35 » CayenneRuntime ...
  RemoteIncrementalFaultListIT>DICase.setUpLifecycleManager:35 » CayenneRuntime ...
  RemoteIncrementalFaultListIT>DICase.setUpLifecycleManager:35 » CayenneRuntime ...
  RemoteIncrementalFaultListIT>DICase.setUpLifecycleManager:35 » CayenneRuntime ...
  RemoteIncrementalFaultListIT>DICase.setUpLifecycleManager:35 » CayenneRuntime ...
  RemoteIncrementalFaultListIT>DICase.setUpLifecycleManager:35 » CayenneRuntime ...
  RemoteIncrementalFaultListIT>DICase.setUpLifecycleManager:35 » CayenneRuntime ...
  RemoteIncrementalFaultListIT>DICase.setUpLifecycleManager:35 » CayenneRuntime ...
  RemoteIncrementalFaultListIT>DICase.setUpLifecycleManager:35 » CayenneRuntime ...
  NestedObjectContextParentEventsIT>RemoteCayenneCase.setUpClientContext:49->RemoteCayenneCase.createROPContext:62
» CayenneRuntime
  NestedObjectContextRollbackIT>RemoteCayenneCase.setUpClientContext:49->RemoteCayenneCase.createROPContext:62
» CayenneRuntime
  NestedObjectContextRollbackIT>RemoteCayenneCase.setUpClientContext:49->RemoteCayenneCase.createROPContext:62
» CayenneRuntime
  NestedObjectContextPeerEventsIT>RemoteCayenneCase.setUpClientContext:49->RemoteCayenneCase.createROPContext:62
» CayenneRuntime
  NestedObjectContextPeerEventsIT>RemoteCayenneCase.setUpClientContext:49->RemoteCayenneCase.createROPContext:62
» CayenneRuntime
  NestedObjectContextPeerEventsIT>RemoteCayenneCase.setUpClientContext:49->RemoteCayenneCase.createROPContext:62
» CayenneRuntime
  NestedObjectContextPeerEventsIT>RemoteCayenneCase.setUpClientContext:49->RemoteCayenneCase.createROPContext:62
» CayenneRuntime
  NestedObjectContextLocalIT>RemoteCayenneCase.setUpClientContext:49->RemoteCayenneCase.createROPContext:62
» CayenneRuntime
  RemoteRollbackIT>RemoteCayenneCase.setUpClientContext:49->RemoteCayenneCase.createROPContext:62
» CayenneRuntime
  RemoteRollbackIT>RemoteCayenneCase.setUpClientContext:49->RemoteCayenneCase.createROPContext:62
» CayenneRuntime
  RemoteRollbackIT>RemoteCayenneCase.setUpClientContext:49->RemoteCayenneCase.createROPContext:62
» CayenneRuntime
  RemoteRollbackIT>RemoteCayenneCase.setUpClientContext:49->RemoteCayenneCase.createROPContext:62
» CayenneRuntime
  RemoteRollbackIT>RemoteCayenneCase.setUpClientContext:49->RemoteCayenneCase.createROPContext:62
» CayenneRuntime
  RemoteRollbackIT>RemoteCayenneCase.setUpClientContext:49->RemoteCayenneCase.createROPContext:62
» CayenneRuntime
  ClientChannelServerDiffsIT.testReturnDiffClientArcChanges:206 » CayenneRuntime
  ClientChannelServerDiffsIT.testReturnDiffInPrePersist:162 » CayenneRuntime [v....
  ClientChannelServerDiffsIT.testReturnIdDiff:92 » CayenneRuntime [v.4.0.M4-SNAP...
  CayenneContextRefreshQueryIT>DICase.setUpLifecycleManager:35 » CayenneRuntime ...
  HessianROPSerializationServiceIT>DICase.setUpLifecycleManager:35 » CayenneRuntime
  HessianROPSerializationServiceIT>DICase.setUpLifecycleManager:35 » CayenneRuntime
  CayenneContextCayenneIT>DICase.setUpLifecycleManager:35 » CayenneRuntime [v.4....
  CayenneContextEJBQLIT>DICase.setUpLifecycleManager:35 » CayenneRuntime [v.4.0....
  CayenneContextEJBQLIT>DICase.setUpLifecycleManager:35 » CayenneRuntime [v.4.0....
  CayenneContextEJBQLIT>DICase.setUpLifecycleManager:35 » CayenneRuntime [v.4.0....
  CayenneContextGraphDiffCompressorIT>DICase.setUpLifecycleManager:35 » CayenneRuntime
  CayenneContextGraphDiffCompressorIT>DICase.setUpLifecycleManager:35 » CayenneRuntime
  CayenneContextGraphDiffCompressorIT>DICase.setUpLifecycleManager:35 » CayenneRuntime
  ShallowMergeOperation_ClientIT>DICase.setUpLifecycleManager:35 » CayenneRuntime
  ShallowMergeOperation_ClientIT>DICase.setUpLifecycleManager:35 » CayenneRuntime
  ShallowMergeOperation_ClientIT>DICase.setUpLifecycleManager:35 » CayenneRuntime
  CayenneContextInheritanceIT>DICase.setUpLifecycleManager:35 » CayenneRuntime [...
  CayenneContextInheritanceIT>DICase.setUpLifecycleManager:35 » CayenneRuntime [...
  CayenneContextInheritanceIT>DICase.setUpLifecycleManager:35 » CayenneRuntime [...
  CayenneContextInheritanceIT>DICase.setUpLifecycleManager:35 » CayenneRuntime [...

Tests run: 249, Failures: 0, Errors: 129, Skipped: 0

[INFO] 
[INFO] --- maven-failsafe-plugin:2.17:verify (integration-test) @ cayenne-client ---
[INFO] Failsafe report directory: <https://builds.apache.org/job/cayenne-master/cayenneTestConnection=derby,jdk=latest1.8,label=Ubuntu/ws/cayenne-client/target/failsafe-reports>
[INFO] ------------------------------------------------------------------------
[INFO] Reactor Summary:
[INFO] 
[INFO] Cayenne ........................................... SUCCESS [1.488s]
[INFO] Cayenne Build Tools Parent ........................ SUCCESS [0.008s]
[INFO] Cayenne License and Notice Bundle ................. SUCCESS [6.438s]
[INFO] Common Unit Test Utilities ........................ SUCCESS [1.443s]
[INFO] Cayenne Code Checkers ............................. SUCCESS [0.084s]
[INFO] Cayenne Dependency Injection Container ............ SUCCESS [13.077s]
[INFO] Cayenne Server .................................... SUCCESS [1:51.512s]
[INFO] Cayenne ROP Client ................................ FAILURE [27.354s]
[INFO] Cayenne Project ................................... SKIPPED
[INFO] Cayenne Tools ..................................... SKIPPED
[INFO] Cayenne Lifecycle Utilities ....................... SKIPPED
[INFO] Cayenne Maven Plugins ............................. SKIPPED
[INFO] Cayenne Maven Plugin .............................. SKIPPED
[INFO] Cayenne Cryptography Extensions ................... SKIPPED
[INFO] Cayenne Joda Extensions ........................... SKIPPED
[INFO] Cayenne DBCP2 Extension ........................... SKIPPED
[INFO] Cayenne Integration Tests Parent .................. SKIPPED
[INFO] Integration Tests - Cayenne Tools ................. SKIPPED
[INFO] Cayenne Modeler Parent ............................ SKIPPED
[INFO] Cayenne WebObjects Compatibility Library .......... SKIPPED
[INFO] Cayenne Modeler ................................... SKIPPED
[INFO] Cayenne Modeler Generic and Windows Extensions .... SKIPPED
[INFO] Cayenne Modeler Generic ........................... SKIPPED
[INFO] Cayenne Modeler Mac OS X Extensions ............... SKIPPED
[INFO] Cayenne Modeler Mac OS X .......................... SKIPPED
[INFO] Cayenne Modeler Windows ........................... SKIPPED
[INFO] Cayenne Modeler Maven Plugin ...................... SKIPPED
[INFO] Cayenne Tutorials ................................. SKIPPED
[INFO] Cayenne Tutorial .................................. SKIPPED
[INFO] Cayenne ROP Server Tutorial ....................... SKIPPED
[INFO] Cayenne ROP Client Tutorial ....................... SKIPPED
[INFO] Cayenne Documenation Parent ....................... SKIPPED
[INFO] Cayenne Documentation ............................. SKIPPED
[INFO] Cayenne Docbook Documentation ..................... SKIPPED
[INFO] Docbook: Cayenne Stylesheets ...................... SKIPPED
[INFO] Docbook: Cayenne Guide ............................ SKIPPED
[INFO] Docbook: Getting Started with Cayenne ............. SKIPPED
[INFO] Docbook: Getting Started with Cayenne ROP ......... SKIPPED
[INFO] Docbook: Cayenne New Features and Upgrade Guide ... SKIPPED
[INFO] Cayenne Java8 Extensions .......................... SKIPPED
[INFO] Cayenne Release Assembly .......................... SKIPPED
[INFO] ------------------------------------------------------------------------
[INFO] BUILD FAILURE
[INFO] ------------------------------------------------------------------------
[INFO] Total time: 2:43.089s
[INFO] Finished at: Fri Apr 08 20:28:39 UTC 2016
[INFO] Final Memory: 74M/487M
[INFO] ------------------------------------------------------------------------
[ERROR] Failed to execute goal org.apache.maven.plugins:maven-failsafe-plugin:2.17:verify
(integration-test) on project cayenne-client: There are test failures.
[ERROR] 
[ERROR] Please refer to <https://builds.apache.org/job/cayenne-master/cayenneTestConnection=derby,jdk=latest1.8,label=Ubuntu/ws/cayenne-client/target/failsafe-reports>
for the individual test results.
[ERROR] -> [Help 1]
org.apache.maven.lifecycle.LifecycleExecutionException: Failed to execute goal org.apache.maven.plugins:maven-failsafe-plugin:2.17:verify
(integration-test) on project cayenne-client: There are test failures.

Please refer to <https://builds.apache.org/job/cayenne-master/cayenneTestConnection=derby,jdk=latest1.8,label=Ubuntu/ws/cayenne-client/target/failsafe-reports>
for the individual test results.
	at org.apache.maven.lifecycle.internal.MojoExecutor.execute(MojoExecutor.java:213)
	at org.apache.maven.lifecycle.internal.MojoExecutor.execute(MojoExecutor.java:153)
	at org.apache.maven.lifecycle.internal.MojoExecutor.execute(MojoExecutor.java:145)
	at org.apache.maven.lifecycle.internal.LifecycleModuleBuilder.buildProject(LifecycleModuleBuilder.java:84)
	at org.apache.maven.lifecycle.internal.LifecycleModuleBuilder.buildProject(LifecycleModuleBuilder.java:59)
	at org.apache.maven.lifecycle.internal.LifecycleStarter.singleThreadedBuild(LifecycleStarter.java:183)
	at org.apache.maven.lifecycle.internal.LifecycleStarter.execute(LifecycleStarter.java:161)
	at org.apache.maven.DefaultMaven.doExecute(DefaultMaven.java:320)
	at org.apache.maven.DefaultMaven.execute(DefaultMaven.java:156)
	at org.apache.maven.cli.MavenCli.execute(MavenCli.java:537)
	at org.apache.maven.cli.MavenCli.doMain(MavenCli.java:196)
	at org.apache.maven.cli.MavenCli.main(MavenCli.java:141)
	at sun.reflect.NativeMethodAccessorImpl.invoke0(Native Method)
	at sun.reflect.NativeMethodAccessorImpl.invoke(NativeMethodAccessorImpl.java:62)
	at sun.reflect.DelegatingMethodAccessorImpl.invoke(DelegatingMethodAccessorImpl.java:43)
	at java.lang.reflect.Method.invoke(Method.java:498)
	at org.codehaus.plexus.classworlds.launcher.Launcher.launchEnhanced(Launcher.java:290)
	at org.codehaus.plexus.classworlds.launcher.Launcher.launch(Launcher.java:230)
	at org.codehaus.plexus.classworlds.launcher.Launcher.mainWithExitCode(Launcher.java:409)
	at org.codehaus.plexus.classworlds.launcher.Launcher.main(Launcher.java:352)
Caused by: org.apache.maven.plugin.MojoFailureException: There are test failures.

Please refer to <https://builds.apache.org/job/cayenne-master/cayenneTestConnection=derby,jdk=latest1.8,label=Ubuntu/ws/cayenne-client/target/failsafe-reports>
for the individual test results.
	at org.apache.maven.plugin.surefire.SurefireHelper.reportExecution(SurefireHelper.java:82)
	at org.apache.maven.plugin.failsafe.VerifyMojo.execute(VerifyMojo.java:194)
	at org.apache.maven.plugin.DefaultBuildPluginManager.executeMojo(DefaultBuildPluginManager.java:101)
	at org.apache.maven.lifecycle.internal.MojoExecutor.execute(MojoExecutor.java:209)
	... 19 more
[ERROR] 
[ERROR] Re-run Maven using the -X switch to enable full debug logging.
[ERROR] 
[ERROR] For more information about the errors and possible solutions, please read the following
articles:
[ERROR] [Help 1] http://cwiki.apache.org/confluence/display/MAVEN/MojoFailureException
[ERROR] 
[ERROR] After correcting the problems, you can resume the build with the command
[ERROR]   mvn <goals> -rf :cayenne-client
Build step 'Invoke top-level Maven targets' marked build as failure
Recording test results

Mime
View raw message