cayenne-commits mailing list archives

Site index · List index
Message view « Date » · « Thread »
Top « Date » · « Thread »
From Apache Jenkins Server <jenk...@builds.apache.org>
Subject Build failed in Jenkins: Cayenne pull requests #133
Date Fri, 08 Apr 2016 17:05:22 GMT
See <https://builds.apache.org/job/Cayenne%20pull%20requests/133/>

------------------------------------------
[...truncated 1603 lines...]
jdk1.8.0/jre/lib/classlist
jdk1.8.0/jre/lib/amd64/
jdk1.8.0/jre/lib/amd64/libdeploy.so
jdk1.8.0/jre/lib/amd64/libjsig.so
jdk1.8.0/jre/lib/amd64/libjpeg.so
jdk1.8.0/jre/lib/amd64/libfxplugins.so
jdk1.8.0/jre/lib/amd64/libdcpr.so
jdk1.8.0/jre/lib/amd64/liblcms.so
jdk1.8.0/jre/lib/amd64/libjavafx_font_pango.so
jdk1.8.0/jre/lib/amd64/libsunec.so
jdk1.8.0/jre/lib/amd64/libnpjp2.so
jdk1.8.0/jre/lib/amd64/libjavafx_font_freetype.so
jdk1.8.0/jre/lib/amd64/libjavafx_font_t2k.so
jdk1.8.0/jre/lib/amd64/libj2pkcs11.so
jdk1.8.0/jre/lib/amd64/libhprof.so
jdk1.8.0/jre/lib/amd64/libsctp.so
jdk1.8.0/jre/lib/amd64/jvm.cfg
jdk1.8.0/jre/lib/amd64/libjsdt.so
jdk1.8.0/jre/lib/amd64/libt2k.so
jdk1.8.0/jre/lib/amd64/libdt_socket.so
jdk1.8.0/jre/lib/amd64/libnpt.so
jdk1.8.0/jre/lib/amd64/jli/
jdk1.8.0/jre/lib/amd64/jli/libjli.so
jdk1.8.0/jre/lib/amd64/libmlib_image.so
jdk1.8.0/jre/lib/amd64/server/
jdk1.8.0/jre/lib/amd64/server/libjsig.so
jdk1.8.0/jre/lib/amd64/server/Xusage.txt
jdk1.8.0/jre/lib/amd64/server/libjvm.so
jdk1.8.0/jre/lib/amd64/libprism_sw.so
jdk1.8.0/jre/lib/amd64/libj2gss.so
jdk1.8.0/jre/lib/amd64/libglass.so
jdk1.8.0/jre/lib/amd64/libsaproc.so
jdk1.8.0/jre/lib/amd64/libdecora_sse.so
jdk1.8.0/jre/lib/amd64/libj2pcsc.so
jdk1.8.0/jre/lib/amd64/libjfxwebkit.so
jdk1.8.0/jre/lib/amd64/libfontmanager.so
jdk1.8.0/jre/lib/amd64/libjsoundalsa.so
jdk1.8.0/jre/lib/amd64/libjdwp.so
jdk1.8.0/jre/lib/amd64/libjsound.so
jdk1.8.0/jre/lib/amd64/libjaas_unix.so
jdk1.8.0/jre/lib/amd64/libattach.so
jdk1.8.0/jre/lib/amd64/libjava.so
jdk1.8.0/jre/lib/amd64/libjfr.so
jdk1.8.0/jre/lib/amd64/libawt.so
jdk1.8.0/jre/lib/amd64/libjawt.so
jdk1.8.0/jre/lib/amd64/libverify.so
jdk1.8.0/jre/lib/amd64/libzip.so
jdk1.8.0/jre/lib/amd64/libjavafx_iio.so
jdk1.8.0/jre/lib/amd64/libjava_crw_demo.so
jdk1.8.0/jre/lib/amd64/libjfxmedia.so
jdk1.8.0/jre/lib/amd64/libnet.so
jdk1.8.0/jre/lib/amd64/libjavafx_font.so
jdk1.8.0/jre/lib/amd64/libprism_common.so
jdk1.8.0/jre/lib/amd64/libnio.so
jdk1.8.0/jre/lib/amd64/libprism_es2.so
jdk1.8.0/jre/lib/amd64/libinstrument.so
jdk1.8.0/jre/lib/amd64/libkcms.so
jdk1.8.0/jre/lib/amd64/libawt_xawt.so
jdk1.8.0/jre/lib/amd64/libmanagement.so
jdk1.8.0/jre/lib/amd64/libunpack.so
jdk1.8.0/jre/lib/amd64/libgstreamer-lite.so
jdk1.8.0/jre/lib/amd64/libawt_headless.so
jdk1.8.0/jre/lib/amd64/libavplugin.so
jdk1.8.0/jre/lib/amd64/libsplashscreen.so
jdk1.8.0/jre/lib/fontconfig.properties.src
jdk1.8.0/jre/lib/psfont.properties.ja
jdk1.8.0/jre/lib/fontconfig.Turbo.properties.src
jdk1.8.0/jre/lib/jce.jar
jdk1.8.0/jre/lib/flavormap.properties
jdk1.8.0/jre/lib/jfxswt.jar
jdk1.8.0/jre/lib/fontconfig.SuSE.10.properties.src
jdk1.8.0/jre/lib/fontconfig.SuSE.11.bfc
jdk1.8.0/jre/COPYRIGHT
jdk1.8.0/jre/THIRDPARTYLICENSEREADME-JAVAFX.txt
jdk1.8.0/jre/Welcome.html
jdk1.8.0/jre/README
jdk1.8.0/README.html
Building remotely on beam3 (beam) in workspace <https://builds.apache.org/job/Cayenne%20pull%20requests/ws/>
java.io.IOException: Failed to install https://repo.maven.apache.org/maven2/org/apache/maven/apache-maven/3.0.4/apache-maven-3.0.4-bin.zip
to /home/jenkins/tools/maven/apache-maven-3.0.4
	at hudson.FilePath.installIfNecessaryFrom(FilePath.java:832)
	at hudson.tools.DownloadFromUrlInstaller.performInstallation(DownloadFromUrlInstaller.java:75)
	at hudson.tools.InstallerTranslator.getToolHome(InstallerTranslator.java:68)
	at hudson.tools.ToolLocationNodeProperty.getToolHome(ToolLocationNodeProperty.java:108)
	at hudson.tools.ToolInstallation.translateFor(ToolInstallation.java:206)
	at hudson.tasks.Maven$MavenInstallation.forNode(Maven.java:624)
	at hudson.maven.MavenModuleSetBuild.getEnvironment(MavenModuleSetBuild.java:183)
	at hudson.plugins.git.GitSCM.checkout(GitSCM.java:1046)
	at hudson.scm.SCM.checkout(SCM.java:485)
	at hudson.model.AbstractProject.checkout(AbstractProject.java:1276)
	at hudson.model.AbstractBuild$AbstractBuildExecution.defaultCheckout(AbstractBuild.java:607)
	at jenkins.scm.SCMCheckoutStrategy.checkout(SCMCheckoutStrategy.java:86)
	at hudson.model.AbstractBuild$AbstractBuildExecution.run(AbstractBuild.java:529)
	at hudson.model.Run.execute(Run.java:1738)
	at hudson.maven.MavenModuleSetBuild.run(MavenModuleSetBuild.java:531)
	at hudson.model.ResourceController.execute(ResourceController.java:98)
	at hudson.model.Executor.run(Executor.java:410)
Caused by: java.io.IOException: remote file operation failed: /home/jenkins/tools/maven/apache-maven-3.0.4
at hudson.remoting.Channel@19eca70f:beam3: java.nio.file.AccessDeniedException: /home/jenkins/tools/maven/apache-maven-3.0.4/NOTICE.txt
	at hudson.FilePath.act(FilePath.java:986)
	at hudson.FilePath.act(FilePath.java:968)
	at hudson.FilePath.deleteContents(FilePath.java:1183)
	at hudson.FilePath.installIfNecessaryFrom(FilePath.java:796)
	... 16 more
Caused by: java.nio.file.AccessDeniedException: /home/jenkins/tools/maven/apache-maven-3.0.4/NOTICE.txt
	at sun.nio.fs.UnixException.translateToIOException(UnixException.java:84)
	at sun.nio.fs.UnixException.rethrowAsIOException(UnixException.java:102)
	at sun.nio.fs.UnixException.rethrowAsIOException(UnixException.java:107)
	at sun.nio.fs.UnixFileSystemProvider.implDelete(UnixFileSystemProvider.java:244)
	at sun.nio.fs.AbstractFileSystemProvider.delete(AbstractFileSystemProvider.java:103)
	at java.nio.file.Files.delete(Files.java:1077)
	at sun.reflect.NativeMethodAccessorImpl.invoke0(Native Method)
	at sun.reflect.NativeMethodAccessorImpl.invoke(NativeMethodAccessorImpl.java:57)
	at sun.reflect.DelegatingMethodAccessorImpl.invoke(DelegatingMethodAccessorImpl.java:43)
	at java.lang.reflect.Method.invoke(Method.java:606)
	at hudson.Util.deleteFile(Util.java:255)
	at hudson.FilePath.deleteRecursive(FilePath.java:1203)
	at hudson.FilePath.deleteContentsRecursive(FilePath.java:1212)
	at hudson.FilePath.access$1100(FilePath.java:190)
	at hudson.FilePath$15.invoke(FilePath.java:1186)
	at hudson.FilePath$15.invoke(FilePath.java:1183)
	at hudson.FilePath$FileCallableWrapper.call(FilePath.java:2719)
	at hudson.remoting.UserRequest.perform(UserRequest.java:120)
	at hudson.remoting.UserRequest.perform(UserRequest.java:48)
	at hudson.remoting.Request$2.run(Request.java:326)
	at hudson.remoting.InterceptingExecutorService$1.call(InterceptingExecutorService.java:68)
	at java.util.concurrent.FutureTask.run(FutureTask.java:262)
	at java.util.concurrent.ThreadPoolExecutor.runWorker(ThreadPoolExecutor.java:1145)
	at java.util.concurrent.ThreadPoolExecutor$Worker.run(ThreadPoolExecutor.java:615)
	at java.lang.Thread.run(Thread.java:745)
	at ......remote call to beam3(Native Method)
	at hudson.remoting.Channel.attachCallSiteStackTrace(Channel.java:1416)
	at hudson.remoting.UserResponse.retrieve(UserRequest.java:220)
	at hudson.remoting.Channel.call(Channel.java:781)
	at hudson.FilePath.act(FilePath.java:979)
	... 19 more
Retrying after 10 seconds
java.io.IOException: Failed to install https://repo.maven.apache.org/maven2/org/apache/maven/apache-maven/3.0.4/apache-maven-3.0.4-bin.zip
to /home/jenkins/tools/maven/apache-maven-3.0.4
	at hudson.FilePath.installIfNecessaryFrom(FilePath.java:832)
	at hudson.tools.DownloadFromUrlInstaller.performInstallation(DownloadFromUrlInstaller.java:75)
	at hudson.tools.InstallerTranslator.getToolHome(InstallerTranslator.java:68)
	at hudson.tools.ToolLocationNodeProperty.getToolHome(ToolLocationNodeProperty.java:108)
	at hudson.tools.ToolInstallation.translateFor(ToolInstallation.java:206)
	at hudson.tasks.Maven$MavenInstallation.forNode(Maven.java:624)
	at hudson.maven.MavenModuleSetBuild.getEnvironment(MavenModuleSetBuild.java:183)
	at hudson.plugins.git.GitSCM.checkout(GitSCM.java:1046)
	at hudson.scm.SCM.checkout(SCM.java:485)
	at hudson.model.AbstractProject.checkout(AbstractProject.java:1276)
	at hudson.model.AbstractBuild$AbstractBuildExecution.defaultCheckout(AbstractBuild.java:607)
	at jenkins.scm.SCMCheckoutStrategy.checkout(SCMCheckoutStrategy.java:86)
	at hudson.model.AbstractBuild$AbstractBuildExecution.run(AbstractBuild.java:529)
	at hudson.model.Run.execute(Run.java:1738)
	at hudson.maven.MavenModuleSetBuild.run(MavenModuleSetBuild.java:531)
	at hudson.model.ResourceController.execute(ResourceController.java:98)
	at hudson.model.Executor.run(Executor.java:410)
Caused by: java.io.IOException: remote file operation failed: /home/jenkins/tools/maven/apache-maven-3.0.4
at hudson.remoting.Channel@19eca70f:beam3: java.nio.file.AccessDeniedException: /home/jenkins/tools/maven/apache-maven-3.0.4/NOTICE.txt
	at hudson.FilePath.act(FilePath.java:986)
	at hudson.FilePath.act(FilePath.java:968)
	at hudson.FilePath.deleteContents(FilePath.java:1183)
	at hudson.FilePath.installIfNecessaryFrom(FilePath.java:796)
	... 16 more
Caused by: java.nio.file.AccessDeniedException: /home/jenkins/tools/maven/apache-maven-3.0.4/NOTICE.txt
	at sun.nio.fs.UnixException.translateToIOException(UnixException.java:84)
	at sun.nio.fs.UnixException.rethrowAsIOException(UnixException.java:102)
	at sun.nio.fs.UnixException.rethrowAsIOException(UnixException.java:107)
	at sun.nio.fs.UnixFileSystemProvider.implDelete(UnixFileSystemProvider.java:244)
	at sun.nio.fs.AbstractFileSystemProvider.delete(AbstractFileSystemProvider.java:103)
	at java.nio.file.Files.delete(Files.java:1077)
	at sun.reflect.NativeMethodAccessorImpl.invoke0(Native Method)
	at sun.reflect.NativeMethodAccessorImpl.invoke(NativeMethodAccessorImpl.java:57)
	at sun.reflect.DelegatingMethodAccessorImpl.invoke(DelegatingMethodAccessorImpl.java:43)
	at java.lang.reflect.Method.invoke(Method.java:606)
	at hudson.Util.deleteFile(Util.java:255)
	at hudson.FilePath.deleteRecursive(FilePath.java:1203)
	at hudson.FilePath.deleteContentsRecursive(FilePath.java:1212)
	at hudson.FilePath.access$1100(FilePath.java:190)
	at hudson.FilePath$15.invoke(FilePath.java:1186)
	at hudson.FilePath$15.invoke(FilePath.java:1183)
	at hudson.FilePath$FileCallableWrapper.call(FilePath.java:2719)
	at hudson.remoting.UserRequest.perform(UserRequest.java:120)
	at hudson.remoting.UserRequest.perform(UserRequest.java:48)
	at hudson.remoting.Request$2.run(Request.java:326)
	at hudson.remoting.InterceptingExecutorService$1.call(InterceptingExecutorService.java:68)
	at java.util.concurrent.FutureTask.run(FutureTask.java:262)
	at java.util.concurrent.ThreadPoolExecutor.runWorker(ThreadPoolExecutor.java:1145)
	at java.util.concurrent.ThreadPoolExecutor$Worker.run(ThreadPoolExecutor.java:615)
	at java.lang.Thread.run(Thread.java:745)
	at ......remote call to beam3(Native Method)
	at hudson.remoting.Channel.attachCallSiteStackTrace(Channel.java:1416)
	at hudson.remoting.UserResponse.retrieve(UserRequest.java:220)
	at hudson.remoting.Channel.call(Channel.java:781)
	at hudson.FilePath.act(FilePath.java:979)
	... 19 more
Retrying after 10 seconds
java.io.IOException: Failed to install https://repo.maven.apache.org/maven2/org/apache/maven/apache-maven/3.0.4/apache-maven-3.0.4-bin.zip
to /home/jenkins/tools/maven/apache-maven-3.0.4
	at hudson.FilePath.installIfNecessaryFrom(FilePath.java:832)
	at hudson.tools.DownloadFromUrlInstaller.performInstallation(DownloadFromUrlInstaller.java:75)
	at hudson.tools.InstallerTranslator.getToolHome(InstallerTranslator.java:68)
	at hudson.tools.ToolLocationNodeProperty.getToolHome(ToolLocationNodeProperty.java:108)
	at hudson.tools.ToolInstallation.translateFor(ToolInstallation.java:206)
	at hudson.tasks.Maven$MavenInstallation.forNode(Maven.java:624)
	at hudson.maven.MavenModuleSetBuild.getEnvironment(MavenModuleSetBuild.java:183)
	at hudson.plugins.git.GitSCM.checkout(GitSCM.java:1046)
	at hudson.scm.SCM.checkout(SCM.java:485)
	at hudson.model.AbstractProject.checkout(AbstractProject.java:1276)
	at hudson.model.AbstractBuild$AbstractBuildExecution.defaultCheckout(AbstractBuild.java:607)
	at jenkins.scm.SCMCheckoutStrategy.checkout(SCMCheckoutStrategy.java:86)
	at hudson.model.AbstractBuild$AbstractBuildExecution.run(AbstractBuild.java:529)
	at hudson.model.Run.execute(Run.java:1738)
	at hudson.maven.MavenModuleSetBuild.run(MavenModuleSetBuild.java:531)
	at hudson.model.ResourceController.execute(ResourceController.java:98)
	at hudson.model.Executor.run(Executor.java:410)
Caused by: java.io.IOException: remote file operation failed: /home/jenkins/tools/maven/apache-maven-3.0.4
at hudson.remoting.Channel@19eca70f:beam3: java.nio.file.AccessDeniedException: /home/jenkins/tools/maven/apache-maven-3.0.4/NOTICE.txt
	at hudson.FilePath.act(FilePath.java:986)
	at hudson.FilePath.act(FilePath.java:968)
	at hudson.FilePath.deleteContents(FilePath.java:1183)
	at hudson.FilePath.installIfNecessaryFrom(FilePath.java:796)
	... 16 more
Caused by: java.nio.file.AccessDeniedException: /home/jenkins/tools/maven/apache-maven-3.0.4/NOTICE.txt
	at sun.nio.fs.UnixException.translateToIOException(UnixException.java:84)
	at sun.nio.fs.UnixException.rethrowAsIOException(UnixException.java:102)
	at sun.nio.fs.UnixException.rethrowAsIOException(UnixException.java:107)
	at sun.nio.fs.UnixFileSystemProvider.implDelete(UnixFileSystemProvider.java:244)
	at sun.nio.fs.AbstractFileSystemProvider.delete(AbstractFileSystemProvider.java:103)
	at java.nio.file.Files.delete(Files.java:1077)
	at sun.reflect.NativeMethodAccessorImpl.invoke0(Native Method)
	at sun.reflect.NativeMethodAccessorImpl.invoke(NativeMethodAccessorImpl.java:57)
	at sun.reflect.DelegatingMethodAccessorImpl.invoke(DelegatingMethodAccessorImpl.java:43)
	at java.lang.reflect.Method.invoke(Method.java:606)
	at hudson.Util.deleteFile(Util.java:255)
	at hudson.FilePath.deleteRecursive(FilePath.java:1203)
	at hudson.FilePath.deleteContentsRecursive(FilePath.java:1212)
	at hudson.FilePath.access$1100(FilePath.java:190)
	at hudson.FilePath$15.invoke(FilePath.java:1186)
	at hudson.FilePath$15.invoke(FilePath.java:1183)
	at hudson.FilePath$FileCallableWrapper.call(FilePath.java:2719)
	at hudson.remoting.UserRequest.perform(UserRequest.java:120)
	at hudson.remoting.UserRequest.perform(UserRequest.java:48)
	at hudson.remoting.Request$2.run(Request.java:326)
	at hudson.remoting.InterceptingExecutorService$1.call(InterceptingExecutorService.java:68)
	at java.util.concurrent.FutureTask.run(FutureTask.java:262)
	at java.util.concurrent.ThreadPoolExecutor.runWorker(ThreadPoolExecutor.java:1145)
	at java.util.concurrent.ThreadPoolExecutor$Worker.run(ThreadPoolExecutor.java:615)
	at java.lang.Thread.run(Thread.java:745)
	at ......remote call to beam3(Native Method)
	at hudson.remoting.Channel.attachCallSiteStackTrace(Channel.java:1416)
	at hudson.remoting.UserResponse.retrieve(UserRequest.java:220)
	at hudson.remoting.Channel.call(Channel.java:781)
	at hudson.FilePath.act(FilePath.java:979)
	... 19 more
Putting comment on the pull request

Mime
View raw message