cayenne-commits mailing list archives

Site index · List index
Message view « Date » · « Thread »
Top « Date » · « Thread »
From Apache Jenkins Server <jenk...@builds.apache.org>
Subject Build failed in Jenkins: cayenne-31 » HSQLDB,JDK 1.5 (latest),Ubuntu #120
Date Wed, 03 Feb 2016 11:36:29 GMT
See <https://builds.apache.org/job/cayenne-31/cayenneTestConnection=HSQLDB,jdk=JDK%201.5%20(latest),label=Ubuntu/120/changes>

Changes:

[s.kolbachev] add cayenne-project to the assembly

------------------------------------------
[...truncated 1801 lines...]
6/6 KB   
         
Downloaded: http://maven.objectstyle.org/nexus/content/groups/cayenne-deps/org/apache/maven/plugins/maven-jar-plugin/2.3.1/maven-jar-plugin-2.3.1.pom
(6 KB at 18.3 KB/sec)
Downloading: http://maven.objectstyle.org/nexus/content/groups/cayenne-deps/org/apache/maven/plugins/maven-jar-plugin/2.3.1/maven-jar-plugin-2.3.1.jar
4/32 KB   
8/32 KB   
12/32 KB   
16/32 KB   
20/32 KB   
24/32 KB   
28/32 KB   
32/32 KB   
           
Downloaded: http://maven.objectstyle.org/nexus/content/groups/cayenne-deps/org/apache/maven/plugins/maven-jar-plugin/2.3.1/maven-jar-plugin-2.3.1.jar
(32 KB at 169.7 KB/sec)
Downloading: http://maven.objectstyle.org/nexus/content/groups/cayenne-deps/org/apache/maven/maven-archiver/2.2/maven-archiver-2.2.pom
2/2 KB     
         
Downloaded: http://maven.objectstyle.org/nexus/content/groups/cayenne-deps/org/apache/maven/maven-archiver/2.2/maven-archiver-2.2.pom
(2 KB at 6.0 KB/sec)
Downloading: http://maven.objectstyle.org/nexus/content/groups/cayenne-deps/org/apache/maven/shared/maven-shared-components/3/maven-shared-components-3.pom
2/2 KB   
         
Downloaded: http://maven.objectstyle.org/nexus/content/groups/cayenne-deps/org/apache/maven/shared/maven-shared-components/3/maven-shared-components-3.pom
(2 KB at 3.6 KB/sec)
Downloading: http://maven.objectstyle.org/nexus/content/groups/cayenne-deps/org/apache/maven/maven-parent/4/maven-parent-4.pom
4/10 KB   
8/10 KB   
10/10 KB   
           
Downloaded: http://maven.objectstyle.org/nexus/content/groups/cayenne-deps/org/apache/maven/maven-parent/4/maven-parent-4.pom
(10 KB at 31.3 KB/sec)
Downloading: http://maven.objectstyle.org/nexus/content/groups/cayenne-deps/org/apache/maven/maven-project/2.0/maven-project-2.0.pom
2/2 KB     
         
Downloaded: http://maven.objectstyle.org/nexus/content/groups/cayenne-deps/org/apache/maven/maven-project/2.0/maven-project-2.0.pom
(2 KB at 7.8 KB/sec)
Downloading: http://maven.objectstyle.org/nexus/content/groups/cayenne-deps/org/apache/maven/maven/2.0/maven-2.0.pom
4/9 KB   
8/9 KB   
9/9 KB   
         
Downloaded: http://maven.objectstyle.org/nexus/content/groups/cayenne-deps/org/apache/maven/maven/2.0/maven-2.0.pom
(9 KB at 20.9 KB/sec)
Downloading: http://maven.objectstyle.org/nexus/content/groups/cayenne-deps/org/apache/maven/maven-profile/2.0/maven-profile-2.0.pom
2/2 KB   
         
Downloaded: http://maven.objectstyle.org/nexus/content/groups/cayenne-deps/org/apache/maven/maven-profile/2.0/maven-profile-2.0.pom
(2 KB at 5.7 KB/sec)
Downloading: http://maven.objectstyle.org/nexus/content/groups/cayenne-deps/org/apache/maven/maven-model/2.0/maven-model-2.0.pom
3/3 KB   
         
Downloaded: http://maven.objectstyle.org/nexus/content/groups/cayenne-deps/org/apache/maven/maven-model/2.0/maven-model-2.0.pom
(3 KB at 6.3 KB/sec)
Downloading: http://maven.objectstyle.org/nexus/content/groups/cayenne-deps/org/apache/maven/maven-artifact-manager/2.0/maven-artifact-manager-2.0.pom
2/2 KB   
         
Downloaded: http://maven.objectstyle.org/nexus/content/groups/cayenne-deps/org/apache/maven/maven-artifact-manager/2.0/maven-artifact-manager-2.0.pom
(2 KB at 3.2 KB/sec)
Downloading: http://maven.objectstyle.org/nexus/content/groups/cayenne-deps/org/apache/maven/maven-repository-metadata/2.0/maven-repository-metadata-2.0.pom
2/2 KB   
         
Downloaded: http://maven.objectstyle.org/nexus/content/groups/cayenne-deps/org/apache/maven/maven-repository-metadata/2.0/maven-repository-metadata-2.0.pom
(2 KB at 5.6 KB/sec)
Downloading: http://maven.objectstyle.org/nexus/content/groups/cayenne-deps/org/apache/maven/maven-artifact/2.0/maven-artifact-2.0.pom
723/723 B   
            
Downloaded: http://maven.objectstyle.org/nexus/content/groups/cayenne-deps/org/apache/maven/maven-artifact/2.0/maven-artifact-2.0.pom
(723 B at 1.4 KB/sec)
Downloading: http://maven.objectstyle.org/nexus/content/groups/cayenne-deps/org/apache/maven/wagon/wagon-provider-api/1.0-alpha-5/wagon-provider-api-1.0-alpha-5.pom
4/5 KB      
5/5 KB   
         
Downloaded: http://maven.objectstyle.org/nexus/content/groups/cayenne-deps/org/apache/maven/wagon/wagon-provider-api/1.0-alpha-5/wagon-provider-api-1.0-alpha-5.pom
(5 KB at 5.5 KB/sec)
Downloading: http://maven.objectstyle.org/nexus/content/groups/cayenne-deps/org/codehaus/plexus/plexus-archiver/1.0-alpha-7/plexus-archiver-1.0-alpha-7.pom
2/2 KB   
         
Downloaded: http://maven.objectstyle.org/nexus/content/groups/cayenne-deps/org/codehaus/plexus/plexus-archiver/1.0-alpha-7/plexus-archiver-1.0-alpha-7.pom
(2 KB at 1.1 KB/sec)
Downloading: http://maven.objectstyle.org/nexus/content/groups/cayenne-deps/org/codehaus/plexus/plexus-components/1.1.6/plexus-components-1.1.6.pom
2/2 KB   
         
Downloaded: http://maven.objectstyle.org/nexus/content/groups/cayenne-deps/org/codehaus/plexus/plexus-components/1.1.6/plexus-components-1.1.6.pom
(2 KB at 3.1 KB/sec)
Downloading: http://maven.objectstyle.org/nexus/content/groups/cayenne-deps/org/codehaus/plexus/plexus-utils/1.2/plexus-utils-1.2.pom
767/767 B   
            
Downloaded: http://maven.objectstyle.org/nexus/content/groups/cayenne-deps/org/codehaus/plexus/plexus-utils/1.2/plexus-utils-1.2.pom
(767 B at 1.3 KB/sec)
Downloading: http://maven.objectstyle.org/nexus/content/groups/cayenne-deps/org/codehaus/plexus/plexus/1.0.5/plexus-1.0.5.pom
4/6 KB      
6/6 KB   
         
Downloaded: http://maven.objectstyle.org/nexus/content/groups/cayenne-deps/org/codehaus/plexus/plexus/1.0.5/plexus-1.0.5.pom
(6 KB at 6.6 KB/sec)
Downloading: http://maven.objectstyle.org/nexus/content/groups/cayenne-deps/org/apache/maven/maven-plugin-api/2.0.4/maven-plugin-api-2.0.4.pom
643/643 B   
            
Downloaded: http://maven.objectstyle.org/nexus/content/groups/cayenne-deps/org/apache/maven/maven-plugin-api/2.0.4/maven-plugin-api-2.0.4.pom
(643 B at 1.0 KB/sec)
Downloading: http://maven.objectstyle.org/nexus/content/groups/cayenne-deps/org/apache/maven/maven/2.0.4/maven-2.0.4.pom
4/12 KB     
8/12 KB   
12/12 KB   
12/12 KB   
           
Downloaded: http://maven.objectstyle.org/nexus/content/groups/cayenne-deps/org/apache/maven/maven/2.0.4/maven-2.0.4.pom
(12 KB at 7.5 KB/sec)
Downloading: http://maven.objectstyle.org/nexus/content/groups/cayenne-deps/velocity/velocity/1.4/velocity-1.4.pom
3/3 KB     
         
Downloaded: http://maven.objectstyle.org/nexus/content/groups/cayenne-deps/velocity/velocity/1.4/velocity-1.4.pom
(3 KB at 2.9 KB/sec)
Downloading: http://maven.objectstyle.org/nexus/content/groups/cayenne-deps/velocity/velocity-dep/1.4/velocity-dep-1.4.pom
2/2 KB   
         
Downloaded: http://maven.objectstyle.org/nexus/content/groups/cayenne-deps/velocity/velocity-dep/1.4/velocity-dep-1.4.pom
(2 KB at 1.8 KB/sec)
Downloading: http://maven.objectstyle.org/nexus/content/groups/cayenne-deps/com/caucho/resin-hessian/3.1.6/resin-hessian-3.1.6.pom
         
Downloading: http://repo.maven.apache.org/maven2/com/caucho/resin-hessian/3.1.6/resin-hessian-3.1.6.pom
         
Downloading: http://maven.objectstyle.org/nexus/content/groups/cayenne-deps/mockrunner/mockrunner/0.4.1/mockrunner-0.4.1.pom
         
Downloading: http://repo.maven.apache.org/maven2/mockrunner/mockrunner/0.4.1/mockrunner-0.4.1.pom
         
Downloading: http://maven.objectstyle.org/nexus/content/groups/cayenne-deps/org/objectstyle/jdbc4-compat/1.0/jdbc4-compat-1.0.pom
         
Downloading: http://repo.maven.apache.org/maven2/org/objectstyle/jdbc4-compat/1.0/jdbc4-compat-1.0.pom
         
Downloading: http://maven.objectstyle.org/nexus/content/groups/cayenne-deps/opensymphony/oscache/2.3.2/oscache-2.3.2.pom
         
Downloading: http://repo.maven.apache.org/maven2/opensymphony/oscache/2.3.2/oscache-2.3.2.pom
         
Downloading: http://maven.objectstyle.org/nexus/content/groups/cayenne-deps/foundrylogic/vpp/vpp/2.2.1/vpp-2.2.1.pom
         
Downloading: http://repo.maven.apache.org/maven2/foundrylogic/vpp/vpp/2.2.1/vpp-2.2.1.pom
         
Downloading: http://maven.objectstyle.org/nexus/content/groups/cayenne-deps/jgoodies/forms/1.0.5/forms-1.0.5.pom
         
Downloading: http://repo.maven.apache.org/maven2/jgoodies/forms/1.0.5/forms-1.0.5.pom
479/479 B   
            
Downloaded: http://repo.maven.apache.org/maven2/jgoodies/forms/1.0.5/forms-1.0.5.pom (479
B at 58.5 KB/sec)
Downloading: http://maven.objectstyle.org/nexus/content/groups/cayenne-deps/jgoodies/looks/1.3.1/looks-1.3.1.pom
            
Downloading: http://repo.maven.apache.org/maven2/jgoodies/looks/1.3.1/looks-1.3.1.pom
            
[INFO] ------------------------------------------------------------------------
[INFO] Reactor Summary:
[INFO] 
[INFO] Cayenne ........................................... SUCCESS [6.224s]
[INFO] Common Unit Test Utilities ........................ SUCCESS [21.744s]
[INFO] Cayenne Internal Build Plugin ..................... FAILURE [24.015s]
[INFO] Cayenne Build Tools Parent ........................ SKIPPED
[INFO] Cayenne License and Notice Bundle ................. SKIPPED
[INFO] Cayenne Dependency Injection Container ............ SKIPPED
[INFO] Cayenne Java 1.5 Unpublished ...................... SKIPPED
[INFO] Cayenne WebObjects Compatibility Library .......... SKIPPED
[INFO] Cayenne Aggregated Server Jar ..................... SKIPPED
[INFO] Cayenne Aggregated Client Jar ..................... SKIPPED
[INFO] Cayenne Project ................................... SKIPPED
[INFO] Cayenne Tools ..................................... SKIPPED
[INFO] Library: cayenne-lifecycle ........................ SKIPPED
[INFO] Cayenne Maven Plugin .............................. SKIPPED
[INFO] Cayenne Framework Aggregator Project .............. SKIPPED
[INFO] Cayenne Integration Tests Parent .................. SKIPPED
[INFO] Integration Tests - Cayenne Runtime ............... SKIPPED
[INFO] Integration Tests - Cayenne Tools ................. SKIPPED
[INFO] Cayenne Modeler ................................... SKIPPED
[INFO] Cayenne Modeler Maven Plugin ...................... SKIPPED
[INFO] Cayenne Modeler Generic and Windows Extensions .... SKIPPED
[INFO] Cayenne Modeler Generic ........................... SKIPPED
[INFO] Cayenne Modeler Mac OS X Extensions ............... SKIPPED
[INFO] Cayenne Modeler Mac OS X .......................... SKIPPED
[INFO] Cayenne Modeler Mac OS X - Old Apple Java ......... SKIPPED
[INFO] Cayenne Modeler Windows ........................... SKIPPED
[INFO] Cayenne Modeler Parent ............................ SKIPPED
[INFO] Cayenne Tutorial .................................. SKIPPED
[INFO] Cayenne ROP Server Tutorial ....................... SKIPPED
[INFO] Cayenne ROP Client Tutorial ....................... SKIPPED
[INFO] Cayenne Tutorials ................................. SKIPPED
[INFO] Cayenne Documentation ............................. SKIPPED
[INFO] Cayenne Documenation Parent ....................... SKIPPED
[INFO] Cayenne Docbook Documentation ..................... SKIPPED
[INFO] Docbook: Cayenne Stylesheets ...................... SKIPPED
[INFO] Docbook: Cayenne Guide ............................ SKIPPED
[INFO] Docbook: Getting Started with Cayenne ............. SKIPPED
[INFO] Docbook: Getting Started with Cayenne ROP ......... SKIPPED
[INFO] Docbook: Cayenne New Features and Upgrade Guide ... SKIPPED
[INFO] Cayenne Release Assembly .......................... SKIPPED
[INFO] ------------------------------------------------------------------------
[INFO] BUILD FAILURE
[INFO] ------------------------------------------------------------------------
[INFO] Total time: 57.896s
[INFO] Finished at: Wed Feb 03 11:36:31 UTC 2016
[INFO] Final Memory: 10M/47M
[INFO] ------------------------------------------------------------------------
[ERROR] Failed to execute goal on project maven-cayenne-build-plugin: Could not resolve dependencies
for project org.apache.cayenne.build-tools:maven-cayenne-build-plugin:maven-plugin:3.1.1-SNAPSHOT:
Failed to collect dependencies for [org.apache.maven:maven-archiver:jar:2.2 (compile), org.apache.maven:maven-plugin-api:jar:2.0.4
(compile), velocity:velocity:jar:1.4 (compile), com.caucho:resin-hessian:jar:3.1.6 (provided),
mockrunner:mockrunner:jar:0.4.1 (test), org.objectstyle:jdbc4-compat:jar:1.0 (provided), opensymphony:oscache:jar:2.3.2
(provided), foundrylogic.vpp:vpp:jar:2.2.1 (compile), jgoodies:forms:jar:1.0.5 (compile),
jgoodies:looks:jar:1.3.1 (compile)]: Failed to read artifact descriptor for com.caucho:resin-hessian:jar:3.1.6:
Could not transfer artifact com.caucho:resin-hessian:pom:3.1.6 from/to objectstyle (http://maven.objectstyle.org/nexus/content/groups/cayenne-deps):
Failed to transfer file: http://maven.objectstyle.org/nexus/content/groups/cayenne-deps/com/caucho/resin-hessian/3.1.6/resin-hessian-3.1.6.pom.
Return code is: 502, ReasonPhrase:Proxy Error. -> [Help 1]
org.apache.maven.lifecycle.LifecycleExecutionException: Failed to execute goal on project
maven-cayenne-build-plugin: Could not resolve dependencies for project org.apache.cayenne.build-tools:maven-cayenne-build-plugin:maven-plugin:3.1.1-SNAPSHOT:
Failed to collect dependencies for [org.apache.maven:maven-archiver:jar:2.2 (compile), org.apache.maven:maven-plugin-api:jar:2.0.4
(compile), velocity:velocity:jar:1.4 (compile), com.caucho:resin-hessian:jar:3.1.6 (provided),
mockrunner:mockrunner:jar:0.4.1 (test), org.objectstyle:jdbc4-compat:jar:1.0 (provided), opensymphony:oscache:jar:2.3.2
(provided), foundrylogic.vpp:vpp:jar:2.2.1 (compile), jgoodies:forms:jar:1.0.5 (compile),
jgoodies:looks:jar:1.3.1 (compile)]
	at org.apache.maven.lifecycle.internal.LifecycleDependencyResolver.getDependencies(LifecycleDependencyResolver.java:210)
	at org.apache.maven.lifecycle.internal.LifecycleDependencyResolver.resolveProjectDependencies(LifecycleDependencyResolver.java:117)
	at org.apache.maven.lifecycle.internal.MojoExecutor.ensureDependenciesAreResolved(MojoExecutor.java:258)
	at org.apache.maven.lifecycle.internal.MojoExecutor.execute(MojoExecutor.java:201)
	at org.apache.maven.lifecycle.internal.MojoExecutor.execute(MojoExecutor.java:153)
	at org.apache.maven.lifecycle.internal.MojoExecutor.execute(MojoExecutor.java:145)
	at org.apache.maven.lifecycle.internal.LifecycleModuleBuilder.buildProject(LifecycleModuleBuilder.java:84)
	at org.apache.maven.lifecycle.internal.LifecycleModuleBuilder.buildProject(LifecycleModuleBuilder.java:59)
	at org.apache.maven.lifecycle.internal.LifecycleStarter.singleThreadedBuild(LifecycleStarter.java:183)
	at org.apache.maven.lifecycle.internal.LifecycleStarter.execute(LifecycleStarter.java:161)
	at org.apache.maven.DefaultMaven.doExecute(DefaultMaven.java:320)
	at org.apache.maven.DefaultMaven.execute(DefaultMaven.java:156)
	at org.apache.maven.cli.MavenCli.execute(MavenCli.java:537)
	at org.apache.maven.cli.MavenCli.doMain(MavenCli.java:196)
	at org.apache.maven.cli.MavenCli.main(MavenCli.java:141)
	at sun.reflect.NativeMethodAccessorImpl.invoke0(Native Method)
	at sun.reflect.NativeMethodAccessorImpl.invoke(NativeMethodAccessorImpl.java:39)
	at sun.reflect.DelegatingMethodAccessorImpl.invoke(DelegatingMethodAccessorImpl.java:25)
	at java.lang.reflect.Method.invoke(Method.java:592)
	at org.codehaus.plexus.classworlds.launcher.Launcher.launchEnhanced(Launcher.java:290)
	at org.codehaus.plexus.classworlds.launcher.Launcher.launch(Launcher.java:230)
	at org.codehaus.plexus.classworlds.launcher.Launcher.mainWithExitCode(Launcher.java:409)
	at org.codehaus.plexus.classworlds.launcher.Launcher.main(Launcher.java:352)
Caused by: org.apache.maven.project.DependencyResolutionException: Could not resolve dependencies
for project org.apache.cayenne.build-tools:maven-cayenne-build-plugin:maven-plugin:3.1.1-SNAPSHOT:
Failed to collect dependencies for [org.apache.maven:maven-archiver:jar:2.2 (compile), org.apache.maven:maven-plugin-api:jar:2.0.4
(compile), velocity:velocity:jar:1.4 (compile), com.caucho:resin-hessian:jar:3.1.6 (provided),
mockrunner:mockrunner:jar:0.4.1 (test), org.objectstyle:jdbc4-compat:jar:1.0 (provided), opensymphony:oscache:jar:2.3.2
(provided), foundrylogic.vpp:vpp:jar:2.2.1 (compile), jgoodies:forms:jar:1.0.5 (compile),
jgoodies:looks:jar:1.3.1 (compile)]
	at org.apache.maven.project.DefaultProjectDependenciesResolver.resolve(DefaultProjectDependenciesResolver.java:158)
	at org.apache.maven.lifecycle.internal.LifecycleDependencyResolver.getDependencies(LifecycleDependencyResolver.java:185)
	... 22 more
Caused by: org.sonatype.aether.collection.DependencyCollectionException: Failed to collect
dependencies for [org.apache.maven:maven-archiver:jar:2.2 (compile), org.apache.maven:maven-plugin-api:jar:2.0.4
(compile), velocity:velocity:jar:1.4 (compile), com.caucho:resin-hessian:jar:3.1.6 (provided),
mockrunner:mockrunner:jar:0.4.1 (test), org.objectstyle:jdbc4-compat:jar:1.0 (provided), opensymphony:oscache:jar:2.3.2
(provided), foundrylogic.vpp:vpp:jar:2.2.1 (compile), jgoodies:forms:jar:1.0.5 (compile),
jgoodies:looks:jar:1.3.1 (compile)]
	at org.sonatype.aether.impl.internal.DefaultDependencyCollector.collectDependencies(DefaultDependencyCollector.java:258)
	at org.sonatype.aether.impl.internal.DefaultRepositorySystem.collectDependencies(DefaultRepositorySystem.java:308)
	at org.apache.maven.project.DefaultProjectDependenciesResolver.resolve(DefaultProjectDependenciesResolver.java:150)
	... 23 more
Caused by: org.sonatype.aether.resolution.ArtifactDescriptorException: Failed to read artifact
descriptor for com.caucho:resin-hessian:jar:3.1.6
	at org.apache.maven.repository.internal.DefaultArtifactDescriptorReader.loadPom(DefaultArtifactDescriptorReader.java:296)
	at org.apache.maven.repository.internal.DefaultArtifactDescriptorReader.readArtifactDescriptor(DefaultArtifactDescriptorReader.java:186)
	at org.sonatype.aether.impl.internal.DefaultDependencyCollector.process(DefaultDependencyCollector.java:412)
	at org.sonatype.aether.impl.internal.DefaultDependencyCollector.collectDependencies(DefaultDependencyCollector.java:240)
	... 25 more
Caused by: org.sonatype.aether.resolution.ArtifactResolutionException: Could not transfer
artifact com.caucho:resin-hessian:pom:3.1.6 from/to objectstyle (http://maven.objectstyle.org/nexus/content/groups/cayenne-deps):
Failed to transfer file: http://maven.objectstyle.org/nexus/content/groups/cayenne-deps/com/caucho/resin-hessian/3.1.6/resin-hessian-3.1.6.pom.
Return code is: 502, ReasonPhrase:Proxy Error.
	at org.sonatype.aether.impl.internal.DefaultArtifactResolver.resolve(DefaultArtifactResolver.java:538)
	at org.sonatype.aether.impl.internal.DefaultArtifactResolver.resolveArtifacts(DefaultArtifactResolver.java:216)
	at org.sonatype.aether.impl.internal.DefaultArtifactResolver.resolveArtifact(DefaultArtifactResolver.java:193)
	at org.apache.maven.repository.internal.DefaultArtifactDescriptorReader.loadPom(DefaultArtifactDescriptorReader.java:281)
	... 28 more
Caused by: org.sonatype.aether.transfer.ArtifactTransferException: Could not transfer artifact
com.caucho:resin-hessian:pom:3.1.6 from/to objectstyle (http://maven.objectstyle.org/nexus/content/groups/cayenne-deps):
Failed to transfer file: http://maven.objectstyle.org/nexus/content/groups/cayenne-deps/com/caucho/resin-hessian/3.1.6/resin-hessian-3.1.6.pom.
Return code is: 502, ReasonPhrase:Proxy Error.
	at org.sonatype.aether.connector.wagon.WagonRepositoryConnector$4.wrap(WagonRepositoryConnector.java:951)
	at org.sonatype.aether.connector.wagon.WagonRepositoryConnector$4.wrap(WagonRepositoryConnector.java:941)
	at org.sonatype.aether.connector.wagon.WagonRepositoryConnector$GetTask.run(WagonRepositoryConnector.java:669)
	at org.sonatype.aether.util.concurrency.RunnableErrorForwarder$1.run(RunnableErrorForwarder.java:60)
	at java.util.concurrent.ThreadPoolExecutor$Worker.runTask(ThreadPoolExecutor.java:651)
	at java.util.concurrent.ThreadPoolExecutor$Worker.run(ThreadPoolExecutor.java:676)
	at java.lang.Thread.run(Thread.java:595)
Caused by: org.apache.maven.wagon.TransferFailedException: Failed to transfer file: http://maven.objectstyle.org/nexus/content/groups/cayenne-deps/com/caucho/resin-hessian/3.1.6/resin-hessian-3.1.6.pom.
Return code is: 502, ReasonPhrase:Proxy Error.
	at org.apache.maven.wagon.shared.http4.AbstractHttpClientWagon.fillInputData(AbstractHttpClientWagon.java:852)
	at org.apache.maven.wagon.StreamWagon.getInputStream(StreamWagon.java:116)
	at org.apache.maven.wagon.StreamWagon.getIfNewer(StreamWagon.java:88)
	at org.apache.maven.wagon.StreamWagon.get(StreamWagon.java:61)
	at org.sonatype.aether.connector.wagon.WagonRepositoryConnector$GetTask.run(WagonRepositoryConnector.java:601)
	... 4 more
[ERROR] 
[ERROR] Re-run Maven using the -X switch to enable full debug logging.
[ERROR] 
[ERROR] For more information about the errors and possible solutions, please read the following
articles:
[ERROR] [Help 1] http://cwiki.apache.org/confluence/display/MAVEN/DependencyResolutionException
[ERROR] 
[ERROR] After correcting the problems, you can resume the build with the command
[ERROR]   mvn <goals> -rf :maven-cayenne-build-plugin
Build step 'Invoke top-level Maven targets' marked build as failure

Mime
View raw message