cayenne-commits mailing list archives

Site index · List index
Message view « Date » · « Thread »
Top « Date » · « Thread »
From Apache Jenkins Server <jenk...@builds.apache.org>
Subject Build failed in Jenkins: cayenne-master » h2,JDK 1.7 (latest),Ubuntu #247
Date Sun, 13 Sep 2015 19:42:39 GMT
See <https://builds.apache.org/job/cayenne-master/cayenneTestConnection=h2,jdk=JDK%201.7%20(latest),label=Ubuntu/247/changes>

Changes:

[aadamchik] CAY-2027 Support for Expression outer join syntax in EJBQL

------------------------------------------
[...truncated 28810 lines...]
[main] INFO org.apache.cayenne.log.CommonsJdbcEventLogger - +++ transaction committed.
[main] INFO org.apache.cayenne.configuration.XMLDataChannelDescriptorLoader - Loading XML
configuration resource from <https://builds.apache.org/job/cayenne-master/cayenneTestConnection=h2,jdk=JDK%201.7%20(latest),label=Ubuntu/ws/cayenne-server/target/test-classes/cayenne-numeric-types.xml>
[main] INFO org.apache.cayenne.configuration.XMLDataChannelDescriptorLoader - Loading XML
DataMap resource from <https://builds.apache.org/job/cayenne-master/cayenneTestConnection=h2,jdk=JDK%201.7%20(latest),label=Ubuntu/ws/cayenne-server/target/test-classes/numeric-types.map.xml>
[main] INFO org.apache.cayenne.configuration.XMLDataChannelDescriptorLoader - Loading XML
configuration resource from <https://builds.apache.org/job/cayenne-master/cayenneTestConnection=h2,jdk=JDK%201.7%20(latest),label=Ubuntu/ws/cayenne-server/target/test-classes/cayenne-numeric-types.xml>
[main] INFO org.apache.cayenne.configuration.XMLDataChannelDescriptorLoader - Loading XML
DataMap resource from <https://builds.apache.org/job/cayenne-master/cayenneTestConnection=h2,jdk=JDK%201.7%20(latest),label=Ubuntu/ws/cayenne-server/target/test-classes/numeric-types.map.xml>
[main] INFO org.apache.cayenne.test.jdbc.UtilityLogger - delete from FLOAT_TEST
[main] INFO org.apache.cayenne.test.jdbc.UtilityLogger - delete from LONG_ENTITY
[main] INFO org.apache.cayenne.test.jdbc.UtilityLogger - delete from DECIMAL_PK_TST
[main] INFO org.apache.cayenne.test.jdbc.UtilityLogger - delete from SMALLINT_TEST
[main] INFO org.apache.cayenne.test.jdbc.UtilityLogger - delete from BOOLEAN_TEST
[main] INFO org.apache.cayenne.test.jdbc.UtilityLogger - delete from BIGINTEGER_ENTITY
[main] INFO org.apache.cayenne.test.jdbc.UtilityLogger - delete from BIGDECIMAL_ENTITY
[main] INFO org.apache.cayenne.test.jdbc.UtilityLogger - delete from BIT_TEST
[main] INFO org.apache.cayenne.test.jdbc.UtilityLogger - delete from TINYINT_TEST
[main] INFO org.apache.cayenne.log.CommonsJdbcEventLogger - --- transaction started.
[main] INFO org.apache.cayenne.log.CommonsJdbcEventLogger - SELECT NEXT VALUE FOR pk_smallint_test
[main] INFO org.apache.cayenne.log.CommonsJdbcEventLogger - INSERT INTO SMALLINT_TEST (ID,
SMALLINT_COL) VALUES (?, ?)
[main] INFO org.apache.cayenne.log.CommonsJdbcEventLogger - [bind: 1->ID:200, 2->SMALLINT_COL:1]
[main] INFO org.apache.cayenne.log.CommonsJdbcEventLogger - === updated 1 row.
[main] INFO org.apache.cayenne.log.CommonsJdbcEventLogger - +++ transaction committed.
[main] INFO org.apache.cayenne.configuration.XMLDataChannelDescriptorLoader - Loading XML
configuration resource from <https://builds.apache.org/job/cayenne-master/cayenneTestConnection=h2,jdk=JDK%201.7%20(latest),label=Ubuntu/ws/cayenne-server/target/test-classes/cayenne-numeric-types.xml>
[main] INFO org.apache.cayenne.configuration.XMLDataChannelDescriptorLoader - Loading XML
DataMap resource from <https://builds.apache.org/job/cayenne-master/cayenneTestConnection=h2,jdk=JDK%201.7%20(latest),label=Ubuntu/ws/cayenne-server/target/test-classes/numeric-types.map.xml>
[main] INFO org.apache.cayenne.configuration.XMLDataChannelDescriptorLoader - Loading XML
configuration resource from <https://builds.apache.org/job/cayenne-master/cayenneTestConnection=h2,jdk=JDK%201.7%20(latest),label=Ubuntu/ws/cayenne-server/target/test-classes/cayenne-numeric-types.xml>
[main] INFO org.apache.cayenne.configuration.XMLDataChannelDescriptorLoader - Loading XML
DataMap resource from <https://builds.apache.org/job/cayenne-master/cayenneTestConnection=h2,jdk=JDK%201.7%20(latest),label=Ubuntu/ws/cayenne-server/target/test-classes/numeric-types.map.xml>
[main] INFO org.apache.cayenne.test.jdbc.UtilityLogger - delete from FLOAT_TEST
[main] INFO org.apache.cayenne.test.jdbc.UtilityLogger - delete from LONG_ENTITY
[main] INFO org.apache.cayenne.test.jdbc.UtilityLogger - delete from DECIMAL_PK_TST
[main] INFO org.apache.cayenne.test.jdbc.UtilityLogger - delete from SMALLINT_TEST
[main] INFO org.apache.cayenne.test.jdbc.UtilityLogger - delete from BOOLEAN_TEST
[main] INFO org.apache.cayenne.test.jdbc.UtilityLogger - delete from BIGINTEGER_ENTITY
[main] INFO org.apache.cayenne.test.jdbc.UtilityLogger - delete from BIGDECIMAL_ENTITY
[main] INFO org.apache.cayenne.test.jdbc.UtilityLogger - delete from BIT_TEST
[main] INFO org.apache.cayenne.test.jdbc.UtilityLogger - delete from TINYINT_TEST
[main] INFO org.apache.cayenne.log.CommonsJdbcEventLogger - --- transaction started.
[main] INFO org.apache.cayenne.log.CommonsJdbcEventLogger - INSERT INTO DECIMAL_PK_TST (DECIMAL_PK,
NAME) VALUES (?, ?)
[main] INFO org.apache.cayenne.log.CommonsJdbcEventLogger - [bind: 1->DECIMAL_PK:1.25,
2->NAME:'o1']
[main] INFO org.apache.cayenne.log.CommonsJdbcEventLogger - === updated 1 row.
[main] INFO org.apache.cayenne.log.CommonsJdbcEventLogger - +++ transaction committed.
[main] INFO org.apache.cayenne.log.CommonsJdbcEventLogger - --- transaction started.
[main] INFO org.apache.cayenne.log.CommonsJdbcEventLogger - DELETE FROM DECIMAL_PK_TST WHERE
DECIMAL_PK = ?
[main] INFO org.apache.cayenne.log.CommonsJdbcEventLogger - [bind: 1->DECIMAL_PK:1.25]
[main] INFO org.apache.cayenne.log.CommonsJdbcEventLogger - === updated 1 row.
[main] INFO org.apache.cayenne.log.CommonsJdbcEventLogger - +++ transaction committed.
[main] INFO org.apache.cayenne.configuration.XMLDataChannelDescriptorLoader - Loading XML
configuration resource from <https://builds.apache.org/job/cayenne-master/cayenneTestConnection=h2,jdk=JDK%201.7%20(latest),label=Ubuntu/ws/cayenne-server/target/test-classes/cayenne-numeric-types.xml>
[main] INFO org.apache.cayenne.configuration.XMLDataChannelDescriptorLoader - Loading XML
DataMap resource from <https://builds.apache.org/job/cayenne-master/cayenneTestConnection=h2,jdk=JDK%201.7%20(latest),label=Ubuntu/ws/cayenne-server/target/test-classes/numeric-types.map.xml>
[main] INFO org.apache.cayenne.configuration.XMLDataChannelDescriptorLoader - Loading XML
configuration resource from <https://builds.apache.org/job/cayenne-master/cayenneTestConnection=h2,jdk=JDK%201.7%20(latest),label=Ubuntu/ws/cayenne-server/target/test-classes/cayenne-numeric-types.xml>
[main] INFO org.apache.cayenne.configuration.XMLDataChannelDescriptorLoader - Loading XML
DataMap resource from <https://builds.apache.org/job/cayenne-master/cayenneTestConnection=h2,jdk=JDK%201.7%20(latest),label=Ubuntu/ws/cayenne-server/target/test-classes/numeric-types.map.xml>
[main] INFO org.apache.cayenne.test.jdbc.UtilityLogger - delete from FLOAT_TEST
[main] INFO org.apache.cayenne.test.jdbc.UtilityLogger - delete from LONG_ENTITY
[main] INFO org.apache.cayenne.test.jdbc.UtilityLogger - delete from DECIMAL_PK_TST
[main] INFO org.apache.cayenne.test.jdbc.UtilityLogger - delete from SMALLINT_TEST
[main] INFO org.apache.cayenne.test.jdbc.UtilityLogger - delete from BOOLEAN_TEST
[main] INFO org.apache.cayenne.test.jdbc.UtilityLogger - delete from BIGINTEGER_ENTITY
[main] INFO org.apache.cayenne.test.jdbc.UtilityLogger - delete from BIGDECIMAL_ENTITY
[main] INFO org.apache.cayenne.test.jdbc.UtilityLogger - delete from BIT_TEST
[main] INFO org.apache.cayenne.test.jdbc.UtilityLogger - delete from TINYINT_TEST
[main] INFO org.apache.cayenne.log.CommonsJdbcEventLogger - --- transaction started.
[main] INFO org.apache.cayenne.log.CommonsJdbcEventLogger - INSERT INTO BOOLEAN_TEST (BOOLEAN_COLUMN,
ID) VALUES (?, ?)
[main] INFO org.apache.cayenne.log.CommonsJdbcEventLogger - [bind: 1->BOOLEAN_COLUMN:'true',
2->ID:203]
[main] INFO org.apache.cayenne.log.CommonsJdbcEventLogger - === updated 1 row.
[main] INFO org.apache.cayenne.log.CommonsJdbcEventLogger - [bind: 1->BOOLEAN_COLUMN:'false',
2->ID:204]
[main] INFO org.apache.cayenne.log.CommonsJdbcEventLogger - === updated 1 row.
[main] INFO org.apache.cayenne.log.CommonsJdbcEventLogger - +++ transaction committed.
[main] INFO org.apache.cayenne.log.CommonsJdbcEventLogger - --- transaction started.
[main] INFO org.apache.cayenne.log.CommonsJdbcEventLogger - SELECT t0.BOOLEAN_COLUMN, t0.ID
FROM BOOLEAN_TEST t0 WHERE t0.BOOLEAN_COLUMN = ? [bind: 1->BOOLEAN_COLUMN:'true']
[main] INFO org.apache.cayenne.log.CommonsJdbcEventLogger - === returned 1 row. - took 1 ms.
[main] INFO org.apache.cayenne.log.CommonsJdbcEventLogger - +++ transaction committed.
[main] INFO org.apache.cayenne.log.CommonsJdbcEventLogger - --- transaction started.
[main] INFO org.apache.cayenne.log.CommonsJdbcEventLogger - SELECT t0.BOOLEAN_COLUMN, t0.ID
FROM BOOLEAN_TEST t0 WHERE t0.BOOLEAN_COLUMN = ? [bind: 1->BOOLEAN_COLUMN:'false']
[main] INFO org.apache.cayenne.log.CommonsJdbcEventLogger - === returned 1 row. - took 0 ms.
[main] INFO org.apache.cayenne.log.CommonsJdbcEventLogger - +++ transaction committed.
[main] INFO org.apache.cayenne.configuration.XMLDataChannelDescriptorLoader - Loading XML
configuration resource from <https://builds.apache.org/job/cayenne-master/cayenneTestConnection=h2,jdk=JDK%201.7%20(latest),label=Ubuntu/ws/cayenne-server/target/test-classes/cayenne-numeric-types.xml>
[main] INFO org.apache.cayenne.configuration.XMLDataChannelDescriptorLoader - Loading XML
DataMap resource from <https://builds.apache.org/job/cayenne-master/cayenneTestConnection=h2,jdk=JDK%201.7%20(latest),label=Ubuntu/ws/cayenne-server/target/test-classes/numeric-types.map.xml>
[main] INFO org.apache.cayenne.configuration.XMLDataChannelDescriptorLoader - Loading XML
configuration resource from <https://builds.apache.org/job/cayenne-master/cayenneTestConnection=h2,jdk=JDK%201.7%20(latest),label=Ubuntu/ws/cayenne-server/target/test-classes/cayenne-numeric-types.xml>
[main] INFO org.apache.cayenne.configuration.XMLDataChannelDescriptorLoader - Loading XML
DataMap resource from <https://builds.apache.org/job/cayenne-master/cayenneTestConnection=h2,jdk=JDK%201.7%20(latest),label=Ubuntu/ws/cayenne-server/target/test-classes/numeric-types.map.xml>
[main] INFO org.apache.cayenne.test.jdbc.UtilityLogger - delete from FLOAT_TEST
[main] INFO org.apache.cayenne.test.jdbc.UtilityLogger - delete from LONG_ENTITY
[main] INFO org.apache.cayenne.test.jdbc.UtilityLogger - delete from DECIMAL_PK_TST
[main] INFO org.apache.cayenne.test.jdbc.UtilityLogger - delete from SMALLINT_TEST
[main] INFO org.apache.cayenne.test.jdbc.UtilityLogger - delete from BOOLEAN_TEST
[main] INFO org.apache.cayenne.test.jdbc.UtilityLogger - delete from BIGINTEGER_ENTITY
[main] INFO org.apache.cayenne.test.jdbc.UtilityLogger - delete from BIGDECIMAL_ENTITY
[main] INFO org.apache.cayenne.test.jdbc.UtilityLogger - delete from BIT_TEST
[main] INFO org.apache.cayenne.test.jdbc.UtilityLogger - delete from TINYINT_TEST
[main] INFO org.apache.cayenne.test.jdbc.UtilityLogger - INSERT INTO TINYINT_TEST (ID, TINYINT_COL)
VALUES (?, ?)
[main] INFO org.apache.cayenne.test.jdbc.UtilityLogger - INSERT INTO TINYINT_TEST (ID, TINYINT_COL)
VALUES (?, ?)
[main] INFO org.apache.cayenne.log.CommonsJdbcEventLogger - --- transaction started.
[main] INFO org.apache.cayenne.log.CommonsJdbcEventLogger - SELECT t0.TINYINT_COL, t0.ID FROM
TINYINT_TEST t0 WHERE t0.TINYINT_COL = ? [bind: 1->TINYINT_COL:51]
[main] INFO org.apache.cayenne.log.CommonsJdbcEventLogger - === returned 1 row. - took 0 ms.
[main] INFO org.apache.cayenne.log.CommonsJdbcEventLogger - +++ transaction committed.
[main] INFO org.apache.cayenne.configuration.XMLDataChannelDescriptorLoader - Loading XML
configuration resource from <https://builds.apache.org/job/cayenne-master/cayenneTestConnection=h2,jdk=JDK%201.7%20(latest),label=Ubuntu/ws/cayenne-server/target/test-classes/cayenne-numeric-types.xml>
[main] INFO org.apache.cayenne.configuration.XMLDataChannelDescriptorLoader - Loading XML
DataMap resource from <https://builds.apache.org/job/cayenne-master/cayenneTestConnection=h2,jdk=JDK%201.7%20(latest),label=Ubuntu/ws/cayenne-server/target/test-classes/numeric-types.map.xml>
[main] INFO org.apache.cayenne.configuration.XMLDataChannelDescriptorLoader - Loading XML
configuration resource from <https://builds.apache.org/job/cayenne-master/cayenneTestConnection=h2,jdk=JDK%201.7%20(latest),label=Ubuntu/ws/cayenne-server/target/test-classes/cayenne-numeric-types.xml>
[main] INFO org.apache.cayenne.configuration.XMLDataChannelDescriptorLoader - Loading XML
DataMap resource from <https://builds.apache.org/job/cayenne-master/cayenneTestConnection=h2,jdk=JDK%201.7%20(latest),label=Ubuntu/ws/cayenne-server/target/test-classes/numeric-types.map.xml>
[main] INFO org.apache.cayenne.test.jdbc.UtilityLogger - delete from FLOAT_TEST
[main] INFO org.apache.cayenne.test.jdbc.UtilityLogger - delete from LONG_ENTITY
[main] INFO org.apache.cayenne.test.jdbc.UtilityLogger - delete from DECIMAL_PK_TST
[main] INFO org.apache.cayenne.test.jdbc.UtilityLogger - delete from SMALLINT_TEST
[main] INFO org.apache.cayenne.test.jdbc.UtilityLogger - delete from BOOLEAN_TEST
[main] INFO org.apache.cayenne.test.jdbc.UtilityLogger - delete from BIGINTEGER_ENTITY
[main] INFO org.apache.cayenne.test.jdbc.UtilityLogger - delete from BIGDECIMAL_ENTITY
[main] INFO org.apache.cayenne.test.jdbc.UtilityLogger - delete from BIT_TEST
[main] INFO org.apache.cayenne.test.jdbc.UtilityLogger - delete from TINYINT_TEST
[main] INFO org.apache.cayenne.log.CommonsJdbcEventLogger - --- transaction started.
[main] INFO org.apache.cayenne.log.CommonsJdbcEventLogger - INSERT INTO DECIMAL_PK_TST (DECIMAL_PK,
NAME) VALUES (?, ?)
[main] INFO org.apache.cayenne.log.CommonsJdbcEventLogger - [bind: 1->DECIMAL_PK:1.25,
2->NAME:'o2']
[main] INFO org.apache.cayenne.log.CommonsJdbcEventLogger - === updated 1 row.
[main] INFO org.apache.cayenne.log.CommonsJdbcEventLogger - +++ transaction committed.
Tests run: 11, Failures: 0, Errors: 0, Skipped: 0, Time elapsed: 0.106 sec - in org.apache.cayenne.access.NumericTypesIT
Running org.apache.cayenne.access.DataRowStoreIT
[main] INFO org.apache.cayenne.configuration.XMLDataChannelDescriptorLoader - Loading XML
configuration resource from <https://builds.apache.org/job/cayenne-master/cayenneTestConnection=h2,jdk=JDK%201.7%20(latest),label=Ubuntu/ws/cayenne-server/target/test-classes/cayenne-testmap.xml>
[main] INFO org.apache.cayenne.configuration.XMLDataChannelDescriptorLoader - Loading XML
DataMap resource from <https://builds.apache.org/job/cayenne-master/cayenneTestConnection=h2,jdk=JDK%201.7%20(latest),label=Ubuntu/ws/cayenne-server/target/test-classes/testmap.map.xml>
[main] INFO org.apache.cayenne.map.EntityResolver - added runtime complimentary DbRelationship
from ARTIST to PAINTING1
[main] INFO org.apache.cayenne.configuration.XMLDataChannelDescriptorLoader - Loading XML
configuration resource from <https://builds.apache.org/job/cayenne-master/cayenneTestConnection=h2,jdk=JDK%201.7%20(latest),label=Ubuntu/ws/cayenne-server/target/test-classes/cayenne-testmap.xml>
[main] INFO org.apache.cayenne.configuration.XMLDataChannelDescriptorLoader - Loading XML
DataMap resource from <https://builds.apache.org/job/cayenne-master/cayenneTestConnection=h2,jdk=JDK%201.7%20(latest),label=Ubuntu/ws/cayenne-server/target/test-classes/testmap.map.xml>
[main] INFO org.apache.cayenne.test.jdbc.UtilityLogger - delete from ARTIST_EXHIBIT
[main] INFO org.apache.cayenne.test.jdbc.UtilityLogger - delete from PAINTING_INFO
[main] INFO org.apache.cayenne.test.jdbc.UtilityLogger - delete from ARTIST_GROUP
[main] INFO org.apache.cayenne.test.jdbc.UtilityLogger - delete from EXHIBIT
[main] INFO org.apache.cayenne.test.jdbc.UtilityLogger - delete from PAINTING
[main] INFO org.apache.cayenne.test.jdbc.UtilityLogger - delete from PAINTING1
[main] INFO org.apache.cayenne.test.jdbc.UtilityLogger - delete from ARTIST
[main] INFO org.apache.cayenne.test.jdbc.UtilityLogger - delete from ARTIST_CT
[main] INFO org.apache.cayenne.test.jdbc.UtilityLogger - delete from NULL_TEST
[main] INFO org.apache.cayenne.test.jdbc.UtilityLogger - delete from GALLERY
[main] INFO org.apache.cayenne.test.jdbc.UtilityLogger - delete from ARTGROUP
[main] INFO org.apache.cayenne.test.jdbc.UtilityLogger - delete from GENERATED_COLUMN
[DownHandler (UDP)] INFO org.jgroups.protocols.UDP - unicast sockets will use interface 67.195.81.186
#
# A fatal error has been detected by the Java Runtime Environment:
#
#  SIGSEGV (0xb) at pc=0xae91252c, pid=17970, tid=2798316352
#
# JRE version: 7.0_25-b15
# Java VM: Java HotSpot(TM) Server VM (23.25-b01 mixed mode linux-x86 )
# Problematic frame:
# C  [libnet.so+0x352c]
[error occurred during error reporting (printing problematic frame), id 0xb]
# Failed to write core dump. Core dumps have been disabled. To enable core dumping, try "ulimit
-c unlimited" before starting Java again
#
# An error report file with more information is saved as:
# <https://builds.apache.org/job/cayenne-master/cayenneTestConnection=h2,jdk=JDK%201.7%20(latest),label=Ubuntu/ws/cayenne-server/hs_err_pid17970.log>
# [ timer expired, abort... ]
Aborted

Results :

Tests run: 682, Failures: 0, Errors: 0, Skipped: 0

[INFO] ------------------------------------------------------------------------
[INFO] Reactor Summary:
[INFO] 
[INFO] Cayenne ........................................... SUCCESS [0.275s]
[INFO] Cayenne Build Tools Parent ........................ SUCCESS [0.009s]
[INFO] Cayenne License and Notice Bundle ................. SUCCESS [1.049s]
[INFO] Common Unit Test Utilities ........................ SUCCESS [0.907s]
[INFO] Cayenne Code Checkers ............................. SUCCESS [0.063s]
[INFO] Cayenne Dependency Injection Container ............ SUCCESS [10.701s]
[INFO] Cayenne Server .................................... FAILURE [3:08.293s]
[INFO] Cayenne ROP Client ................................ SKIPPED
[INFO] Cayenne Project ................................... SKIPPED
[INFO] Cayenne Tools ..................................... SKIPPED
[INFO] Cayenne Lifecycle Utilities ....................... SKIPPED
[INFO] Cayenne Maven Plugins ............................. SKIPPED
[INFO] Cayenne Maven Plugin .............................. SKIPPED
[INFO] Cayenne Cryptography Extensions ................... SKIPPED
[INFO] Cayenne Joda Extensions ........................... SKIPPED
[INFO] Cayenne DBCP2 Extension ........................... SKIPPED
[INFO] Cayenne Integration Tests Parent .................. SKIPPED
[INFO] Integration Tests - Cayenne Tools ................. SKIPPED
[INFO] Cayenne Modeler Parent ............................ SKIPPED
[INFO] Cayenne WebObjects Compatibility Library .......... SKIPPED
[INFO] Cayenne Modeler ................................... SKIPPED
[INFO] Cayenne Modeler Generic and Windows Extensions .... SKIPPED
[INFO] Cayenne Modeler Generic ........................... SKIPPED
[INFO] Cayenne Modeler Mac OS X Extensions ............... SKIPPED
[INFO] Cayenne Modeler Mac OS X .......................... SKIPPED
[INFO] Cayenne Modeler Windows ........................... SKIPPED
[INFO] Cayenne Modeler Maven Plugin ...................... SKIPPED
[INFO] Cayenne Tutorials ................................. SKIPPED
[INFO] Cayenne Tutorial .................................. SKIPPED
[INFO] Cayenne ROP Server Tutorial ....................... SKIPPED
[INFO] Cayenne ROP Client Tutorial ....................... SKIPPED
[INFO] Cayenne Documenation Parent ....................... SKIPPED
[INFO] Cayenne Documentation ............................. SKIPPED
[INFO] Cayenne Docbook Documentation ..................... SKIPPED
[INFO] Docbook: Cayenne Stylesheets ...................... SKIPPED
[INFO] Docbook: Cayenne Guide ............................ SKIPPED
[INFO] Docbook: Getting Started with Cayenne ............. SKIPPED
[INFO] Docbook: Getting Started with Cayenne ROP ......... SKIPPED
[INFO] Docbook: Cayenne New Features and Upgrade Guide ... SKIPPED
[INFO] Cayenne Release Assembly .......................... SKIPPED
[INFO] ------------------------------------------------------------------------
[INFO] BUILD FAILURE
[INFO] ------------------------------------------------------------------------
[INFO] Total time: 3:22.664s
[INFO] Finished at: Sun Sep 13 19:39:38 UTC 2015
[INFO] Final Memory: 53M/393M
[INFO] ------------------------------------------------------------------------
[ERROR] Failed to execute goal org.apache.maven.plugins:maven-failsafe-plugin:2.17:integration-test
(integration-test) on project cayenne-server: Execution integration-test of goal org.apache.maven.plugins:maven-failsafe-plugin:2.17:integration-test
failed: The forked VM terminated without properly saying goodbye. VM crash or System.exit
called?
[ERROR] Command was /bin/sh -c cd "<https://builds.apache.org/job/cayenne-master/cayenneTestConnection=h2,jdk=JDK%201.7%20(latest),label=Ubuntu/ws/cayenne-server">
&& /home/jenkins/tools/java/jdk1.7.0_25-32/jre/bin/java -jar '<https://builds.apache.org/job/cayenne-master/cayenneTestConnection=h2,jdk=JDK%201.7%20(latest),label=Ubuntu/ws/cayenne-server/target/surefire/surefirebooter8803210276697172620.jar'>
'<https://builds.apache.org/job/cayenne-master/cayenneTestConnection=h2,jdk=JDK%201.7%20(latest),label=Ubuntu/ws/cayenne-server/target/surefire/surefire2775087208390055452tmp'>
'<https://builds.apache.org/job/cayenne-master/cayenneTestConnection=h2,jdk=JDK%201.7%20(latest),label=Ubuntu/ws/cayenne-server/target/surefire/surefire_086046578498045414tmp'>
[ERROR] -> [Help 1]
org.apache.maven.lifecycle.LifecycleExecutionException: Failed to execute goal org.apache.maven.plugins:maven-failsafe-plugin:2.17:integration-test
(integration-test) on project cayenne-server: Execution integration-test of goal org.apache.maven.plugins:maven-failsafe-plugin:2.17:integration-test
failed: The forked VM terminated without properly saying goodbye. VM crash or System.exit
called?
Command was /bin/sh -c cd "<https://builds.apache.org/job/cayenne-master/cayenneTestConnection=h2,jdk=JDK%201.7%20(latest),label=Ubuntu/ws/cayenne-server">
&& /home/jenkins/tools/java/jdk1.7.0_25-32/jre/bin/java -jar '<https://builds.apache.org/job/cayenne-master/cayenneTestConnection=h2,jdk=JDK%201.7%20(latest),label=Ubuntu/ws/cayenne-server/target/surefire/surefirebooter8803210276697172620.jar'>
'<https://builds.apache.org/job/cayenne-master/cayenneTestConnection=h2,jdk=JDK%201.7%20(latest),label=Ubuntu/ws/cayenne-server/target/surefire/surefire2775087208390055452tmp'>
'<https://builds.apache.org/job/cayenne-master/cayenneTestConnection=h2,jdk=JDK%201.7%20(latest),label=Ubuntu/ws/cayenne-server/target/surefire/surefire_086046578498045414tmp'>
	at org.apache.maven.lifecycle.internal.MojoExecutor.execute(MojoExecutor.java:225)
	at org.apache.maven.lifecycle.internal.MojoExecutor.execute(MojoExecutor.java:153)
	at org.apache.maven.lifecycle.internal.MojoExecutor.execute(MojoExecutor.java:145)
	at org.apache.maven.lifecycle.internal.LifecycleModuleBuilder.buildProject(LifecycleModuleBuilder.java:84)
	at org.apache.maven.lifecycle.internal.LifecycleModuleBuilder.buildProject(LifecycleModuleBuilder.java:59)
	at org.apache.maven.lifecycle.internal.LifecycleStarter.singleThreadedBuild(LifecycleStarter.java:183)
	at org.apache.maven.lifecycle.internal.LifecycleStarter.execute(LifecycleStarter.java:161)
	at org.apache.maven.DefaultMaven.doExecute(DefaultMaven.java:320)
	at org.apache.maven.DefaultMaven.execute(DefaultMaven.java:156)
	at org.apache.maven.cli.MavenCli.execute(MavenCli.java:537)
	at org.apache.maven.cli.MavenCli.doMain(MavenCli.java:196)
	at org.apache.maven.cli.MavenCli.main(MavenCli.java:141)
	at sun.reflect.NativeMethodAccessorImpl.invoke0(Native Method)
	at sun.reflect.NativeMethodAccessorImpl.invoke(NativeMethodAccessorImpl.java:57)
	at sun.reflect.DelegatingMethodAccessorImpl.invoke(DelegatingMethodAccessorImpl.java:43)
	at java.lang.reflect.Method.invoke(Method.java:606)
	at org.codehaus.plexus.classworlds.launcher.Launcher.launchEnhanced(Launcher.java:290)
	at org.codehaus.plexus.classworlds.launcher.Launcher.launch(Launcher.java:230)
	at org.codehaus.plexus.classworlds.launcher.Launcher.mainWithExitCode(Launcher.java:409)
	at org.codehaus.plexus.classworlds.launcher.Launcher.main(Launcher.java:352)
Caused by: org.apache.maven.plugin.PluginExecutionException: Execution integration-test of
goal org.apache.maven.plugins:maven-failsafe-plugin:2.17:integration-test failed: The forked
VM terminated without properly saying goodbye. VM crash or System.exit called?
Command was /bin/sh -c cd "<https://builds.apache.org/job/cayenne-master/cayenneTestConnection=h2,jdk=JDK%201.7%20(latest),label=Ubuntu/ws/cayenne-server">
&& /home/jenkins/tools/java/jdk1.7.0_25-32/jre/bin/java -jar '<https://builds.apache.org/job/cayenne-master/cayenneTestConnection=h2,jdk=JDK%201.7%20(latest),label=Ubuntu/ws/cayenne-server/target/surefire/surefirebooter8803210276697172620.jar'>
'<https://builds.apache.org/job/cayenne-master/cayenneTestConnection=h2,jdk=JDK%201.7%20(latest),label=Ubuntu/ws/cayenne-server/target/surefire/surefire2775087208390055452tmp'>
'<https://builds.apache.org/job/cayenne-master/cayenneTestConnection=h2,jdk=JDK%201.7%20(latest),label=Ubuntu/ws/cayenne-server/target/surefire/surefire_086046578498045414tmp'>
	at org.apache.maven.plugin.DefaultBuildPluginManager.executeMojo(DefaultBuildPluginManager.java:110)
	at org.apache.maven.lifecycle.internal.MojoExecutor.execute(MojoExecutor.java:209)
	... 19 more
Caused by: java.lang.RuntimeException: The forked VM terminated without properly saying goodbye.
VM crash or System.exit called?
Command was /bin/sh -c cd "<https://builds.apache.org/job/cayenne-master/cayenneTestConnection=h2,jdk=JDK%201.7%20(latest),label=Ubuntu/ws/cayenne-server">
&& /home/jenkins/tools/java/jdk1.7.0_25-32/jre/bin/java -jar '<https://builds.apache.org/job/cayenne-master/cayenneTestConnection=h2,jdk=JDK%201.7%20(latest),label=Ubuntu/ws/cayenne-server/target/surefire/surefirebooter8803210276697172620.jar'>
'<https://builds.apache.org/job/cayenne-master/cayenneTestConnection=h2,jdk=JDK%201.7%20(latest),label=Ubuntu/ws/cayenne-server/target/surefire/surefire2775087208390055452tmp'>
'<https://builds.apache.org/job/cayenne-master/cayenneTestConnection=h2,jdk=JDK%201.7%20(latest),label=Ubuntu/ws/cayenne-server/target/surefire/surefire_086046578498045414tmp'>
	at org.apache.maven.plugin.surefire.booterclient.ForkStarter.fork(ForkStarter.java:485)
	at org.apache.maven.plugin.surefire.booterclient.ForkStarter.fork(ForkStarter.java:352)
	at org.apache.maven.plugin.surefire.booterclient.ForkStarter.run(ForkStarter.java:158)
	at org.apache.maven.plugin.surefire.AbstractSurefireMojo.executeProvider(AbstractSurefireMojo.java:967)
	at org.apache.maven.plugin.surefire.AbstractSurefireMojo.executeAfterPreconditionsChecked(AbstractSurefireMojo.java:831)
	at org.apache.maven.plugin.surefire.AbstractSurefireMojo.execute(AbstractSurefireMojo.java:729)
	at org.apache.maven.plugin.DefaultBuildPluginManager.executeMojo(DefaultBuildPluginManager.java:101)
	... 20 more
[ERROR] 
[ERROR] Re-run Maven using the -X switch to enable full debug logging.
[ERROR] 
[ERROR] For more information about the errors and possible solutions, please read the following
articles:
[ERROR] [Help 1] http://cwiki.apache.org/confluence/display/MAVEN/PluginExecutionException
[ERROR] 
[ERROR] After correcting the problems, you can resume the build with the command
[ERROR]   mvn <goals> -rf :cayenne-server
Build step 'Invoke top-level Maven targets' marked build as failure
Recording test results

Mime
View raw message