cayenne-commits mailing list archives

Site index · List index
Message view « Date » · « Thread »
Top « Date » · « Thread »
From Apache Jenkins Server <jenk...@builds.apache.org>
Subject Build failed in Jenkins: cayenne-master » h2,JDK 1.7 (latest),Ubuntu #205
Date Sun, 03 May 2015 10:35:18 GMT
See <https://builds.apache.org/job/cayenne-master/cayenneTestConnection=h2,jdk=JDK%201.7%20(latest),label=Ubuntu/205/changes>

Changes:

[aadamchik] CAY-2010 Splitting DataSourceBuilder from ServerRuntimeBuilder

[aadamchik] CAY-2009 Non-blocking connection pool

------------------------------------------
[...truncated 55948 lines...]
[main] INFO org.apache.cayenne.log.CommonsJdbcEventLogger - === updated 1 row.
[main] INFO org.apache.cayenne.log.CommonsJdbcEventLogger - [bind: 1->FT2_ID:201, 2->FT3_ID:202,
3->NAME:'t031']
[main] INFO org.apache.cayenne.log.CommonsJdbcEventLogger - === updated 1 row.
[main] INFO org.apache.cayenne.log.CommonsJdbcEventLogger - +++ transaction committed.
[main] INFO org.apache.cayenne.log.CommonsJdbcEventLogger - --- transaction started.
[main] INFO org.apache.cayenne.log.CommonsJdbcEventLogger - SELECT DISTINCT t0.NAME, t0.FT1_ID
FROM FLATTENED_TEST_1 t0 JOIN FLATTENED_TEST_2 t1 ON (t0.FT1_ID = t1.FT1_ID) JOIN FLATTENED_TEST_3
t2 ON (t1.FT2_ID = t2.FT2_ID) WHERE t2.NAME = ? [bind: 1->NAME:'t031']
[main] INFO org.apache.cayenne.log.CommonsJdbcEventLogger - === returned 1 row. - took 1 ms.
[main] INFO org.apache.cayenne.log.CommonsJdbcEventLogger - +++ transaction committed.
[main] INFO org.apache.cayenne.log.CommonsJdbcEventLogger - --- transaction started.
[main] INFO org.apache.cayenne.log.CommonsJdbcEventLogger - SELECT DISTINCT t0.NAME, t0.FT1_ID
FROM FLATTENED_TEST_1 t0 JOIN FLATTENED_TEST_2 t1 ON (t0.FT1_ID = t1.FT1_ID) JOIN FLATTENED_TEST_3
t2 ON (t1.FT2_ID = t2.FT2_ID) WHERE t2.FT3_ID = ? [bind: 1->FT3_ID:200]
[main] INFO org.apache.cayenne.log.CommonsJdbcEventLogger - === returned 1 row. - took 0 ms.
[main] INFO org.apache.cayenne.log.CommonsJdbcEventLogger - +++ transaction committed.
[main] INFO org.apache.cayenne.configuration.XMLDataChannelDescriptorLoader - Loading XML
configuration resource from <https://builds.apache.org/job/cayenne-master/cayenneTestConnection=h2,jdk=JDK%201.7%20(latest),label=Ubuntu/ws/cayenne-server/target/test-classes/cayenne-relationships-flattened.xml>
[main] INFO org.apache.cayenne.configuration.XMLDataChannelDescriptorLoader - Loading XML
DataMap resource from <https://builds.apache.org/job/cayenne-master/cayenneTestConnection=h2,jdk=JDK%201.7%20(latest),label=Ubuntu/ws/cayenne-server/target/test-classes/relationships-flattened.map.xml>
[main] INFO org.apache.cayenne.configuration.XMLDataChannelDescriptorLoader - Loading XML
configuration resource from <https://builds.apache.org/job/cayenne-master/cayenneTestConnection=h2,jdk=JDK%201.7%20(latest),label=Ubuntu/ws/cayenne-server/target/test-classes/cayenne-relationships-flattened.xml>
[main] INFO org.apache.cayenne.configuration.XMLDataChannelDescriptorLoader - Loading XML
DataMap resource from <https://builds.apache.org/job/cayenne-master/cayenneTestConnection=h2,jdk=JDK%201.7%20(latest),label=Ubuntu/ws/cayenne-server/target/test-classes/relationships-flattened.map.xml>
[main] INFO org.apache.cayenne.test.jdbc.UtilityLogger - delete from FLATTENED_TEST_4
[main] INFO org.apache.cayenne.test.jdbc.UtilityLogger - delete from COMPLEX_JOIN
[main] INFO org.apache.cayenne.test.jdbc.UtilityLogger - delete from FLATTENED_TEST_3
[main] INFO org.apache.cayenne.test.jdbc.UtilityLogger - delete from FLATTENED_CIRCULAR_JOIN
[main] INFO org.apache.cayenne.test.jdbc.UtilityLogger - delete from FLATTENED_TEST_2
[main] INFO org.apache.cayenne.test.jdbc.UtilityLogger - delete from FLATTENED_TEST_1
[main] INFO org.apache.cayenne.test.jdbc.UtilityLogger - delete from FLATTENED_CIRCULAR
[main] INFO org.apache.cayenne.log.CommonsJdbcEventLogger - --- transaction started.
[main] INFO org.apache.cayenne.log.CommonsJdbcEventLogger - INSERT INTO FLATTENED_TEST_1 (FT1_ID,
NAME) VALUES (?, ?)
[main] INFO org.apache.cayenne.log.CommonsJdbcEventLogger - [bind: 1->FT1_ID:202, 2->NAME:'FT1Name']
[main] INFO org.apache.cayenne.log.CommonsJdbcEventLogger - === updated 1 row.
[main] INFO org.apache.cayenne.log.CommonsJdbcEventLogger - INSERT INTO FLATTENED_TEST_2 (FT1_ID,
FT2_ID, NAME) VALUES (?, ?, ?)
[main] INFO org.apache.cayenne.log.CommonsJdbcEventLogger - [bind: 1->FT1_ID:202, 2->FT2_ID:202,
3->NAME:'FT2Name']
[main] INFO org.apache.cayenne.log.CommonsJdbcEventLogger - === updated 1 row.
[main] INFO org.apache.cayenne.log.CommonsJdbcEventLogger - INSERT INTO FLATTENED_TEST_3 (FT2_ID,
FT3_ID, NAME) VALUES (?, ?, ?)
[main] INFO org.apache.cayenne.log.CommonsJdbcEventLogger - [bind: 1->FT2_ID:202, 2->FT3_ID:203,
3->NAME:'FT3Name']
[main] INFO org.apache.cayenne.log.CommonsJdbcEventLogger - === updated 1 row.
[main] INFO org.apache.cayenne.log.CommonsJdbcEventLogger - +++ transaction committed.
[main] INFO org.apache.cayenne.log.CommonsJdbcEventLogger - --- transaction started.
[main] INFO org.apache.cayenne.log.CommonsJdbcEventLogger - SELECT t0.NAME, t0.FT3_ID, t0.FT2_ID
FROM FLATTENED_TEST_3 t0 WHERE t0.NAME = ? [bind: 1->NAME:'FT3Name']
[main] INFO org.apache.cayenne.log.CommonsJdbcEventLogger - === returned 1 row. - took 0 ms.
[main] INFO org.apache.cayenne.log.CommonsJdbcEventLogger - +++ transaction committed.
[main] INFO org.apache.cayenne.log.CommonsJdbcEventLogger - --- transaction started.
[main] INFO org.apache.cayenne.log.CommonsJdbcEventLogger - SELECT DISTINCT t0.NAME, t0.FT1_ID
FROM FLATTENED_TEST_1 t0 JOIN FLATTENED_TEST_2 t1 ON (t0.FT1_ID = t1.FT1_ID) JOIN FLATTENED_TEST_3
t2 ON (t1.FT2_ID = t2.FT2_ID) WHERE t2.FT3_ID = ? [bind: 1->FT3_ID:203]
[main] INFO org.apache.cayenne.log.CommonsJdbcEventLogger - === returned 1 row. - took 0 ms.
[main] INFO org.apache.cayenne.log.CommonsJdbcEventLogger - +++ transaction committed.
[main] INFO org.apache.cayenne.configuration.XMLDataChannelDescriptorLoader - Loading XML
configuration resource from <https://builds.apache.org/job/cayenne-master/cayenneTestConnection=h2,jdk=JDK%201.7%20(latest),label=Ubuntu/ws/cayenne-server/target/test-classes/cayenne-relationships-flattened.xml>
[main] INFO org.apache.cayenne.configuration.XMLDataChannelDescriptorLoader - Loading XML
DataMap resource from <https://builds.apache.org/job/cayenne-master/cayenneTestConnection=h2,jdk=JDK%201.7%20(latest),label=Ubuntu/ws/cayenne-server/target/test-classes/relationships-flattened.map.xml>
[main] INFO org.apache.cayenne.configuration.XMLDataChannelDescriptorLoader - Loading XML
configuration resource from <https://builds.apache.org/job/cayenne-master/cayenneTestConnection=h2,jdk=JDK%201.7%20(latest),label=Ubuntu/ws/cayenne-server/target/test-classes/cayenne-relationships-flattened.xml>
[main] INFO org.apache.cayenne.configuration.XMLDataChannelDescriptorLoader - Loading XML
DataMap resource from <https://builds.apache.org/job/cayenne-master/cayenneTestConnection=h2,jdk=JDK%201.7%20(latest),label=Ubuntu/ws/cayenne-server/target/test-classes/relationships-flattened.map.xml>
[main] INFO org.apache.cayenne.test.jdbc.UtilityLogger - delete from FLATTENED_TEST_4
[main] INFO org.apache.cayenne.test.jdbc.UtilityLogger - delete from COMPLEX_JOIN
[main] INFO org.apache.cayenne.test.jdbc.UtilityLogger - delete from FLATTENED_TEST_3
[main] INFO org.apache.cayenne.test.jdbc.UtilityLogger - delete from FLATTENED_CIRCULAR_JOIN
[main] INFO org.apache.cayenne.test.jdbc.UtilityLogger - delete from FLATTENED_TEST_2
[main] INFO org.apache.cayenne.test.jdbc.UtilityLogger - delete from FLATTENED_TEST_1
[main] INFO org.apache.cayenne.test.jdbc.UtilityLogger - delete from FLATTENED_CIRCULAR
[main] INFO org.apache.cayenne.log.CommonsJdbcEventLogger - --- transaction started.
[main] INFO org.apache.cayenne.log.CommonsJdbcEventLogger - SELECT NEXT VALUE FOR pk_complex_join
[main] INFO org.apache.cayenne.log.CommonsJdbcEventLogger - INSERT INTO FLATTENED_TEST_1 (FT1_ID,
NAME) VALUES (?, ?)
[main] INFO org.apache.cayenne.log.CommonsJdbcEventLogger - [bind: 1->FT1_ID:203, 2->NAME:'t01']
[main] INFO org.apache.cayenne.log.CommonsJdbcEventLogger - === updated 1 row.
[main] INFO org.apache.cayenne.log.CommonsJdbcEventLogger - INSERT INTO FLATTENED_TEST_3 (FT2_ID,
FT3_ID, NAME) VALUES (?, ?, ?)
[main] INFO org.apache.cayenne.log.CommonsJdbcEventLogger - [bind: 1->FT2_ID:NULL, 2->FT3_ID:204,
3->NAME:'t11']
[main] INFO org.apache.cayenne.log.CommonsJdbcEventLogger - === updated 1 row.
[main] INFO org.apache.cayenne.log.CommonsJdbcEventLogger - [bind: 1->FT2_ID:NULL, 2->FT3_ID:205,
3->NAME:'t12']
[main] INFO org.apache.cayenne.log.CommonsJdbcEventLogger - === updated 1 row.
[main] INFO org.apache.cayenne.log.CommonsJdbcEventLogger - INSERT INTO COMPLEX_JOIN (EXTRA_COLUMN,
FT1_FK, FT3_FK, PK) VALUES (?, ?, ?, ?)
[main] INFO org.apache.cayenne.log.CommonsJdbcEventLogger - [bind: 1->EXTRA_COLUMN:NULL,
2->FT1_FK:203, 3->FT3_FK:204, 4->PK:200]
[main] INFO org.apache.cayenne.log.CommonsJdbcEventLogger - === updated 1 row.
[main] INFO org.apache.cayenne.log.CommonsJdbcEventLogger - [bind: 1->EXTRA_COLUMN:NULL,
2->FT1_FK:203, 3->FT3_FK:205, 4->PK:201]
[main] INFO org.apache.cayenne.log.CommonsJdbcEventLogger - === updated 1 row.
[main] INFO org.apache.cayenne.log.CommonsJdbcEventLogger - +++ transaction committed.
[main] INFO org.apache.cayenne.log.CommonsJdbcEventLogger - --- transaction started.
[main] INFO org.apache.cayenne.log.CommonsJdbcEventLogger - SELECT t0.NAME, t0.FT1_ID FROM
FLATTENED_TEST_1 t0 WHERE t0.FT1_ID = ? [bind: 1->FT1_ID:203]
[main] INFO org.apache.cayenne.log.CommonsJdbcEventLogger - === returned 1 row. - took 0 ms.
[main] INFO org.apache.cayenne.log.CommonsJdbcEventLogger - +++ transaction committed.
[main] INFO org.apache.cayenne.log.CommonsJdbcEventLogger - --- transaction started.
[main] INFO org.apache.cayenne.log.CommonsJdbcEventLogger - SELECT DISTINCT t0.NAME, t0.FT3_ID,
t0.FT2_ID FROM FLATTENED_TEST_3 t0 JOIN COMPLEX_JOIN t1 ON (t0.FT3_ID = t1.FT3_FK) WHERE t1.FT1_FK
= ? [bind: 1->FT1_FK:203]
[main] INFO org.apache.cayenne.log.CommonsJdbcEventLogger - === returned 2 rows. - took 1
ms.
[main] INFO org.apache.cayenne.log.CommonsJdbcEventLogger - +++ transaction committed.
[main] INFO org.apache.cayenne.configuration.XMLDataChannelDescriptorLoader - Loading XML
configuration resource from <https://builds.apache.org/job/cayenne-master/cayenneTestConnection=h2,jdk=JDK%201.7%20(latest),label=Ubuntu/ws/cayenne-server/target/test-classes/cayenne-relationships-flattened.xml>
[main] INFO org.apache.cayenne.configuration.XMLDataChannelDescriptorLoader - Loading XML
DataMap resource from <https://builds.apache.org/job/cayenne-master/cayenneTestConnection=h2,jdk=JDK%201.7%20(latest),label=Ubuntu/ws/cayenne-server/target/test-classes/relationships-flattened.map.xml>
[main] INFO org.apache.cayenne.configuration.XMLDataChannelDescriptorLoader - Loading XML
configuration resource from <https://builds.apache.org/job/cayenne-master/cayenneTestConnection=h2,jdk=JDK%201.7%20(latest),label=Ubuntu/ws/cayenne-server/target/test-classes/cayenne-relationships-flattened.xml>
[main] INFO org.apache.cayenne.configuration.XMLDataChannelDescriptorLoader - Loading XML
DataMap resource from <https://builds.apache.org/job/cayenne-master/cayenneTestConnection=h2,jdk=JDK%201.7%20(latest),label=Ubuntu/ws/cayenne-server/target/test-classes/relationships-flattened.map.xml>
[main] INFO org.apache.cayenne.test.jdbc.UtilityLogger - delete from FLATTENED_TEST_4
[main] INFO org.apache.cayenne.test.jdbc.UtilityLogger - delete from COMPLEX_JOIN
[main] INFO org.apache.cayenne.test.jdbc.UtilityLogger - delete from FLATTENED_TEST_3
[main] INFO org.apache.cayenne.test.jdbc.UtilityLogger - delete from FLATTENED_CIRCULAR_JOIN
[main] INFO org.apache.cayenne.test.jdbc.UtilityLogger - delete from FLATTENED_TEST_2
[main] INFO org.apache.cayenne.test.jdbc.UtilityLogger - delete from FLATTENED_TEST_1
[main] INFO org.apache.cayenne.test.jdbc.UtilityLogger - delete from FLATTENED_CIRCULAR
[main] INFO org.apache.cayenne.test.jdbc.UtilityLogger - INSERT INTO FLATTENED_CIRCULAR (ID)
VALUES (?)
[main] INFO org.apache.cayenne.test.jdbc.UtilityLogger - INSERT INTO FLATTENED_CIRCULAR (ID)
VALUES (?)
[main] INFO org.apache.cayenne.test.jdbc.UtilityLogger - INSERT INTO FLATTENED_CIRCULAR (ID)
VALUES (?)
[main] INFO org.apache.cayenne.test.jdbc.UtilityLogger - INSERT INTO FLATTENED_CIRCULAR_JOIN
(SIDE1_ID, SIDE2_ID) VALUES (?, ?)
[main] INFO org.apache.cayenne.test.jdbc.UtilityLogger - INSERT INTO FLATTENED_CIRCULAR_JOIN
(SIDE1_ID, SIDE2_ID) VALUES (?, ?)
[main] INFO org.apache.cayenne.log.CommonsJdbcEventLogger - --- transaction started.
[main] INFO org.apache.cayenne.log.CommonsJdbcEventLogger - SELECT t0.ID FROM FLATTENED_CIRCULAR
t0 WHERE t0.ID = ? [bind: 1->ID:1]
[main] INFO org.apache.cayenne.log.CommonsJdbcEventLogger - === returned 1 row. - took 0 ms.
[main] INFO org.apache.cayenne.log.CommonsJdbcEventLogger - +++ transaction committed.
[main] INFO org.apache.cayenne.log.CommonsJdbcEventLogger - --- transaction started.
[main] INFO org.apache.cayenne.log.CommonsJdbcEventLogger - SELECT DISTINCT t0.ID FROM FLATTENED_CIRCULAR
t0 JOIN FLATTENED_CIRCULAR_JOIN t1 ON (t0.ID = t1.SIDE2_ID) WHERE t1.SIDE1_ID = ? [bind: 1->SIDE1_ID:1]
[main] INFO org.apache.cayenne.log.CommonsJdbcEventLogger - === returned 2 rows. - took 1
ms.
[main] INFO org.apache.cayenne.log.CommonsJdbcEventLogger - +++ transaction committed.
[main] INFO org.apache.cayenne.log.CommonsJdbcEventLogger - --- transaction started.
[main] INFO org.apache.cayenne.log.CommonsJdbcEventLogger - SELECT DISTINCT t0.ID FROM FLATTENED_CIRCULAR
t0 JOIN FLATTENED_CIRCULAR_JOIN t1 ON (t0.ID = t1.SIDE1_ID) WHERE t1.SIDE2_ID = ? [bind: 1->SIDE2_ID:1]
[main] INFO org.apache.cayenne.log.CommonsJdbcEventLogger - === returned 0 rows. - took 0
ms.
[main] INFO org.apache.cayenne.log.CommonsJdbcEventLogger - +++ transaction committed.
[main] INFO org.apache.cayenne.configuration.XMLDataChannelDescriptorLoader - Loading XML
configuration resource from <https://builds.apache.org/job/cayenne-master/cayenneTestConnection=h2,jdk=JDK%201.7%20(latest),label=Ubuntu/ws/cayenne-server/target/test-classes/cayenne-relationships-flattened.xml>
[main] INFO org.apache.cayenne.configuration.XMLDataChannelDescriptorLoader - Loading XML
DataMap resource from <https://builds.apache.org/job/cayenne-master/cayenneTestConnection=h2,jdk=JDK%201.7%20(latest),label=Ubuntu/ws/cayenne-server/target/test-classes/relationships-flattened.map.xml>
[main] INFO org.apache.cayenne.configuration.XMLDataChannelDescriptorLoader - Loading XML
configuration resource from <https://builds.apache.org/job/cayenne-master/cayenneTestConnection=h2,jdk=JDK%201.7%20(latest),label=Ubuntu/ws/cayenne-server/target/test-classes/cayenne-relationships-flattened.xml>
[main] INFO org.apache.cayenne.configuration.XMLDataChannelDescriptorLoader - Loading XML
DataMap resource from <https://builds.apache.org/job/cayenne-master/cayenneTestConnection=h2,jdk=JDK%201.7%20(latest),label=Ubuntu/ws/cayenne-server/target/test-classes/relationships-flattened.map.xml>
[main] INFO org.apache.cayenne.test.jdbc.UtilityLogger - delete from FLATTENED_TEST_4
[main] INFO org.apache.cayenne.test.jdbc.UtilityLogger - delete from COMPLEX_JOIN
[main] INFO org.apache.cayenne.test.jdbc.UtilityLogger - delete from FLATTENED_TEST_3
[main] INFO org.apache.cayenne.test.jdbc.UtilityLogger - delete from FLATTENED_CIRCULAR_JOIN
[main] INFO org.apache.cayenne.test.jdbc.UtilityLogger - delete from FLATTENED_TEST_2
[main] INFO org.apache.cayenne.test.jdbc.UtilityLogger - delete from FLATTENED_TEST_1
[main] INFO org.apache.cayenne.test.jdbc.UtilityLogger - delete from FLATTENED_CIRCULAR
[main] INFO org.apache.cayenne.test.jdbc.UtilityLogger - INSERT INTO FLATTENED_TEST_1 (FT1_ID,
NAME) VALUES (?, ?)
[main] INFO org.apache.cayenne.test.jdbc.UtilityLogger - INSERT INTO FLATTENED_TEST_1 (FT1_ID,
NAME) VALUES (?, ?)
[main] INFO org.apache.cayenne.test.jdbc.UtilityLogger - INSERT INTO FLATTENED_TEST_2 (FT2_ID,
FT1_ID, NAME) VALUES (?, ?, ?)
[main] INFO org.apache.cayenne.test.jdbc.UtilityLogger - INSERT INTO FLATTENED_TEST_3 (FT3_ID,
FT2_ID, NAME) VALUES (?, ?, ?)
[main] INFO org.apache.cayenne.log.CommonsJdbcEventLogger - --- transaction started.
[main] INFO org.apache.cayenne.log.CommonsJdbcEventLogger - SELECT t0.NAME, t0.FT3_ID, t0.FT2_ID
FROM FLATTENED_TEST_3 t0 
[main] INFO org.apache.cayenne.log.CommonsJdbcEventLogger - === returned 1 row. - took 0 ms.
[main] INFO org.apache.cayenne.log.CommonsJdbcEventLogger - +++ transaction committed.
[main] INFO org.apache.cayenne.log.CommonsJdbcEventLogger - --- transaction started.
[main] INFO org.apache.cayenne.log.CommonsJdbcEventLogger - SELECT t0.NAME, t0.FT3_ID, t0.FT2_ID
FROM FLATTENED_TEST_3 t0 
[main] INFO org.apache.cayenne.log.CommonsJdbcEventLogger - === returned 1 row. - took 0 ms.
[main] INFO org.apache.cayenne.log.CommonsJdbcEventLogger - +++ transaction committed.
Tests run: 7, Failures: 0, Errors: 0, Skipped: 0, Time elapsed: 1.676 sec - in org.apache.cayenne.FlattenedRelationshipsIT

Results :

Failed tests: 
  ResultDirectiveIT.testWithoutResultDirective:65->insertArtist:149 expected:<1>
but was:<0>
  ResultDirectiveIT.testWithMixedDirectiveUse1:86->insertArtist:149 expected:<1>
but was:<0>
  ResultDirectiveIT.testWithMixedDirectiveUse2:96->insertArtist:149 expected:<1>
but was:<0>
  ResultDirectiveIT.testWithOnlyResultDirective:76->insertArtist:149 expected:<1>
but was:<0>
  BindDirectiveIT.testBindForNotPassedParam:197->performInsertForParameters:263 expected:<1>
but was:<0>
  BindDirectiveIT.testBindingForCollection:138->performInsertForParameters:263 expected:<1>
but was:<0>
  BindDirectiveIT.testBindTimestamp:87->performInsertForParameters:263 expected:<1>
but was:<0>
  BindDirectiveIT.testBindForPassedNullParam:166->performInsertForParameters:263 expected:<1>
but was:<0>
  BindDirectiveIT.testBindWithJDBCForNotPassedParam:212->performInsertForParameters:263
expected:<1> but was:<0>
  BindDirectiveIT.testBindSQLDate:105->performInsertForParameters:263 expected:<1>
but was:<0>
  BindDirectiveIT.testBindWithJDBCForPassedNullParam:182->performInsertForParameters:263
expected:<1> but was:<0>
  BindDirectiveIT.testBindUtilDate:123->performInsertForParameters:263 expected:<1>
but was:<0>
  SQLTemplateActionIT.testExecuteUpdate:277 expected:<1> but was:<0>
  SQLTemplateActionIT.testExecuteUpdateBatch:354 expected:<2> but was:<0>
  DataNodeQueriesIT.testPerfomQueriesSQLTemplate:105 expected:<1> but was:<0>
  ValueForNullIT.test:91->MergeCase.assertTokensAndExecute:195->MergeCase.assertTokens:189
tokens to db expected:<0> but was:<2>

Tests run: 1473, Failures: 16, Errors: 0, Skipped: 0

[INFO] 
[INFO] --- maven-failsafe-plugin:2.17:verify (integration-test) @ cayenne-server ---
[INFO] Failsafe report directory: <https://builds.apache.org/job/cayenne-master/cayenneTestConnection=h2,jdk=JDK%201.7%20(latest),label=Ubuntu/ws/cayenne-server/target/failsafe-reports>
[INFO] ------------------------------------------------------------------------
[INFO] Reactor Summary:
[INFO] 
[INFO] Cayenne ........................................... SUCCESS [0.256s]
[INFO] Cayenne Build Tools Parent ........................ SUCCESS [0.009s]
[INFO] Cayenne License and Notice Bundle ................. SUCCESS [1.000s]
[INFO] Common Unit Test Utilities ........................ SUCCESS [1.022s]
[INFO] Cayenne Code Checkers ............................. SUCCESS [0.057s]
[INFO] Cayenne Dependency Injection Container ............ SUCCESS [10.581s]
[INFO] Cayenne Server .................................... FAILURE [3:34.826s]
[INFO] Cayenne ROP Client ................................ SKIPPED
[INFO] Cayenne Project ................................... SKIPPED
[INFO] Cayenne Tools ..................................... SKIPPED
[INFO] Cayenne Lifecycle Utilities ....................... SKIPPED
[INFO] Cayenne Maven Plugins ............................. SKIPPED
[INFO] Cayenne Maven Plugin .............................. SKIPPED
[INFO] Cayenne Cryptography Extensions ................... SKIPPED
[INFO] Cayenne Integration Tests Parent .................. SKIPPED
[INFO] Integration Tests - Cayenne Tools ................. SKIPPED
[INFO] Cayenne Modeler Parent ............................ SKIPPED
[INFO] Cayenne WebObjects Compatibility Library .......... SKIPPED
[INFO] Cayenne Modeler ................................... SKIPPED
[INFO] Cayenne Modeler Generic and Windows Extensions .... SKIPPED
[INFO] Cayenne Modeler Generic ........................... SKIPPED
[INFO] Cayenne Modeler Mac OS X Extensions ............... SKIPPED
[INFO] Cayenne Modeler Mac OS X .......................... SKIPPED
[INFO] Cayenne Modeler Mac OS X - Old Apple Java ......... SKIPPED
[INFO] Cayenne Modeler Windows ........................... SKIPPED
[INFO] Cayenne Modeler Maven Plugin ...................... SKIPPED
[INFO] Cayenne Tutorials ................................. SKIPPED
[INFO] Cayenne Tutorial .................................. SKIPPED
[INFO] Cayenne ROP Server Tutorial ....................... SKIPPED
[INFO] Cayenne ROP Client Tutorial ....................... SKIPPED
[INFO] Cayenne Documenation Parent ....................... SKIPPED
[INFO] Cayenne Documentation ............................. SKIPPED
[INFO] Cayenne Docbook Documentation ..................... SKIPPED
[INFO] Docbook: Cayenne Stylesheets ...................... SKIPPED
[INFO] Docbook: Cayenne Guide ............................ SKIPPED
[INFO] Docbook: Getting Started with Cayenne ............. SKIPPED
[INFO] Docbook: Getting Started with Cayenne ROP ......... SKIPPED
[INFO] Docbook: Cayenne New Features and Upgrade Guide ... SKIPPED
[INFO] Cayenne Release Assembly .......................... SKIPPED
[INFO] ------------------------------------------------------------------------
[INFO] BUILD FAILURE
[INFO] ------------------------------------------------------------------------
[INFO] Total time: 3:48.949s
[INFO] Finished at: Sun May 03 10:34:24 UTC 2015
[INFO] Final Memory: 52M/460M
[INFO] ------------------------------------------------------------------------
[ERROR] Failed to execute goal org.apache.maven.plugins:maven-failsafe-plugin:2.17:verify
(integration-test) on project cayenne-server: There are test failures.
[ERROR] 
[ERROR] Please refer to <https://builds.apache.org/job/cayenne-master/cayenneTestConnection=h2,jdk=JDK%201.7%20(latest),label=Ubuntu/ws/cayenne-server/target/failsafe-reports>
for the individual test results.
[ERROR] -> [Help 1]
org.apache.maven.lifecycle.LifecycleExecutionException: Failed to execute goal org.apache.maven.plugins:maven-failsafe-plugin:2.17:verify
(integration-test) on project cayenne-server: There are test failures.

Please refer to <https://builds.apache.org/job/cayenne-master/cayenneTestConnection=h2,jdk=JDK%201.7%20(latest),label=Ubuntu/ws/cayenne-server/target/failsafe-reports>
for the individual test results.
	at org.apache.maven.lifecycle.internal.MojoExecutor.execute(MojoExecutor.java:213)
	at org.apache.maven.lifecycle.internal.MojoExecutor.execute(MojoExecutor.java:153)
	at org.apache.maven.lifecycle.internal.MojoExecutor.execute(MojoExecutor.java:145)
	at org.apache.maven.lifecycle.internal.LifecycleModuleBuilder.buildProject(LifecycleModuleBuilder.java:84)
	at org.apache.maven.lifecycle.internal.LifecycleModuleBuilder.buildProject(LifecycleModuleBuilder.java:59)
	at org.apache.maven.lifecycle.internal.LifecycleStarter.singleThreadedBuild(LifecycleStarter.java:183)
	at org.apache.maven.lifecycle.internal.LifecycleStarter.execute(LifecycleStarter.java:161)
	at org.apache.maven.DefaultMaven.doExecute(DefaultMaven.java:320)
	at org.apache.maven.DefaultMaven.execute(DefaultMaven.java:156)
	at org.apache.maven.cli.MavenCli.execute(MavenCli.java:537)
	at org.apache.maven.cli.MavenCli.doMain(MavenCli.java:196)
	at org.apache.maven.cli.MavenCli.main(MavenCli.java:141)
	at sun.reflect.NativeMethodAccessorImpl.invoke0(Native Method)
	at sun.reflect.NativeMethodAccessorImpl.invoke(NativeMethodAccessorImpl.java:57)
	at sun.reflect.DelegatingMethodAccessorImpl.invoke(DelegatingMethodAccessorImpl.java:43)
	at java.lang.reflect.Method.invoke(Method.java:606)
	at org.codehaus.plexus.classworlds.launcher.Launcher.launchEnhanced(Launcher.java:290)
	at org.codehaus.plexus.classworlds.launcher.Launcher.launch(Launcher.java:230)
	at org.codehaus.plexus.classworlds.launcher.Launcher.mainWithExitCode(Launcher.java:409)
	at org.codehaus.plexus.classworlds.launcher.Launcher.main(Launcher.java:352)
Caused by: org.apache.maven.plugin.MojoFailureException: There are test failures.

Please refer to <https://builds.apache.org/job/cayenne-master/cayenneTestConnection=h2,jdk=JDK%201.7%20(latest),label=Ubuntu/ws/cayenne-server/target/failsafe-reports>
for the individual test results.
	at org.apache.maven.plugin.surefire.SurefireHelper.reportExecution(SurefireHelper.java:82)
	at org.apache.maven.plugin.failsafe.VerifyMojo.execute(VerifyMojo.java:194)
	at org.apache.maven.plugin.DefaultBuildPluginManager.executeMojo(DefaultBuildPluginManager.java:101)
	at org.apache.maven.lifecycle.internal.MojoExecutor.execute(MojoExecutor.java:209)
	... 19 more
[ERROR] 
[ERROR] Re-run Maven using the -X switch to enable full debug logging.
[ERROR] 
[ERROR] For more information about the errors and possible solutions, please read the following
articles:
[ERROR] [Help 1] http://cwiki.apache.org/confluence/display/MAVEN/MojoFailureException
[ERROR] 
[ERROR] After correcting the problems, you can resume the build with the command
[ERROR]   mvn <goals> -rf :cayenne-server
Build step 'Invoke top-level Maven targets' marked build as failure
Recording test results

Mime
View raw message