cayenne-commits mailing list archives

Site index · List index
Message view « Date » · « Thread »
Top « Date » · « Thread »
From Apache Jenkins Server <jenk...@builds.apache.org>
Subject Build failed in Jenkins: cayenne-master » h2,JDK 1.6 (latest),Ubuntu #213
Date Sun, 10 May 2015 16:41:30 GMT
See <https://builds.apache.org/job/cayenne-master/cayenneTestConnection=h2,jdk=JDK%201.6%20(latest),label=Ubuntu/213/changes>

Changes:

[aadamchik] CAY-1626 | Add JodaTime DateTime support

[aadamchik] CAY-2011 Support for Java 8 date and time types

[aadamchik] CAY-2011 Support for Java 8 date and time types

[aadamchik] CAY-2011 Support for Java 8 date and time types

------------------------------------------
[...truncated 55969 lines...]
[main] INFO org.apache.cayenne.test.jdbc.UtilityLogger - delete from PAINTING
[main] INFO org.apache.cayenne.test.jdbc.UtilityLogger - delete from EXHIBIT
[main] INFO org.apache.cayenne.test.jdbc.UtilityLogger - delete from GENERATED_COLUMN
[main] INFO org.apache.cayenne.test.jdbc.UtilityLogger - delete from ARTIST_GROUP
[main] INFO org.apache.cayenne.test.jdbc.UtilityLogger - delete from NULL_TEST
[main] INFO org.apache.cayenne.test.jdbc.UtilityLogger - delete from GALLERY
[main] INFO org.apache.cayenne.test.jdbc.UtilityLogger - delete from ARTIST_CT
[main] INFO org.apache.cayenne.test.jdbc.UtilityLogger - delete from PAINTING1
[main] INFO org.apache.cayenne.test.jdbc.UtilityLogger - delete from ARTIST
[main] INFO org.apache.cayenne.test.jdbc.UtilityLogger - delete from ARTGROUP
[main] INFO org.apache.cayenne.configuration.XMLDataChannelDescriptorLoader - Loading XML
configuration resource from <https://builds.apache.org/job/cayenne-master/cayenneTestConnection=h2,jdk=JDK%201.6%20(latest),label=Ubuntu/ws/cayenne-server/target/test-classes/cayenne-testmap.xml>
[main] INFO org.apache.cayenne.configuration.XMLDataChannelDescriptorLoader - Loading XML
DataMap resource from <https://builds.apache.org/job/cayenne-master/cayenneTestConnection=h2,jdk=JDK%201.6%20(latest),label=Ubuntu/ws/cayenne-server/target/test-classes/testmap.map.xml>
[main] INFO org.apache.cayenne.map.EntityResolver - added runtime complimentary DbRelationship
from ARTIST to PAINTING1
[main] INFO org.apache.cayenne.configuration.XMLDataChannelDescriptorLoader - Loading XML
configuration resource from <https://builds.apache.org/job/cayenne-master/cayenneTestConnection=h2,jdk=JDK%201.6%20(latest),label=Ubuntu/ws/cayenne-server/target/test-classes/cayenne-testmap.xml>
[main] INFO org.apache.cayenne.configuration.XMLDataChannelDescriptorLoader - Loading XML
DataMap resource from <https://builds.apache.org/job/cayenne-master/cayenneTestConnection=h2,jdk=JDK%201.6%20(latest),label=Ubuntu/ws/cayenne-server/target/test-classes/testmap.map.xml>
[main] INFO org.apache.cayenne.test.jdbc.UtilityLogger - delete from PAINTING_INFO
[main] INFO org.apache.cayenne.test.jdbc.UtilityLogger - delete from ARTIST_EXHIBIT
[main] INFO org.apache.cayenne.test.jdbc.UtilityLogger - delete from PAINTING
[main] INFO org.apache.cayenne.test.jdbc.UtilityLogger - delete from EXHIBIT
[main] INFO org.apache.cayenne.test.jdbc.UtilityLogger - delete from GENERATED_COLUMN
[main] INFO org.apache.cayenne.test.jdbc.UtilityLogger - delete from ARTIST_GROUP
[main] INFO org.apache.cayenne.test.jdbc.UtilityLogger - delete from NULL_TEST
[main] INFO org.apache.cayenne.test.jdbc.UtilityLogger - delete from GALLERY
[main] INFO org.apache.cayenne.test.jdbc.UtilityLogger - delete from ARTIST_CT
[main] INFO org.apache.cayenne.test.jdbc.UtilityLogger - delete from PAINTING1
[main] INFO org.apache.cayenne.test.jdbc.UtilityLogger - delete from ARTIST
[main] INFO org.apache.cayenne.test.jdbc.UtilityLogger - delete from ARTGROUP
[main] INFO org.apache.cayenne.configuration.XMLDataChannelDescriptorLoader - Loading XML
configuration resource from <https://builds.apache.org/job/cayenne-master/cayenneTestConnection=h2,jdk=JDK%201.6%20(latest),label=Ubuntu/ws/cayenne-server/target/test-classes/cayenne-testmap.xml>
[main] INFO org.apache.cayenne.configuration.XMLDataChannelDescriptorLoader - Loading XML
DataMap resource from <https://builds.apache.org/job/cayenne-master/cayenneTestConnection=h2,jdk=JDK%201.6%20(latest),label=Ubuntu/ws/cayenne-server/target/test-classes/testmap.map.xml>
[main] INFO org.apache.cayenne.map.EntityResolver - added runtime complimentary DbRelationship
from ARTIST to PAINTING1
[main] INFO org.apache.cayenne.configuration.XMLDataChannelDescriptorLoader - Loading XML
configuration resource from <https://builds.apache.org/job/cayenne-master/cayenneTestConnection=h2,jdk=JDK%201.6%20(latest),label=Ubuntu/ws/cayenne-server/target/test-classes/cayenne-testmap.xml>
[main] INFO org.apache.cayenne.configuration.XMLDataChannelDescriptorLoader - Loading XML
DataMap resource from <https://builds.apache.org/job/cayenne-master/cayenneTestConnection=h2,jdk=JDK%201.6%20(latest),label=Ubuntu/ws/cayenne-server/target/test-classes/testmap.map.xml>
[main] INFO org.apache.cayenne.test.jdbc.UtilityLogger - delete from PAINTING_INFO
[main] INFO org.apache.cayenne.test.jdbc.UtilityLogger - delete from ARTIST_EXHIBIT
[main] INFO org.apache.cayenne.test.jdbc.UtilityLogger - delete from PAINTING
[main] INFO org.apache.cayenne.test.jdbc.UtilityLogger - delete from EXHIBIT
[main] INFO org.apache.cayenne.test.jdbc.UtilityLogger - delete from GENERATED_COLUMN
[main] INFO org.apache.cayenne.test.jdbc.UtilityLogger - delete from ARTIST_GROUP
[main] INFO org.apache.cayenne.test.jdbc.UtilityLogger - delete from NULL_TEST
[main] INFO org.apache.cayenne.test.jdbc.UtilityLogger - delete from GALLERY
[main] INFO org.apache.cayenne.test.jdbc.UtilityLogger - delete from ARTIST_CT
[main] INFO org.apache.cayenne.test.jdbc.UtilityLogger - delete from PAINTING1
[main] INFO org.apache.cayenne.test.jdbc.UtilityLogger - delete from ARTIST
[main] INFO org.apache.cayenne.test.jdbc.UtilityLogger - delete from ARTGROUP
[main] INFO org.apache.cayenne.configuration.XMLDataChannelDescriptorLoader - Loading XML
configuration resource from <https://builds.apache.org/job/cayenne-master/cayenneTestConnection=h2,jdk=JDK%201.6%20(latest),label=Ubuntu/ws/cayenne-server/target/test-classes/cayenne-testmap.xml>
[main] INFO org.apache.cayenne.configuration.XMLDataChannelDescriptorLoader - Loading XML
DataMap resource from <https://builds.apache.org/job/cayenne-master/cayenneTestConnection=h2,jdk=JDK%201.6%20(latest),label=Ubuntu/ws/cayenne-server/target/test-classes/testmap.map.xml>
[main] INFO org.apache.cayenne.map.EntityResolver - added runtime complimentary DbRelationship
from ARTIST to PAINTING1
[main] INFO org.apache.cayenne.configuration.XMLDataChannelDescriptorLoader - Loading XML
configuration resource from <https://builds.apache.org/job/cayenne-master/cayenneTestConnection=h2,jdk=JDK%201.6%20(latest),label=Ubuntu/ws/cayenne-server/target/test-classes/cayenne-testmap.xml>
[main] INFO org.apache.cayenne.configuration.XMLDataChannelDescriptorLoader - Loading XML
DataMap resource from <https://builds.apache.org/job/cayenne-master/cayenneTestConnection=h2,jdk=JDK%201.6%20(latest),label=Ubuntu/ws/cayenne-server/target/test-classes/testmap.map.xml>
[main] INFO org.apache.cayenne.test.jdbc.UtilityLogger - delete from PAINTING_INFO
[main] INFO org.apache.cayenne.test.jdbc.UtilityLogger - delete from ARTIST_EXHIBIT
[main] INFO org.apache.cayenne.test.jdbc.UtilityLogger - delete from PAINTING
[main] INFO org.apache.cayenne.test.jdbc.UtilityLogger - delete from EXHIBIT
[main] INFO org.apache.cayenne.test.jdbc.UtilityLogger - delete from GENERATED_COLUMN
[main] INFO org.apache.cayenne.test.jdbc.UtilityLogger - delete from ARTIST_GROUP
[main] INFO org.apache.cayenne.test.jdbc.UtilityLogger - delete from NULL_TEST
[main] INFO org.apache.cayenne.test.jdbc.UtilityLogger - delete from GALLERY
[main] INFO org.apache.cayenne.test.jdbc.UtilityLogger - delete from ARTIST_CT
[main] INFO org.apache.cayenne.test.jdbc.UtilityLogger - delete from PAINTING1
[main] INFO org.apache.cayenne.test.jdbc.UtilityLogger - delete from ARTIST
[main] INFO org.apache.cayenne.test.jdbc.UtilityLogger - delete from ARTGROUP
[main] INFO org.apache.cayenne.configuration.XMLDataChannelDescriptorLoader - Loading XML
configuration resource from <https://builds.apache.org/job/cayenne-master/cayenneTestConnection=h2,jdk=JDK%201.6%20(latest),label=Ubuntu/ws/cayenne-server/target/test-classes/cayenne-testmap.xml>
[main] INFO org.apache.cayenne.configuration.XMLDataChannelDescriptorLoader - Loading XML
DataMap resource from <https://builds.apache.org/job/cayenne-master/cayenneTestConnection=h2,jdk=JDK%201.6%20(latest),label=Ubuntu/ws/cayenne-server/target/test-classes/testmap.map.xml>
[main] INFO org.apache.cayenne.map.EntityResolver - added runtime complimentary DbRelationship
from ARTIST to PAINTING1
[main] INFO org.apache.cayenne.configuration.XMLDataChannelDescriptorLoader - Loading XML
configuration resource from <https://builds.apache.org/job/cayenne-master/cayenneTestConnection=h2,jdk=JDK%201.6%20(latest),label=Ubuntu/ws/cayenne-server/target/test-classes/cayenne-testmap.xml>
[main] INFO org.apache.cayenne.configuration.XMLDataChannelDescriptorLoader - Loading XML
DataMap resource from <https://builds.apache.org/job/cayenne-master/cayenneTestConnection=h2,jdk=JDK%201.6%20(latest),label=Ubuntu/ws/cayenne-server/target/test-classes/testmap.map.xml>
[main] INFO org.apache.cayenne.test.jdbc.UtilityLogger - delete from PAINTING_INFO
[main] INFO org.apache.cayenne.test.jdbc.UtilityLogger - delete from ARTIST_EXHIBIT
[main] INFO org.apache.cayenne.test.jdbc.UtilityLogger - delete from PAINTING
[main] INFO org.apache.cayenne.test.jdbc.UtilityLogger - delete from EXHIBIT
[main] INFO org.apache.cayenne.test.jdbc.UtilityLogger - delete from GENERATED_COLUMN
[main] INFO org.apache.cayenne.test.jdbc.UtilityLogger - delete from ARTIST_GROUP
[main] INFO org.apache.cayenne.test.jdbc.UtilityLogger - delete from NULL_TEST
[main] INFO org.apache.cayenne.test.jdbc.UtilityLogger - delete from GALLERY
[main] INFO org.apache.cayenne.test.jdbc.UtilityLogger - delete from ARTIST_CT
[main] INFO org.apache.cayenne.test.jdbc.UtilityLogger - delete from PAINTING1
[main] INFO org.apache.cayenne.test.jdbc.UtilityLogger - delete from ARTIST
[main] INFO org.apache.cayenne.test.jdbc.UtilityLogger - delete from ARTGROUP
Tests run: 37, Failures: 0, Errors: 0, Skipped: 0, Time elapsed: 2.528 sec - in org.apache.cayenne.exp.parser.ExpressionEvaluateInMemoryIT
Running org.apache.cayenne.CayenneDataObjectValidationIT
[main] INFO org.apache.cayenne.configuration.XMLDataChannelDescriptorLoader - Loading XML
configuration resource from <https://builds.apache.org/job/cayenne-master/cayenneTestConnection=h2,jdk=JDK%201.6%20(latest),label=Ubuntu/ws/cayenne-server/target/test-classes/cayenne-testmap.xml>
[main] INFO org.apache.cayenne.configuration.XMLDataChannelDescriptorLoader - Loading XML
DataMap resource from <https://builds.apache.org/job/cayenne-master/cayenneTestConnection=h2,jdk=JDK%201.6%20(latest),label=Ubuntu/ws/cayenne-server/target/test-classes/testmap.map.xml>
[main] INFO org.apache.cayenne.map.EntityResolver - added runtime complimentary DbRelationship
from ARTIST to PAINTING1
[main] INFO org.apache.cayenne.configuration.XMLDataChannelDescriptorLoader - Loading XML
configuration resource from <https://builds.apache.org/job/cayenne-master/cayenneTestConnection=h2,jdk=JDK%201.6%20(latest),label=Ubuntu/ws/cayenne-server/target/test-classes/cayenne-testmap.xml>
[main] INFO org.apache.cayenne.configuration.XMLDataChannelDescriptorLoader - Loading XML
DataMap resource from <https://builds.apache.org/job/cayenne-master/cayenneTestConnection=h2,jdk=JDK%201.6%20(latest),label=Ubuntu/ws/cayenne-server/target/test-classes/testmap.map.xml>
[main] INFO org.apache.cayenne.test.jdbc.UtilityLogger - delete from PAINTING_INFO
[main] INFO org.apache.cayenne.test.jdbc.UtilityLogger - delete from ARTIST_EXHIBIT
[main] INFO org.apache.cayenne.test.jdbc.UtilityLogger - delete from PAINTING
[main] INFO org.apache.cayenne.test.jdbc.UtilityLogger - delete from EXHIBIT
[main] INFO org.apache.cayenne.test.jdbc.UtilityLogger - delete from GENERATED_COLUMN
[main] INFO org.apache.cayenne.test.jdbc.UtilityLogger - delete from ARTIST_GROUP
[main] INFO org.apache.cayenne.test.jdbc.UtilityLogger - delete from NULL_TEST
[main] INFO org.apache.cayenne.test.jdbc.UtilityLogger - delete from GALLERY
[main] INFO org.apache.cayenne.test.jdbc.UtilityLogger - delete from ARTIST_CT
[main] INFO org.apache.cayenne.test.jdbc.UtilityLogger - delete from PAINTING1
[main] INFO org.apache.cayenne.test.jdbc.UtilityLogger - delete from ARTIST
[main] INFO org.apache.cayenne.test.jdbc.UtilityLogger - delete from ARTGROUP
[main] INFO org.apache.cayenne.configuration.XMLDataChannelDescriptorLoader - Loading XML
configuration resource from <https://builds.apache.org/job/cayenne-master/cayenneTestConnection=h2,jdk=JDK%201.6%20(latest),label=Ubuntu/ws/cayenne-server/target/test-classes/cayenne-testmap.xml>
[main] INFO org.apache.cayenne.configuration.XMLDataChannelDescriptorLoader - Loading XML
DataMap resource from <https://builds.apache.org/job/cayenne-master/cayenneTestConnection=h2,jdk=JDK%201.6%20(latest),label=Ubuntu/ws/cayenne-server/target/test-classes/testmap.map.xml>
[main] INFO org.apache.cayenne.map.EntityResolver - added runtime complimentary DbRelationship
from ARTIST to PAINTING1
[main] INFO org.apache.cayenne.configuration.XMLDataChannelDescriptorLoader - Loading XML
configuration resource from <https://builds.apache.org/job/cayenne-master/cayenneTestConnection=h2,jdk=JDK%201.6%20(latest),label=Ubuntu/ws/cayenne-server/target/test-classes/cayenne-testmap.xml>
[main] INFO org.apache.cayenne.configuration.XMLDataChannelDescriptorLoader - Loading XML
DataMap resource from <https://builds.apache.org/job/cayenne-master/cayenneTestConnection=h2,jdk=JDK%201.6%20(latest),label=Ubuntu/ws/cayenne-server/target/test-classes/testmap.map.xml>
[main] INFO org.apache.cayenne.test.jdbc.UtilityLogger - delete from PAINTING_INFO
[main] INFO org.apache.cayenne.test.jdbc.UtilityLogger - delete from ARTIST_EXHIBIT
[main] INFO org.apache.cayenne.test.jdbc.UtilityLogger - delete from PAINTING
[main] INFO org.apache.cayenne.test.jdbc.UtilityLogger - delete from EXHIBIT
[main] INFO org.apache.cayenne.test.jdbc.UtilityLogger - delete from GENERATED_COLUMN
[main] INFO org.apache.cayenne.test.jdbc.UtilityLogger - delete from ARTIST_GROUP
[main] INFO org.apache.cayenne.test.jdbc.UtilityLogger - delete from NULL_TEST
[main] INFO org.apache.cayenne.test.jdbc.UtilityLogger - delete from GALLERY
[main] INFO org.apache.cayenne.test.jdbc.UtilityLogger - delete from ARTIST_CT
[main] INFO org.apache.cayenne.test.jdbc.UtilityLogger - delete from PAINTING1
[main] INFO org.apache.cayenne.test.jdbc.UtilityLogger - delete from ARTIST
[main] INFO org.apache.cayenne.test.jdbc.UtilityLogger - delete from ARTGROUP
[main] INFO org.apache.cayenne.configuration.XMLDataChannelDescriptorLoader - Loading XML
configuration resource from <https://builds.apache.org/job/cayenne-master/cayenneTestConnection=h2,jdk=JDK%201.6%20(latest),label=Ubuntu/ws/cayenne-server/target/test-classes/cayenne-testmap.xml>
[main] INFO org.apache.cayenne.configuration.XMLDataChannelDescriptorLoader - Loading XML
DataMap resource from <https://builds.apache.org/job/cayenne-master/cayenneTestConnection=h2,jdk=JDK%201.6%20(latest),label=Ubuntu/ws/cayenne-server/target/test-classes/testmap.map.xml>
[main] INFO org.apache.cayenne.map.EntityResolver - added runtime complimentary DbRelationship
from ARTIST to PAINTING1
[main] INFO org.apache.cayenne.configuration.XMLDataChannelDescriptorLoader - Loading XML
configuration resource from <https://builds.apache.org/job/cayenne-master/cayenneTestConnection=h2,jdk=JDK%201.6%20(latest),label=Ubuntu/ws/cayenne-server/target/test-classes/cayenne-testmap.xml>
[main] INFO org.apache.cayenne.configuration.XMLDataChannelDescriptorLoader - Loading XML
DataMap resource from <https://builds.apache.org/job/cayenne-master/cayenneTestConnection=h2,jdk=JDK%201.6%20(latest),label=Ubuntu/ws/cayenne-server/target/test-classes/testmap.map.xml>
[main] INFO org.apache.cayenne.test.jdbc.UtilityLogger - delete from PAINTING_INFO
[main] INFO org.apache.cayenne.test.jdbc.UtilityLogger - delete from ARTIST_EXHIBIT
[main] INFO org.apache.cayenne.test.jdbc.UtilityLogger - delete from PAINTING
[main] INFO org.apache.cayenne.test.jdbc.UtilityLogger - delete from EXHIBIT
[main] INFO org.apache.cayenne.test.jdbc.UtilityLogger - delete from GENERATED_COLUMN
[main] INFO org.apache.cayenne.test.jdbc.UtilityLogger - delete from ARTIST_GROUP
[main] INFO org.apache.cayenne.test.jdbc.UtilityLogger - delete from NULL_TEST
[main] INFO org.apache.cayenne.test.jdbc.UtilityLogger - delete from GALLERY
[main] INFO org.apache.cayenne.test.jdbc.UtilityLogger - delete from ARTIST_CT
[main] INFO org.apache.cayenne.test.jdbc.UtilityLogger - delete from PAINTING1
[main] INFO org.apache.cayenne.test.jdbc.UtilityLogger - delete from ARTIST
[main] INFO org.apache.cayenne.test.jdbc.UtilityLogger - delete from ARTGROUP
Tests run: 3, Failures: 0, Errors: 0, Skipped: 0, Time elapsed: 0.201 sec - in org.apache.cayenne.CayenneDataObjectValidationIT

Results :

Failed tests: 
  BindDirectiveIT.testBindForNotPassedParam:197->performInsertForParameters:263 expected:<1>
but was:<0>
  BindDirectiveIT.testBindingForCollection:138->performInsertForParameters:263 expected:<1>
but was:<0>
  BindDirectiveIT.testBindTimestamp:87->performInsertForParameters:263 expected:<1>
but was:<0>
  BindDirectiveIT.testBindForPassedNullParam:166->performInsertForParameters:263 expected:<1>
but was:<0>
  BindDirectiveIT.testBindWithJDBCForNotPassedParam:212->performInsertForParameters:263
expected:<1> but was:<0>
  BindDirectiveIT.testBindSQLDate:105->performInsertForParameters:263 expected:<1>
but was:<0>
  BindDirectiveIT.testBindWithJDBCForPassedNullParam:182->performInsertForParameters:263
expected:<1> but was:<0>
  BindDirectiveIT.testBindUtilDate:123->performInsertForParameters:263 expected:<1>
but was:<0>
  DataNodeQueriesIT.testPerfomQueriesSQLTemplate:105 expected:<1> but was:<0>
  SQLTemplateActionIT.testExecuteUpdate:277 expected:<1> but was:<0>
  SQLTemplateActionIT.testExecuteUpdateBatch:354 expected:<2> but was:<0>
  ValueForNullIT.test:91->MergeCase.assertTokensAndExecute:195->MergeCase.assertTokens:189
tokens to db expected:<0> but was:<2>

Tests run: 1474, Failures: 12, Errors: 0, Skipped: 0

[INFO] 
[INFO] --- maven-failsafe-plugin:2.17:verify (integration-test) @ cayenne-server ---
[INFO] Failsafe report directory: <https://builds.apache.org/job/cayenne-master/cayenneTestConnection=h2,jdk=JDK%201.6%20(latest),label=Ubuntu/ws/cayenne-server/target/failsafe-reports>
[INFO] ------------------------------------------------------------------------
[INFO] Reactor Summary:
[INFO] 
[INFO] Cayenne ........................................... SUCCESS [0.277s]
[INFO] Cayenne Build Tools Parent ........................ SUCCESS [0.009s]
[INFO] Cayenne License and Notice Bundle ................. SUCCESS [1.061s]
[INFO] Common Unit Test Utilities ........................ SUCCESS [0.900s]
[INFO] Cayenne Code Checkers ............................. SUCCESS [0.089s]
[INFO] Cayenne Dependency Injection Container ............ SUCCESS [11.533s]
[INFO] Cayenne Server .................................... FAILURE [5:02.720s]
[INFO] Cayenne ROP Client ................................ SKIPPED
[INFO] Cayenne Project ................................... SKIPPED
[INFO] Cayenne Tools ..................................... SKIPPED
[INFO] Cayenne Lifecycle Utilities ....................... SKIPPED
[INFO] Cayenne Maven Plugins ............................. SKIPPED
[INFO] Cayenne Maven Plugin .............................. SKIPPED
[INFO] Cayenne Cryptography Extensions ................... SKIPPED
[INFO] Cayenne Joda Extensions ........................... SKIPPED
[INFO] Cayenne Integration Tests Parent .................. SKIPPED
[INFO] Integration Tests - Cayenne Tools ................. SKIPPED
[INFO] Cayenne Modeler Parent ............................ SKIPPED
[INFO] Cayenne WebObjects Compatibility Library .......... SKIPPED
[INFO] Cayenne Modeler ................................... SKIPPED
[INFO] Cayenne Modeler Generic and Windows Extensions .... SKIPPED
[INFO] Cayenne Modeler Generic ........................... SKIPPED
[INFO] Cayenne Modeler Mac OS X Extensions ............... SKIPPED
[INFO] Cayenne Modeler Mac OS X .......................... SKIPPED
[INFO] Cayenne Modeler Mac OS X - Old Apple Java ......... SKIPPED
[INFO] Cayenne Modeler Windows ........................... SKIPPED
[INFO] Cayenne Modeler Maven Plugin ...................... SKIPPED
[INFO] Cayenne Tutorials ................................. SKIPPED
[INFO] Cayenne Tutorial .................................. SKIPPED
[INFO] Cayenne ROP Server Tutorial ....................... SKIPPED
[INFO] Cayenne ROP Client Tutorial ....................... SKIPPED
[INFO] Cayenne Documenation Parent ....................... SKIPPED
[INFO] Cayenne Documentation ............................. SKIPPED
[INFO] Cayenne Docbook Documentation ..................... SKIPPED
[INFO] Docbook: Cayenne Stylesheets ...................... SKIPPED
[INFO] Docbook: Cayenne Guide ............................ SKIPPED
[INFO] Docbook: Getting Started with Cayenne ............. SKIPPED
[INFO] Docbook: Getting Started with Cayenne ROP ......... SKIPPED
[INFO] Docbook: Cayenne New Features and Upgrade Guide ... SKIPPED
[INFO] Cayenne Release Assembly .......................... SKIPPED
[INFO] ------------------------------------------------------------------------
[INFO] BUILD FAILURE
[INFO] ------------------------------------------------------------------------
[INFO] Total time: 5:18.758s
[INFO] Finished at: Sun May 10 16:40:35 UTC 2015
[INFO] Final Memory: 53M/449M
[INFO] ------------------------------------------------------------------------
[ERROR] Failed to execute goal org.apache.maven.plugins:maven-failsafe-plugin:2.17:verify
(integration-test) on project cayenne-server: There are test failures.
[ERROR] 
[ERROR] Please refer to <https://builds.apache.org/job/cayenne-master/cayenneTestConnection=h2,jdk=JDK%201.6%20(latest),label=Ubuntu/ws/cayenne-server/target/failsafe-reports>
for the individual test results.
[ERROR] -> [Help 1]
org.apache.maven.lifecycle.LifecycleExecutionException: Failed to execute goal org.apache.maven.plugins:maven-failsafe-plugin:2.17:verify
(integration-test) on project cayenne-server: There are test failures.

Please refer to <https://builds.apache.org/job/cayenne-master/cayenneTestConnection=h2,jdk=JDK%201.6%20(latest),label=Ubuntu/ws/cayenne-server/target/failsafe-reports>
for the individual test results.
	at org.apache.maven.lifecycle.internal.MojoExecutor.execute(MojoExecutor.java:213)
	at org.apache.maven.lifecycle.internal.MojoExecutor.execute(MojoExecutor.java:153)
	at org.apache.maven.lifecycle.internal.MojoExecutor.execute(MojoExecutor.java:145)
	at org.apache.maven.lifecycle.internal.LifecycleModuleBuilder.buildProject(LifecycleModuleBuilder.java:84)
	at org.apache.maven.lifecycle.internal.LifecycleModuleBuilder.buildProject(LifecycleModuleBuilder.java:59)
	at org.apache.maven.lifecycle.internal.LifecycleStarter.singleThreadedBuild(LifecycleStarter.java:183)
	at org.apache.maven.lifecycle.internal.LifecycleStarter.execute(LifecycleStarter.java:161)
	at org.apache.maven.DefaultMaven.doExecute(DefaultMaven.java:320)
	at org.apache.maven.DefaultMaven.execute(DefaultMaven.java:156)
	at org.apache.maven.cli.MavenCli.execute(MavenCli.java:537)
	at org.apache.maven.cli.MavenCli.doMain(MavenCli.java:196)
	at org.apache.maven.cli.MavenCli.main(MavenCli.java:141)
	at sun.reflect.NativeMethodAccessorImpl.invoke0(Native Method)
	at sun.reflect.NativeMethodAccessorImpl.invoke(NativeMethodAccessorImpl.java:39)
	at sun.reflect.DelegatingMethodAccessorImpl.invoke(DelegatingMethodAccessorImpl.java:25)
	at java.lang.reflect.Method.invoke(Method.java:597)
	at org.codehaus.plexus.classworlds.launcher.Launcher.launchEnhanced(Launcher.java:290)
	at org.codehaus.plexus.classworlds.launcher.Launcher.launch(Launcher.java:230)
	at org.codehaus.plexus.classworlds.launcher.Launcher.mainWithExitCode(Launcher.java:409)
	at org.codehaus.plexus.classworlds.launcher.Launcher.main(Launcher.java:352)
Caused by: org.apache.maven.plugin.MojoFailureException: There are test failures.

Please refer to <https://builds.apache.org/job/cayenne-master/cayenneTestConnection=h2,jdk=JDK%201.6%20(latest),label=Ubuntu/ws/cayenne-server/target/failsafe-reports>
for the individual test results.
	at org.apache.maven.plugin.surefire.SurefireHelper.reportExecution(SurefireHelper.java:82)
	at org.apache.maven.plugin.failsafe.VerifyMojo.execute(VerifyMojo.java:194)
	at org.apache.maven.plugin.DefaultBuildPluginManager.executeMojo(DefaultBuildPluginManager.java:101)
	at org.apache.maven.lifecycle.internal.MojoExecutor.execute(MojoExecutor.java:209)
	... 19 more
[ERROR] 
[ERROR] Re-run Maven using the -X switch to enable full debug logging.
[ERROR] 
[ERROR] For more information about the errors and possible solutions, please read the following
articles:
[ERROR] [Help 1] http://cwiki.apache.org/confluence/display/MAVEN/MojoFailureException
[ERROR] 
[ERROR] After correcting the problems, you can resume the build with the command
[ERROR]   mvn <goals> -rf :cayenne-server
Build step 'Invoke top-level Maven targets' marked build as failure
Recording test results

Mime
View raw message