cayenne-commits mailing list archives

Site index · List index
Message view « Date » · « Thread »
Top « Date » · « Thread »
From Apache Jenkins Server <jenk...@builds.apache.org>
Subject Build failed in Jenkins: cayenne-master » h2,jdk1.8.0_11,Ubuntu #210
Date Wed, 06 May 2015 15:18:32 GMT
See <https://builds.apache.org/job/cayenne-master/cayenneTestConnection=h2,jdk=jdk1.8.0_11,label=Ubuntu/210/changes>

Changes:

[s.kolbachev] CAY-1626 | Add JodaTime DateTime support

------------------------------------------
[...truncated 55894 lines...]
[main] INFO org.apache.cayenne.test.jdbc.UtilityLogger - delete from ARTIST
[main] INFO org.apache.cayenne.log.CommonsJdbcEventLogger - --- transaction started.
[main] INFO org.apache.cayenne.log.CommonsJdbcEventLogger - INSERT INTO GALLERY (GALLERY_ID,
GALLERY_NAME) VALUES (?, ?)
[main] INFO org.apache.cayenne.log.CommonsJdbcEventLogger - [bind: 1->GALLERY_ID:204, 2->GALLERY_NAME:'yT']
[main] INFO org.apache.cayenne.log.CommonsJdbcEventLogger - === updated 1 row.
[main] INFO org.apache.cayenne.log.CommonsJdbcEventLogger - INSERT INTO PAINTING (ARTIST_ID,
ESTIMATED_PRICE, GALLERY_ID, PAINTING_DESCRIPTION, PAINTING_ID, PAINTING_TITLE) VALUES (?,
?, ?, ?, ?, ?)
[main] INFO org.apache.cayenne.log.CommonsJdbcEventLogger - [bind: 1->ARTIST_ID:NULL, 2->ESTIMATED_PRICE:NULL,
3->GALLERY_ID:204, 4->PAINTING_DESCRIPTION:NULL, 5->PAINTING_ID:245, 6->PAINTING_TITLE:'xa']
[main] INFO org.apache.cayenne.log.CommonsJdbcEventLogger - === updated 1 row.
[main] INFO org.apache.cayenne.log.CommonsJdbcEventLogger - +++ transaction committed.
[main] INFO org.apache.cayenne.log.CommonsJdbcEventLogger - --- transaction started.
[main] INFO org.apache.cayenne.log.CommonsJdbcEventLogger - SELECT t0.ESTIMATED_PRICE, t0.PAINTING_DESCRIPTION,
t0.PAINTING_TITLE, t0.ARTIST_ID, t0.GALLERY_ID, t0.PAINTING_ID FROM PAINTING t0 
[main] INFO org.apache.cayenne.log.CommonsJdbcEventLogger - === returned 1 row. - took 0 ms.
[main] INFO org.apache.cayenne.log.CommonsJdbcEventLogger - +++ transaction committed.
[main] INFO org.apache.cayenne.log.CommonsJdbcEventLogger - --- transaction started.
[main] INFO org.apache.cayenne.log.CommonsJdbcEventLogger - SELECT t0.ESTIMATED_PRICE, t0.PAINTING_DESCRIPTION,
t0.PAINTING_TITLE, t0.ARTIST_ID, t0.GALLERY_ID, t0.PAINTING_ID FROM PAINTING t0 WHERE t0.GALLERY_ID
= ? [bind: 1->GALLERY_ID:204]
[main] INFO org.apache.cayenne.log.CommonsJdbcEventLogger - === returned 1 row. - took 0 ms.
[main] INFO org.apache.cayenne.log.CommonsJdbcEventLogger - +++ transaction committed.
[main] INFO org.apache.cayenne.log.CommonsJdbcEventLogger - --- transaction started.
[main] INFO org.apache.cayenne.log.CommonsJdbcEventLogger - UPDATE PAINTING SET GALLERY_ID
= ? WHERE PAINTING_ID = ?
[main] INFO org.apache.cayenne.log.CommonsJdbcEventLogger - [bind: 1->GALLERY_ID:NULL,
2->PAINTING_ID:245]
[main] INFO org.apache.cayenne.log.CommonsJdbcEventLogger - === updated 1 row.
[main] INFO org.apache.cayenne.log.CommonsJdbcEventLogger - +++ transaction committed.
[main] INFO org.apache.cayenne.log.CommonsJdbcEventLogger - --- transaction started.
[main] INFO org.apache.cayenne.log.CommonsJdbcEventLogger - SELECT t0.ESTIMATED_PRICE, t0.PAINTING_DESCRIPTION,
t0.PAINTING_TITLE, t0.ARTIST_ID, t0.GALLERY_ID, t0.PAINTING_ID FROM PAINTING t0 
[main] INFO org.apache.cayenne.log.CommonsJdbcEventLogger - === returned 1 row. - took 0 ms.
[main] INFO org.apache.cayenne.log.CommonsJdbcEventLogger - +++ transaction committed.
Tests run: 9, Failures: 0, Errors: 0, Skipped: 0, Time elapsed: 1.074 sec - in org.apache.cayenne.CDOMany2OneIT
Running org.apache.cayenne.CDOMany2OneNoRevIT
[main] INFO org.apache.cayenne.configuration.XMLDataChannelDescriptorLoader - Loading XML
configuration resource from <https://builds.apache.org/job/cayenne-master/cayenneTestConnection=h2,jdk=jdk1.8.0_11,label=Ubuntu/ws/cayenne-server/target/test-classes/cayenne-testmap.xml>
[main] INFO org.apache.cayenne.configuration.XMLDataChannelDescriptorLoader - Loading XML
DataMap resource from <https://builds.apache.org/job/cayenne-master/cayenneTestConnection=h2,jdk=jdk1.8.0_11,label=Ubuntu/ws/cayenne-server/target/test-classes/testmap.map.xml>
[main] INFO org.apache.cayenne.map.EntityResolver - added runtime complimentary DbRelationship
from ARTIST to PAINTING1
[main] INFO org.apache.cayenne.configuration.XMLDataChannelDescriptorLoader - Loading XML
configuration resource from <https://builds.apache.org/job/cayenne-master/cayenneTestConnection=h2,jdk=jdk1.8.0_11,label=Ubuntu/ws/cayenne-server/target/test-classes/cayenne-testmap.xml>
[main] INFO org.apache.cayenne.configuration.XMLDataChannelDescriptorLoader - Loading XML
DataMap resource from <https://builds.apache.org/job/cayenne-master/cayenneTestConnection=h2,jdk=jdk1.8.0_11,label=Ubuntu/ws/cayenne-server/target/test-classes/testmap.map.xml>
[main] INFO org.apache.cayenne.test.jdbc.UtilityLogger - delete from ARTIST_EXHIBIT
[main] INFO org.apache.cayenne.test.jdbc.UtilityLogger - delete from EXHIBIT
[main] INFO org.apache.cayenne.test.jdbc.UtilityLogger - delete from PAINTING_INFO
[main] INFO org.apache.cayenne.test.jdbc.UtilityLogger - delete from PAINTING1
[main] INFO org.apache.cayenne.test.jdbc.UtilityLogger - delete from PAINTING
[main] INFO org.apache.cayenne.test.jdbc.UtilityLogger - delete from GALLERY
[main] INFO org.apache.cayenne.test.jdbc.UtilityLogger - delete from NULL_TEST
[main] INFO org.apache.cayenne.test.jdbc.UtilityLogger - delete from ARTIST_GROUP
[main] INFO org.apache.cayenne.test.jdbc.UtilityLogger - delete from GENERATED_COLUMN
[main] INFO org.apache.cayenne.test.jdbc.UtilityLogger - delete from ARTIST_CT
[main] INFO org.apache.cayenne.test.jdbc.UtilityLogger - delete from ARTGROUP
[main] INFO org.apache.cayenne.test.jdbc.UtilityLogger - delete from ARTIST
[main] INFO org.apache.cayenne.log.CommonsJdbcEventLogger - --- transaction started.
[main] INFO org.apache.cayenne.log.CommonsJdbcEventLogger - SELECT NEXT VALUE FOR pk_painting1
[main] INFO org.apache.cayenne.log.CommonsJdbcEventLogger - INSERT INTO ARTIST (ARTIST_ID,
ARTIST_NAME, DATE_OF_BIRTH) VALUES (?, ?, ?)
[main] INFO org.apache.cayenne.log.CommonsJdbcEventLogger - [bind: 1->ARTIST_ID:210, 2->ARTIST_NAME:'a',
3->DATE_OF_BIRTH:NULL]
[main] INFO org.apache.cayenne.log.CommonsJdbcEventLogger - === updated 1 row.
[main] INFO org.apache.cayenne.log.CommonsJdbcEventLogger - INSERT INTO PAINTING1 (ARTIST_ID,
ESTIMATED_PRICE, GALLERY_ID, PAINTING_ID, PAINTING_TITLE) VALUES (?, ?, ?, ?, ?)
[main] INFO org.apache.cayenne.log.CommonsJdbcEventLogger - [bind: 1->ARTIST_ID:210, 2->ESTIMATED_PRICE:NULL,
3->GALLERY_ID:NULL, 4->PAINTING_ID:200, 5->PAINTING_TITLE:'p']
[main] INFO org.apache.cayenne.log.CommonsJdbcEventLogger - === updated 1 row.
[main] INFO org.apache.cayenne.log.CommonsJdbcEventLogger - +++ transaction committed.
[main] INFO org.apache.cayenne.log.CommonsJdbcEventLogger - --- transaction started.
[main] INFO org.apache.cayenne.log.CommonsJdbcEventLogger - SELECT t0.ESTIMATED_PRICE, t0.PAINTING_TITLE,
t0.ARTIST_ID, t0.PAINTING_ID FROM PAINTING1 t0 WHERE t0.PAINTING_ID = ? [bind: 1->PAINTING_ID:200]
[main] INFO org.apache.cayenne.log.CommonsJdbcEventLogger - === returned 1 row. - took 1 ms.
[main] INFO org.apache.cayenne.log.CommonsJdbcEventLogger - +++ transaction committed.
Tests run: 1, Failures: 0, Errors: 0, Skipped: 0, Time elapsed: 0.134 sec - in org.apache.cayenne.CDOMany2OneNoRevIT
Running org.apache.cayenne.GenericMappingIT
[main] INFO org.apache.cayenne.configuration.XMLDataChannelDescriptorLoader - Loading XML
configuration resource from <https://builds.apache.org/job/cayenne-master/cayenneTestConnection=h2,jdk=jdk1.8.0_11,label=Ubuntu/ws/cayenne-server/target/test-classes/cayenne-generic.xml>
[main] INFO org.apache.cayenne.configuration.XMLDataChannelDescriptorLoader - Loading XML
DataMap resource from <https://builds.apache.org/job/cayenne-master/cayenneTestConnection=h2,jdk=jdk1.8.0_11,label=Ubuntu/ws/cayenne-server/target/test-classes/generic.map.xml>
[main] INFO org.apache.cayenne.configuration.XMLDataChannelDescriptorLoader - Loading XML
configuration resource from <https://builds.apache.org/job/cayenne-master/cayenneTestConnection=h2,jdk=jdk1.8.0_11,label=Ubuntu/ws/cayenne-server/target/test-classes/cayenne-generic.xml>
[main] INFO org.apache.cayenne.configuration.XMLDataChannelDescriptorLoader - Loading XML
DataMap resource from <https://builds.apache.org/job/cayenne-master/cayenneTestConnection=h2,jdk=jdk1.8.0_11,label=Ubuntu/ws/cayenne-server/target/test-classes/generic.map.xml>
[main] INFO org.apache.cayenne.test.jdbc.UtilityLogger - delete from GENERIC2
[main] INFO org.apache.cayenne.test.jdbc.UtilityLogger - delete from GENERIC1
[main] INFO org.apache.cayenne.log.CommonsJdbcEventLogger - --- transaction started.
[main] INFO org.apache.cayenne.log.CommonsJdbcEventLogger - SELECT NEXT VALUE FOR pk_generic1
[main] INFO org.apache.cayenne.log.CommonsJdbcEventLogger - SELECT NEXT VALUE FOR pk_generic2
[main] INFO org.apache.cayenne.log.CommonsJdbcEventLogger - INSERT INTO GENERIC1 (ID, NAME)
VALUES (?, ?)
[main] INFO org.apache.cayenne.log.CommonsJdbcEventLogger - [bind: 1->ID:200, 2->NAME:'G1
Name']
[main] INFO org.apache.cayenne.log.CommonsJdbcEventLogger - === updated 1 row.
[main] INFO org.apache.cayenne.log.CommonsJdbcEventLogger - INSERT INTO GENERIC2 (GENERIC1_ID,
ID, NAME) VALUES (?, ?, ?)
[main] INFO org.apache.cayenne.log.CommonsJdbcEventLogger - [bind: 1->GENERIC1_ID:200,
2->ID:200, 3->NAME:'G2 Name']
[main] INFO org.apache.cayenne.log.CommonsJdbcEventLogger - === updated 1 row.
[main] INFO org.apache.cayenne.log.CommonsJdbcEventLogger - +++ transaction committed.
[main] INFO org.apache.cayenne.configuration.XMLDataChannelDescriptorLoader - Loading XML
configuration resource from <https://builds.apache.org/job/cayenne-master/cayenneTestConnection=h2,jdk=jdk1.8.0_11,label=Ubuntu/ws/cayenne-server/target/test-classes/cayenne-generic.xml>
[main] INFO org.apache.cayenne.configuration.XMLDataChannelDescriptorLoader - Loading XML
DataMap resource from <https://builds.apache.org/job/cayenne-master/cayenneTestConnection=h2,jdk=jdk1.8.0_11,label=Ubuntu/ws/cayenne-server/target/test-classes/generic.map.xml>
[main] INFO org.apache.cayenne.configuration.XMLDataChannelDescriptorLoader - Loading XML
configuration resource from <https://builds.apache.org/job/cayenne-master/cayenneTestConnection=h2,jdk=jdk1.8.0_11,label=Ubuntu/ws/cayenne-server/target/test-classes/cayenne-generic.xml>
[main] INFO org.apache.cayenne.configuration.XMLDataChannelDescriptorLoader - Loading XML
DataMap resource from <https://builds.apache.org/job/cayenne-master/cayenneTestConnection=h2,jdk=jdk1.8.0_11,label=Ubuntu/ws/cayenne-server/target/test-classes/generic.map.xml>
[main] INFO org.apache.cayenne.test.jdbc.UtilityLogger - delete from GENERIC2
[main] INFO org.apache.cayenne.test.jdbc.UtilityLogger - delete from GENERIC1
[main] INFO org.apache.cayenne.log.CommonsJdbcEventLogger - --- transaction started.
[main] INFO org.apache.cayenne.log.CommonsJdbcEventLogger - INSERT INTO GENERIC1 (ID, NAME)
VALUES (?, ?)
[main] INFO org.apache.cayenne.log.CommonsJdbcEventLogger - [bind: 1->ID:201, 2->NAME:'G1
Name']
[main] INFO org.apache.cayenne.log.CommonsJdbcEventLogger - === updated 1 row.
[main] INFO org.apache.cayenne.log.CommonsJdbcEventLogger - INSERT INTO GENERIC2 (GENERIC1_ID,
ID, NAME) VALUES (?, ?, ?)
[main] INFO org.apache.cayenne.log.CommonsJdbcEventLogger - [bind: 1->GENERIC1_ID:201,
2->ID:201, 3->NAME:'G2 Name']
[main] INFO org.apache.cayenne.log.CommonsJdbcEventLogger - === updated 1 row.
[main] INFO org.apache.cayenne.log.CommonsJdbcEventLogger - +++ transaction committed.
[main] INFO org.apache.cayenne.log.CommonsJdbcEventLogger - --- transaction started.
[main] INFO org.apache.cayenne.log.CommonsJdbcEventLogger - INSERT INTO GENERIC1 (ID, NAME)
VALUES (?, ?)
[main] INFO org.apache.cayenne.log.CommonsJdbcEventLogger - [bind: 1->ID:202, 2->NAME:'G11
Name']
[main] INFO org.apache.cayenne.log.CommonsJdbcEventLogger - === updated 1 row.
[main] INFO org.apache.cayenne.log.CommonsJdbcEventLogger - UPDATE GENERIC2 SET GENERIC1_ID
= ? WHERE ID = ?
[main] INFO org.apache.cayenne.log.CommonsJdbcEventLogger - [bind: 1->GENERIC1_ID:202,
2->ID:201]
[main] INFO org.apache.cayenne.log.CommonsJdbcEventLogger - === updated 1 row.
[main] INFO org.apache.cayenne.log.CommonsJdbcEventLogger - +++ transaction committed.
[main] INFO org.apache.cayenne.configuration.XMLDataChannelDescriptorLoader - Loading XML
configuration resource from <https://builds.apache.org/job/cayenne-master/cayenneTestConnection=h2,jdk=jdk1.8.0_11,label=Ubuntu/ws/cayenne-server/target/test-classes/cayenne-generic.xml>
[main] INFO org.apache.cayenne.configuration.XMLDataChannelDescriptorLoader - Loading XML
DataMap resource from <https://builds.apache.org/job/cayenne-master/cayenneTestConnection=h2,jdk=jdk1.8.0_11,label=Ubuntu/ws/cayenne-server/target/test-classes/generic.map.xml>
[main] INFO org.apache.cayenne.configuration.XMLDataChannelDescriptorLoader - Loading XML
configuration resource from <https://builds.apache.org/job/cayenne-master/cayenneTestConnection=h2,jdk=jdk1.8.0_11,label=Ubuntu/ws/cayenne-server/target/test-classes/cayenne-generic.xml>
[main] INFO org.apache.cayenne.configuration.XMLDataChannelDescriptorLoader - Loading XML
DataMap resource from <https://builds.apache.org/job/cayenne-master/cayenneTestConnection=h2,jdk=jdk1.8.0_11,label=Ubuntu/ws/cayenne-server/target/test-classes/generic.map.xml>
[main] INFO org.apache.cayenne.test.jdbc.UtilityLogger - delete from GENERIC2
[main] INFO org.apache.cayenne.test.jdbc.UtilityLogger - delete from GENERIC1
[main] INFO org.apache.cayenne.log.CommonsJdbcEventLogger - --- transaction started.
[main] INFO org.apache.cayenne.log.CommonsJdbcEventLogger - INSERT INTO GENERIC1 (ID, NAME)
VALUES (1, 'AAAA')
[main] INFO org.apache.cayenne.log.CommonsJdbcEventLogger - === updated 1 row.
[main] INFO org.apache.cayenne.log.CommonsJdbcEventLogger - +++ transaction committed.
[main] INFO org.apache.cayenne.log.CommonsJdbcEventLogger - --- transaction started.
[main] INFO org.apache.cayenne.log.CommonsJdbcEventLogger - INSERT INTO GENERIC1 (ID, NAME)
VALUES (2, 'BBBB')
[main] INFO org.apache.cayenne.log.CommonsJdbcEventLogger - === updated 1 row.
[main] INFO org.apache.cayenne.log.CommonsJdbcEventLogger - +++ transaction committed.
[main] INFO org.apache.cayenne.log.CommonsJdbcEventLogger - --- transaction started.
[main] INFO org.apache.cayenne.log.CommonsJdbcEventLogger - INSERT INTO GENERIC2 (GENERIC1_ID,
ID, NAME) VALUES (1, 1, 'CCCCC')
[main] INFO org.apache.cayenne.log.CommonsJdbcEventLogger - === updated 1 row.
[main] INFO org.apache.cayenne.log.CommonsJdbcEventLogger - +++ transaction committed.
[main] INFO org.apache.cayenne.log.CommonsJdbcEventLogger - --- transaction started.
[main] INFO org.apache.cayenne.log.CommonsJdbcEventLogger - SELECT t0.NAME, t0.ID FROM GENERIC1
t0 WHERE t0.NAME = ? [bind: 1->NAME:'AAAA']
[main] INFO org.apache.cayenne.log.CommonsJdbcEventLogger - === returned 1 row. - took 1 ms.
[main] INFO org.apache.cayenne.log.CommonsJdbcEventLogger - +++ transaction committed.
[main] INFO org.apache.cayenne.configuration.XMLDataChannelDescriptorLoader - Loading XML
configuration resource from <https://builds.apache.org/job/cayenne-master/cayenneTestConnection=h2,jdk=jdk1.8.0_11,label=Ubuntu/ws/cayenne-server/target/test-classes/cayenne-generic.xml>
[main] INFO org.apache.cayenne.configuration.XMLDataChannelDescriptorLoader - Loading XML
DataMap resource from <https://builds.apache.org/job/cayenne-master/cayenneTestConnection=h2,jdk=jdk1.8.0_11,label=Ubuntu/ws/cayenne-server/target/test-classes/generic.map.xml>
[main] INFO org.apache.cayenne.configuration.XMLDataChannelDescriptorLoader - Loading XML
configuration resource from <https://builds.apache.org/job/cayenne-master/cayenneTestConnection=h2,jdk=jdk1.8.0_11,label=Ubuntu/ws/cayenne-server/target/test-classes/cayenne-generic.xml>
[main] INFO org.apache.cayenne.configuration.XMLDataChannelDescriptorLoader - Loading XML
DataMap resource from <https://builds.apache.org/job/cayenne-master/cayenneTestConnection=h2,jdk=jdk1.8.0_11,label=Ubuntu/ws/cayenne-server/target/test-classes/generic.map.xml>
[main] INFO org.apache.cayenne.test.jdbc.UtilityLogger - delete from GENERIC2
[main] INFO org.apache.cayenne.test.jdbc.UtilityLogger - delete from GENERIC1
[main] INFO org.apache.cayenne.log.CommonsJdbcEventLogger - --- transaction started.
[main] INFO org.apache.cayenne.log.CommonsJdbcEventLogger - INSERT INTO GENERIC1 (ID, NAME)
VALUES (?, ?)
[main] INFO org.apache.cayenne.log.CommonsJdbcEventLogger - [bind: 1->ID:203, 2->NAME:'G1
Name']
[main] INFO org.apache.cayenne.log.CommonsJdbcEventLogger - === updated 1 row.
[main] INFO org.apache.cayenne.log.CommonsJdbcEventLogger - +++ transaction committed.
Tests run: 4, Failures: 0, Errors: 0, Skipped: 0, Time elapsed: 0.001 sec - in org.apache.cayenne.GenericMappingIT

Results :

Failed tests: 
  BindDirectiveIT.testBindForNotPassedParam:197->performInsertForParameters:263 expected:<1>
but was:<0>
  BindDirectiveIT.testBindingForCollection:138->performInsertForParameters:263 expected:<1>
but was:<0>
  BindDirectiveIT.testBindTimestamp:87->performInsertForParameters:263 expected:<1>
but was:<0>
  BindDirectiveIT.testBindForPassedNullParam:166->performInsertForParameters:263 expected:<1>
but was:<0>
  BindDirectiveIT.testBindWithJDBCForNotPassedParam:212->performInsertForParameters:263
expected:<1> but was:<0>
  BindDirectiveIT.testBindSQLDate:105->performInsertForParameters:263 expected:<1>
but was:<0>
  BindDirectiveIT.testBindWithJDBCForPassedNullParam:182->performInsertForParameters:263
expected:<1> but was:<0>
  BindDirectiveIT.testBindUtilDate:123->performInsertForParameters:263 expected:<1>
but was:<0>
  ValueForNullIT.test:91->MergeCase.assertTokensAndExecute:195->MergeCase.assertTokens:189
tokens to db expected:<0> but was:<2>
  DataNodeQueriesIT.testPerfomQueriesSQLTemplate:105 expected:<1> but was:<0>
  SQLTemplateActionIT.testExecuteUpdate:277 expected:<1> but was:<0>
  SQLTemplateActionIT.testExecuteUpdateBatch:354 expected:<2> but was:<0>

Tests run: 1474, Failures: 12, Errors: 0, Skipped: 0

[INFO] 
[INFO] --- maven-failsafe-plugin:2.17:verify (integration-test) @ cayenne-server ---
[INFO] Failsafe report directory: <https://builds.apache.org/job/cayenne-master/cayenneTestConnection=h2,jdk=jdk1.8.0_11,label=Ubuntu/ws/cayenne-server/target/failsafe-reports>
[INFO] ------------------------------------------------------------------------
[INFO] Reactor Summary:
[INFO] 
[INFO] Cayenne ........................................... SUCCESS [0.312s]
[INFO] Cayenne Build Tools Parent ........................ SUCCESS [0.008s]
[INFO] Cayenne License and Notice Bundle ................. SUCCESS [1.177s]
[INFO] Common Unit Test Utilities ........................ SUCCESS [1.310s]
[INFO] Cayenne Code Checkers ............................. SUCCESS [0.055s]
[INFO] Cayenne Dependency Injection Container ............ SUCCESS [13.000s]
[INFO] Cayenne Server .................................... FAILURE [2:46.322s]
[INFO] Cayenne ROP Client ................................ SKIPPED
[INFO] Cayenne Project ................................... SKIPPED
[INFO] Cayenne Tools ..................................... SKIPPED
[INFO] Cayenne Lifecycle Utilities ....................... SKIPPED
[INFO] Cayenne Maven Plugins ............................. SKIPPED
[INFO] Cayenne Maven Plugin .............................. SKIPPED
[INFO] Cayenne Cryptography Extensions ................... SKIPPED
[INFO] Cayenne Integration Tests Parent .................. SKIPPED
[INFO] Integration Tests - Cayenne Tools ................. SKIPPED
[INFO] Cayenne Modeler Parent ............................ SKIPPED
[INFO] Cayenne WebObjects Compatibility Library .......... SKIPPED
[INFO] Cayenne Modeler ................................... SKIPPED
[INFO] Cayenne Modeler Generic and Windows Extensions .... SKIPPED
[INFO] Cayenne Modeler Generic ........................... SKIPPED
[INFO] Cayenne Modeler Mac OS X Extensions ............... SKIPPED
[INFO] Cayenne Modeler Mac OS X .......................... SKIPPED
[INFO] Cayenne Modeler Mac OS X - Old Apple Java ......... SKIPPED
[INFO] Cayenne Modeler Windows ........................... SKIPPED
[INFO] Cayenne Modeler Maven Plugin ...................... SKIPPED
[INFO] Cayenne Tutorials ................................. SKIPPED
[INFO] Cayenne Tutorial .................................. SKIPPED
[INFO] Cayenne ROP Server Tutorial ....................... SKIPPED
[INFO] Cayenne ROP Client Tutorial ....................... SKIPPED
[INFO] Cayenne Documenation Parent ....................... SKIPPED
[INFO] Cayenne Documentation ............................. SKIPPED
[INFO] Cayenne Docbook Documentation ..................... SKIPPED
[INFO] Docbook: Cayenne Stylesheets ...................... SKIPPED
[INFO] Docbook: Cayenne Guide ............................ SKIPPED
[INFO] Docbook: Getting Started with Cayenne ............. SKIPPED
[INFO] Docbook: Getting Started with Cayenne ROP ......... SKIPPED
[INFO] Docbook: Cayenne New Features and Upgrade Guide ... SKIPPED
[INFO] Cayenne Release Assembly .......................... SKIPPED
[INFO] Cayenne Joda Extensions ........................... SKIPPED
[INFO] ------------------------------------------------------------------------
[INFO] BUILD FAILURE
[INFO] ------------------------------------------------------------------------
[INFO] Total time: 3:03.252s
[INFO] Finished at: Wed May 06 15:18:04 UTC 2015
[INFO] Final Memory: 65M/557M
[INFO] ------------------------------------------------------------------------
[ERROR] Failed to execute goal org.apache.maven.plugins:maven-failsafe-plugin:2.17:verify
(integration-test) on project cayenne-server: There are test failures.
[ERROR] 
[ERROR] Please refer to <https://builds.apache.org/job/cayenne-master/cayenneTestConnection=h2,jdk=jdk1.8.0_11,label=Ubuntu/ws/cayenne-server/target/failsafe-reports>
for the individual test results.
[ERROR] -> [Help 1]
org.apache.maven.lifecycle.LifecycleExecutionException: Failed to execute goal org.apache.maven.plugins:maven-failsafe-plugin:2.17:verify
(integration-test) on project cayenne-server: There are test failures.

Please refer to <https://builds.apache.org/job/cayenne-master/cayenneTestConnection=h2,jdk=jdk1.8.0_11,label=Ubuntu/ws/cayenne-server/target/failsafe-reports>
for the individual test results.
	at org.apache.maven.lifecycle.internal.MojoExecutor.execute(MojoExecutor.java:213)
	at org.apache.maven.lifecycle.internal.MojoExecutor.execute(MojoExecutor.java:153)
	at org.apache.maven.lifecycle.internal.MojoExecutor.execute(MojoExecutor.java:145)
	at org.apache.maven.lifecycle.internal.LifecycleModuleBuilder.buildProject(LifecycleModuleBuilder.java:84)
	at org.apache.maven.lifecycle.internal.LifecycleModuleBuilder.buildProject(LifecycleModuleBuilder.java:59)
	at org.apache.maven.lifecycle.internal.LifecycleStarter.singleThreadedBuild(LifecycleStarter.java:183)
	at org.apache.maven.lifecycle.internal.LifecycleStarter.execute(LifecycleStarter.java:161)
	at org.apache.maven.DefaultMaven.doExecute(DefaultMaven.java:320)
	at org.apache.maven.DefaultMaven.execute(DefaultMaven.java:156)
	at org.apache.maven.cli.MavenCli.execute(MavenCli.java:537)
	at org.apache.maven.cli.MavenCli.doMain(MavenCli.java:196)
	at org.apache.maven.cli.MavenCli.main(MavenCli.java:141)
	at sun.reflect.NativeMethodAccessorImpl.invoke0(Native Method)
	at sun.reflect.NativeMethodAccessorImpl.invoke(NativeMethodAccessorImpl.java:62)
	at sun.reflect.DelegatingMethodAccessorImpl.invoke(DelegatingMethodAccessorImpl.java:43)
	at java.lang.reflect.Method.invoke(Method.java:483)
	at org.codehaus.plexus.classworlds.launcher.Launcher.launchEnhanced(Launcher.java:290)
	at org.codehaus.plexus.classworlds.launcher.Launcher.launch(Launcher.java:230)
	at org.codehaus.plexus.classworlds.launcher.Launcher.mainWithExitCode(Launcher.java:409)
	at org.codehaus.plexus.classworlds.launcher.Launcher.main(Launcher.java:352)
Caused by: org.apache.maven.plugin.MojoFailureException: There are test failures.

Please refer to <https://builds.apache.org/job/cayenne-master/cayenneTestConnection=h2,jdk=jdk1.8.0_11,label=Ubuntu/ws/cayenne-server/target/failsafe-reports>
for the individual test results.
	at org.apache.maven.plugin.surefire.SurefireHelper.reportExecution(SurefireHelper.java:82)
	at org.apache.maven.plugin.failsafe.VerifyMojo.execute(VerifyMojo.java:194)
	at org.apache.maven.plugin.DefaultBuildPluginManager.executeMojo(DefaultBuildPluginManager.java:101)
	at org.apache.maven.lifecycle.internal.MojoExecutor.execute(MojoExecutor.java:209)
	... 19 more
[ERROR] 
[ERROR] Re-run Maven using the -X switch to enable full debug logging.
[ERROR] 
[ERROR] For more information about the errors and possible solutions, please read the following
articles:
[ERROR] [Help 1] http://cwiki.apache.org/confluence/display/MAVEN/MojoFailureException
[ERROR] 
[ERROR] After correcting the problems, you can resume the build with the command
[ERROR]   mvn <goals> -rf :cayenne-server
Build step 'Invoke top-level Maven targets' marked build as failure
Recording test results

Mime
View raw message