cayenne-commits mailing list archives

Site index · List index
Message view « Date » · « Thread »
Top « Date » · « Thread »
From Apache Jenkins Server <jenk...@builds.apache.org>
Subject Build failed in Jenkins: cayenne-master » derby,jdk-1.8.0,Ubuntu #82
Date Fri, 14 Nov 2014 18:34:01 GMT
See <https://builds.apache.org/job/cayenne-master/cayenneTestConnection=derby,jdk=jdk-1.8.0,label=Ubuntu/82/changes>

Changes:

[s.kolbachev] Installing Maven Failsafe Plugin

[s.kolbachev] Apply JUnit4 instead of JUnit3 in cayenne-server

[s.kolbachev] CAY-1964 | Fix convertAdditionalDataMaps() in CayenneGeneratorMojo.java

[s.kolbachev] Apply JUnit4 instead of JUnit3 in other modules

[s.kolbachev] Rename Integration Tests in cayenne-client (*IT.java instead of *Test.java)

[aadamchik] CAY-1964 | Fix convertAdditionalDataMaps() in CayenneGeneratorMojo.java

[aadamchik] CAY-1965 Change version from 3.2 to 4.0

[aadamchik] Java 7 API crept in

[aadamchik] CAY-1965 Change version from 3.2 to 4.0

[aadamchik] CAY-1965 Change version from 3.2 to 4.0

[aadamchik] cleanup before refactoring .. mostly generics-related

[aadamchik] cleanup: unused var passed to non-public method

[aadamchik] cleanup

[aadamchik] CAY-1967 Deprecate SQLTemplate parameter batches

[aadamchik] CAY-1966 SQLTemplate/SQLSelect positional parameter binding

[aadamchik] CAY-1966 SQLTemplate/SQLSelect positional parameter binding

[aadamchik] CAY-1966 SQLTemplate/SQLSelect positional parameter binding

[aadamchik] for cleaner output of unit tests bridging Cayenne with SLF4J

[aadamchik] CAY-1966 SQLTemplate/SQLSelect positional parameter binding

[aadamchik] CAY-1966 SQLTemplate/SQLSelect positional parameter binding

[aadamchik] javadocs errors that are failing Java 8 build

[aadamchik] javadocs errors that are failing Java 8 build

[s.kolbachev] Apply JUnit4 instead of JUnit3 in IT

[s.kolbachev] Optimize Imports in cayenne-client module

[aadamchik] adding generics spec to the new parameterized tests

[aadamchik] random tests cleanup

[s.kolbachev] Organize Assert Imports

[s.kolbachev] Refactor Multi Tier Project

[aadamchik] CAY-1959 Chainable API for SelectQuery

[s.kolbachev] Refactor Locking Project

[s.kolbachev] Refactor People Project & Inheritance Projects

[s.kolbachev] Refactor Relationships Project

[s.kolbachev] Refactor TestMap Project

[s.kolbachev] Fix license header

[s.kolbachev] Refactor Default Project

[aadamchik] Squashed commit of the following:

------------------------------------------
[...truncated 44002 lines...]
  DataContextPrefetchIT.testPrefetchToOneSharedCache ? NoClassDefFound Could not...
  DataContextPrefetchIT.testPrefetch_ToOne_DbPath ? NoClassDefFound Could not in...
  DataContextPrefetchIT.testPrefetch_ToManyNoReverseWithQualifier ? NoClassDefFound
  DataContextPrefetchIT.testPrefetch_ReflexiveRelationship ? NoClassDefFound Cou...
  DataContextRollbackIT.testRollbackNewObject ? NoClassDefFound Could not initia...
  DataContextRollbackIT.testRollbackWithMultipleNewObjects ? NoClassDefFound Cou...
  DataContextRollbackIT.testRollbackModifiedObject ? NoClassDefFound Could not i...
  DataContextRollbackIT.testRollbackDeletedObject ? NoClassDefFound Could not in...
  DataContextRollbackIT.testRollbackNew ? NoClassDefFound Could not initialize c...
  DataContextRollbackIT.testRollbackRelationshipModification ? NoClassDefFound C...
  DataContextEJBQLInheritanceIT.testSelect ? NoClassDefFound Could not initializ...
  UserTransactionIT.testCommit ? NoClassDefFound Could not initialize class org....
  DataContextEJBQLArrayResultIT.testSQLResultSetMappingMixed ? NoClassDefFound C...
  DataContextEJBQLArrayResultIT.testSQLResultSetMappingScalars ? NoClassDefFound
  DataContextEJBQLArrayResultIT.testSQLResultSetMappingScalar ? NoClassDefFound ...
  DataContextSelectQuerySplitAliasesIT.testAliasPathSplits_SplitJoin ? NoClassDefFound
  DataContextSelectQuerySplitAliasesIT.testAliasPathSplits_SinglePath ? NoClassDefFound
  ObjectStoreDiffRetainingIT.testSnapshotRetainedOnPropertyModification ? NoClassDefFound
  ObjectStoreDiffRetainingIT.testSnapshotRetainedOnRelAndPropertyModification ? NoClassDefFound
  DataContextRefreshQueryIT.testRefreshSingleObject ? NoClassDefFound Could not ...
  DataContextRefreshQueryIT.testRefreshAll ? NoClassDefFound Could not initializ...
  DataContextRefreshQueryIT.testRefreshCollection ? NoClassDefFound Could not in...
  DataContextRefreshQueryIT.testRefreshObjectToMany ? NoClassDefFound Could not ...
  DataContextRefreshQueryIT.testRefreshQueryResultGroupLocal ? NoClassDefFound C...
  DataContextRefreshQueryIT.testRefreshCollectionToOne ? NoClassDefFound Could n...
  DataContextRefreshQueryIT.testRefreshQueryResultsLocalCache ? NoClassDefFound ...
  DataContextRefreshQueryIT.testRefreshQueryResultsSharedCache ? NoClassDefFound
  CDOOne2ManyIT.testSelectWithToManyDBQualifier ? NoClassDefFound Could not init...
  CDOOne2ManyIT.testRemove1 ? NoClassDefFound Could not initialize class org.apa...
  CDOOne2ManyIT.testRemove2 ? NoClassDefFound Could not initialize class org.apa...
  CDOOne2ManyIT.testSelectWithToManyQualifier ? NoClassDefFound Could not initia...
  CDOOne2ManyIT.testPropagatePK ? NoClassDefFound Could not initialize class org...
  CDOOne2ManyIT.testNewAddMultiples ? NoClassDefFound Could not initialize class...
  CDOOne2ManyIT.testNewAdd ? NoClassDefFound Could not initialize class org.apac...
  TypesMappingIT.testGetSqlTypeByJavaString ? NoClassDefFound Could not initiali...
  TypesMappingIT.testGetSqlTypeByJavaPrimitive ? NoClassDefFound Could not initi...
  TypesMappingIT.testGetSqlTypeByJava ? NoClassDefFound Could not initialize cla...
  TypesMappingIT.testTypeInfoCompleteness ? NoClassDefFound Could not initialize...
  HSQLDBAdapterIT.testCreateTableIgnoresDoublePrecision ? NoClassDefFound Could ...
  HSQLDBAdapterIT.testCreateTableAddsCachedKeyword ? NoClassDefFound Could not i...
  MySQLAdapterIT.testCreateTableAppendPKClause ? NoClassDefFound Could not initi...
  SQLServerAdapterIT.testCreateTableWithFloatAttributeWithScale ? NoClassDefFound
  SQLServerSnifferIT.testCreateAdapter ? NoClassDefFound Could not initialize cl...
  JdbcPkGeneratorIT.testLongPk ? NoClassDefFound Could not initialize class org....
  ConcurrentPkGeneratorIT.testConcurrentInserts ? NoClassDefFound Could not init...
  PostgresAdapterIT.testCreateTableWithFloatAttributeWithScale ? NoClassDefFound
  PkGeneratorIT.testGeneratePkForDbEntity ? NoClassDefFound Could not initialize...
  AutoAdapterIT.testCreateSQLTemplateAction ? NoClassDefFound Could not initiali...
  AutoAdapterIT.testGetAdapter_Proxy ? NoClassDefFound Could not initialize clas...
  JdbcAdapterIT.testExternalTypesForJdbcType ? NoClassDefFound Could not initial...
  JdbcAdapterIT.testCreateTableQuoteSqlIdentifiers ? NoClassDefFound Could not i...
  OracleAdapterIT.testTimestampMapping ? NoClassDefFound Could not initialize cl...
  OracleAdapterIT.testUpdatesLOBColumns ? NoClassDefFound Could not initialize c...
  Oracle8AdapterIT.testFindAdapterResource ? NoClassDefFound Could not initializ...
  Oracle8AdapterIT.testTimestampMapping ? NoClassDefFound Could not initialize c...
  OraclePkGeneratorIT.testSequenceNameCustom1 ? NoClassDefFound Could not initia...
  OraclePkGeneratorIT.testSequenceNameCustom2 ? NoClassDefFound Could not initia...
  OraclePkGeneratorIT.testSequenceNameDefault ? NoClassDefFound Could not initia...
  CayenneDataObjectRelationshipsIT.testReciprocalRel1 ? NoClassDefFound Could no...
  CayenneDataObjectRelationshipsIT.testCrossContextRelationshipException ? NoClassDefFound
  CayenneDataObjectRelationshipsIT.testReflexiveRelationshipInsertOrder1 ? NoClassDefFound
  CayenneDataObjectRelationshipsIT.testReflexiveRelationshipInsertOrder2 ? NoClassDefFound
  CayenneDataObjectRelationshipsIT.testReflexiveRelationshipInsertOrder3 ? NoClassDefFound
  CayenneDataObjectRelationshipsIT.testReflexiveRelationshipInsertOrder4 ? NoClassDefFound
  CayenneDataObjectRelationshipsIT.testReadToManyRel1 ? NoClassDefFound Could no...
  CayenneDataObjectRelationshipsIT.testReadToManyRel2 ? NoClassDefFound Could no...
  CayenneDataObjectRelationshipsIT.testReadNestedProperty1 ? NoClassDefFound Cou...
  CayenneDataObjectRelationshipsIT.testReadNestedProperty2 ? NoClassDefFound Cou...
  CayenneDataObjectRelationshipsIT.testComplexInsertUpdateOrdering ? NoClassDefFound
  CayenneDataObjectRelationshipsIT.testNewToMany ? NoClassDefFound Could not ini...
  CayenneDataObjectRelationshipsIT.testReadToOneRel1 ? NoClassDefFound Could not...
  CayenneDataObjectRelationshipsIT.testReadToOneRel2 ? NoClassDefFound Could not...
  CayenneDataObjectRelationshipsIT.testReadToOneRel3 ? NoClassDefFound Could not...
  CayenneDataObjectIT.testReadNestedPropertyToManyInMiddle ? NoClassDefFound Cou...
  CayenneDataObjectIT.testSetPersistenceState ? NoClassDefFound Could not initia...
  CayenneDataObjectIT.testReadNestedPropertyNonPersistentNotString ? NoClassDefFound
  CayenneDataObjectIT.testReadNestedPropertyNotPersistentString ? NoClassDefFound
  CayenneDataObjectIT.testFilterObjects ? NoClassDefFound Could not initialize c...
  CayenneDataObjectIT.testReadNestedProperty1 ? NoClassDefFound Could not initia...
  CayenneDataObjectIT.testReadNestedPropertyNonDataObjectPath ? NoClassDefFound ...
  CayenneDataObjectIT.testSetObjectId ? NoClassDefFound Could not initialize cla...
  CayenneDataObjectIT.testReadNestedPropertyToManyInMiddle1 ? NoClassDefFound Co...
  CDOOneDep2OneIT.testReplace ? NoClassDefFound Could not initialize class org.a...
  CDOOneDep2OneIT.testNewAdd1 ? NoClassDefFound Could not initialize class org.a...
  CDOOneDep2OneIT.testNewAdd2 ? NoClassDefFound Could not initialize class org.a...
  PersistenceByReachabilityIT.testToOneTargetTransient ? NoClassDefFound Could n...
  PersistenceByReachabilityIT.testToOneTargetPersistent ? NoClassDefFound Could ...
  PersistenceByReachabilityIT.testToManyTargetDifferentContext ? NoClassDefFound
  PersistenceByReachabilityIT.testToOneTargetDifferentContext ? NoClassDefFound ...
  PersistenceByReachabilityIT.testToManyTargetPersistent ? NoClassDefFound Could...
  PersistenceByReachabilityIT.testToManyTargetTransient ? NoClassDefFound Could ...
  PersistentObjectIT.testPersistenceState ? NoClassDefFound Could not initialize...
  PersistentObjectIT.testObjectContext ? NoClassDefFound Could not initialize cl...
  PersistentObjectIT.testObjectID ? NoClassDefFound Could not initialize class o...
  CDOOne2OneDepIT.testRollbackDependent ? NoClassDefFound Could not initialize c...
  CDOOne2OneDepIT.test2Null ? NoClassDefFound Could not initialize class org.apa...
  CDOOne2OneDepIT.testReplaceNull ? NoClassDefFound Could not initialize class o...
  CDOOne2OneDepIT.testTakeObjectSnapshotDependentFault ? NoClassDefFound Could n...
  CDOOne2OneDepIT.testNewAdd ? NoClassDefFound Could not initialize class org.ap...
  EntityMergeSupportIT.testMerging ? NoClassDefFound Could not initialize class ...
  ShallowMergeOperationIT.testMerge_PersistenceStates ? NoClassDefFound Could no...
  ShallowMergeOperationIT.testMerge_NoOverride ? NoClassDefFound Could not initi...
  ShallowMergeOperationIT.testMerge_Relationship ? NoClassDefFound Could not ini...
  DeepMergeOperationInheritanceIT.testDeepMergeNonExistentSubclass ? NoClassDefFound
  DeepMergeOperationInheritanceIT.testDeepMergeExistingSubclass ? NoClassDefFound
  DeepMergeOperationIT.testDeepMergeNonExistent ? NoClassDefFound Could not init...
  DeepMergeOperationIT.testDeepMergeModified ? NoClassDefFound Could not initial...
  QueryCacheIT.testLocalCache ? NoClassDefFound Could not initialize class org.a...
  CayenneIT.testObjectForPKTemporary ? NoClassDefFound Could not initialize clas...
  CayenneIT.testObjectForQuery ? NoClassDefFound Could not initialize class org....
  CayenneIT.testObjectForQueryNoObject ? NoClassDefFound Could not initialize cl...
  CayenneIT.testReadNestedProperty_ToMany ? NoClassDefFound Could not initialize...
  CayenneIT.testScalarObjectForQuery ? NoClassDefFound Could not initialize clas...
  CayenneIT.testObjectForPKEntityInt ? NoClassDefFound Could not initialize clas...
  CayenneIT.testScalarObjectForQuery2 ? NoClassDefFound Could not initialize cla...
  CayenneIT.testIntPKForObject ? NoClassDefFound Could not initialize class org....
  CayenneIT.testObjectForSelect ? NoClassDefFound Could not initialize class org...
  CayenneIT.testMakePath ? NoClassDefFound Could not initialize class org.apache...
  CayenneIT.testObjectForPKObjectId ? NoClassDefFound Could not initialize class...
  CayenneIT.testPKForObject ? NoClassDefFound Could not initialize class org.apa...
  CayenneIT.testObjectForPKClassInt ? NoClassDefFound Could not initialize class...
  CayenneIT.testObjectForPKClassMap ? NoClassDefFound Could not initialize class...
  CayenneIT.testNoObjectForPK ? NoClassDefFound Could not initialize class org.a...
  PoolManagerIT.testDataSourceUrl ? NoClassDefFound Could not initialize class o...
  PoolManagerIT.testMaxConnections ? NoClassDefFound Could not initialize class ...
  PoolManagerIT.testMinConnections ? NoClassDefFound Could not initialize class ...
  PoolManagerIT.testPooling ? NoClassDefFound Could not initialize class org.apa...
  PoolManagerIT.testUserName ? NoClassDefFound Could not initialize class org.ap...
  PoolManagerIT.testPassword ? NoClassDefFound Could not initialize class org.ap...
  BindDirectiveIT.testBindForNotPassedParam ? NoClassDefFound Could not initiali...
  BindDirectiveIT.testBindingForCollection ? NoClassDefFound Could not initializ...
  BindDirectiveIT.testBindTimestamp ? NoClassDefFound Could not initialize class...
  BindDirectiveIT.testBindForPassedNullParam ? NoClassDefFound Could not initial...
  BindDirectiveIT.testBindWithJDBCForNotPassedParam ? NoClassDefFound Could not ...
  BindDirectiveIT.testBindSQLDate ? NoClassDefFound Could not initialize class o...
  BindDirectiveIT.testBindWithJDBCForPassedNullParam ? NoClassDefFound Could not...
  BindDirectiveIT.testBindUtilDate ? NoClassDefFound Could not initialize class ...
  ResultDirectiveIT.testWithoutResultDirective ? NoClassDefFound Could not initi...
  ResultDirectiveIT.testWithMixedDirectiveUse1 ? NoClassDefFound Could not initi...
  ResultDirectiveIT.testWithMixedDirectiveUse2 ? NoClassDefFound Could not initi...
  ResultDirectiveIT.testWithOnlyResultDirective ? NoClassDefFound Could not init...
  EJBQLCompiledExpressionIT.testGetExpression ? NoClassDefFound Could not initia...
  EJBQLCompiledExpressionIT.testGetEntityDescriptorCaseSensitivity ? NoClassDefFound
  EJBQLCompiledExpressionIT.testGetEntityDescriptor ? NoClassDefFound Could not ...
  EJBQLCompiledExpressionIT.testGetSource ? NoClassDefFound Could not initialize...
  EJBQLCompiledExpressionIT.testGetRootDescriptor ? NoClassDefFound Could not in...
  PregeneratedPKIT.testLongPk ? NoClassDefFound Could not initialize class org.a...

Tests run: 1445, Failures: 0, Errors: 1444, Skipped: 0

[WARNING] File encoding has not been set, using platform encoding ANSI_X3.4-1968, i.e. build
is platform dependent!
[INFO] 
[INFO] --- maven-failsafe-plugin:2.17:verify (integration-test) @ cayenne-server ---
[INFO] Failsafe report directory: /x1/jenkins/jenkins-slave/workspace/cayenne-master/cayenneTestConnection/derby/jdk/jdk-1.8.0/label/Ubuntu/cayenne-server/target/failsafe-reports
[WARNING] File encoding has not been set, using platform encoding ANSI_X3.4-1968, i.e. build
is platform dependent!
[INFO] ------------------------------------------------------------------------
[INFO] Reactor Summary:
[INFO] 
[INFO] Cayenne ........................................... SUCCESS [0.465s]
[INFO] Cayenne Build Tools Parent ........................ SUCCESS [0.031s]
[INFO] Cayenne License and Notice Bundle ................. SUCCESS [5.214s]
[INFO] Common Unit Test Utilities ........................ SUCCESS [3.104s]
[INFO] Cayenne Code Checkers ............................. SUCCESS [3.094s]
[INFO] Cayenne Dependency Injection Container ............ SUCCESS [20.030s]
[INFO] Cayenne Server .................................... FAILURE [3:14.652s]
[INFO] Cayenne ROP Client ................................ SKIPPED
[INFO] Cayenne Project ................................... SKIPPED
[INFO] Cayenne Tools ..................................... SKIPPED
[INFO] Cayenne Lifecycle Utilities ....................... SKIPPED
[INFO] Cayenne Maven Plugins ............................. SKIPPED
[INFO] Cayenne Maven Plugin .............................. SKIPPED
[INFO] Cayenne Cryptography Extensions ................... SKIPPED
[INFO] Cayenne Integration Tests Parent .................. SKIPPED
[INFO] Integration Tests - Cayenne Tools ................. SKIPPED
[INFO] Cayenne Modeler Parent ............................ SKIPPED
[INFO] Cayenne WebObjects Compatibility Library .......... SKIPPED
[INFO] Cayenne Modeler ................................... SKIPPED
[INFO] Cayenne Modeler Generic and Windows Extensions .... SKIPPED
[INFO] Cayenne Modeler Generic ........................... SKIPPED
[INFO] Cayenne Modeler Mac OS X Extensions ............... SKIPPED
[INFO] Cayenne Modeler Mac OS X .......................... SKIPPED
[INFO] Cayenne Modeler Mac OS X - Old Apple Java ......... SKIPPED
[INFO] Cayenne Modeler Windows ........................... SKIPPED
[INFO] Cayenne Modeler Maven Plugin ...................... SKIPPED
[INFO] Cayenne Tutorial .................................. SKIPPED
[INFO] Cayenne ROP Server Tutorial ....................... SKIPPED
[INFO] Cayenne ROP Client Tutorial ....................... SKIPPED
[INFO] Cayenne Tutorials ................................. SKIPPED
[INFO] Cayenne Documenation Parent ....................... SKIPPED
[INFO] Cayenne Documentation ............................. SKIPPED
[INFO] Cayenne Docbook Documentation ..................... SKIPPED
[INFO] Docbook: Cayenne Stylesheets ...................... SKIPPED
[INFO] Docbook: Cayenne Guide ............................ SKIPPED
[INFO] Docbook: Getting Started with Cayenne ............. SKIPPED
[INFO] Docbook: Getting Started with Cayenne ROP ......... SKIPPED
[INFO] Docbook: Cayenne New Features and Upgrade Guide ... SKIPPED
[INFO] Cayenne Release Assembly .......................... SKIPPED
[INFO] ------------------------------------------------------------------------
[INFO] BUILD FAILURE
[INFO] ------------------------------------------------------------------------
[INFO] Total time: 3:47.539s
[INFO] Finished at: Fri Nov 14 18:33:19 UTC 2014
[INFO] Final Memory: 81M/1647M
[INFO] ------------------------------------------------------------------------
[ERROR] Failed to execute goal org.apache.maven.plugins:maven-failsafe-plugin:2.17:verify
(integration-test) on project cayenne-server: There are test failures.
[ERROR] 
[ERROR] Please refer to /x1/jenkins/jenkins-slave/workspace/cayenne-master/cayenneTestConnection/derby/jdk/jdk-1.8.0/label/Ubuntu/cayenne-server/target/failsafe-reports
for the individual test results.
[ERROR] -> [Help 1]
org.apache.maven.lifecycle.LifecycleExecutionException: Failed to execute goal org.apache.maven.plugins:maven-failsafe-plugin:2.17:verify
(integration-test) on project cayenne-server: There are test failures.

Please refer to /x1/jenkins/jenkins-slave/workspace/cayenne-master/cayenneTestConnection/derby/jdk/jdk-1.8.0/label/Ubuntu/cayenne-server/target/failsafe-reports
for the individual test results.
	at org.apache.maven.lifecycle.internal.MojoExecutor.execute(MojoExecutor.java:213)
	at org.apache.maven.lifecycle.internal.MojoExecutor.execute(MojoExecutor.java:153)
	at org.apache.maven.lifecycle.internal.MojoExecutor.execute(MojoExecutor.java:145)
	at org.apache.maven.lifecycle.internal.LifecycleModuleBuilder.buildProject(LifecycleModuleBuilder.java:84)
	at org.apache.maven.lifecycle.internal.LifecycleModuleBuilder.buildProject(LifecycleModuleBuilder.java:59)
	at org.apache.maven.lifecycle.internal.LifecycleStarter.singleThreadedBuild(LifecycleStarter.java:183)
	at org.apache.maven.lifecycle.internal.LifecycleStarter.execute(LifecycleStarter.java:161)
	at org.apache.maven.DefaultMaven.doExecute(DefaultMaven.java:320)
	at org.apache.maven.DefaultMaven.execute(DefaultMaven.java:156)
	at org.apache.maven.cli.MavenCli.execute(MavenCli.java:537)
	at org.apache.maven.cli.MavenCli.doMain(MavenCli.java:196)
	at org.apache.maven.cli.MavenCli.main(MavenCli.java:141)
	at sun.reflect.NativeMethodAccessorImpl.invoke0(Native Method)
	at sun.reflect.NativeMethodAccessorImpl.invoke(NativeMethodAccessorImpl.java:62)
	at sun.reflect.DelegatingMethodAccessorImpl.invoke(DelegatingMethodAccessorImpl.java:43)
	at java.lang.reflect.Method.invoke(Method.java:483)
	at org.codehaus.plexus.classworlds.launcher.Launcher.launchEnhanced(Launcher.java:290)
	at org.codehaus.plexus.classworlds.launcher.Launcher.launch(Launcher.java:230)
	at org.codehaus.plexus.classworlds.launcher.Launcher.mainWithExitCode(Launcher.java:409)
	at org.codehaus.plexus.classworlds.launcher.Launcher.main(Launcher.java:352)
Caused by: org.apache.maven.plugin.MojoFailureException: There are test failures.

Please refer to /x1/jenkins/jenkins-slave/workspace/cayenne-master/cayenneTestConnection/derby/jdk/jdk-1.8.0/label/Ubuntu/cayenne-server/target/failsafe-reports
for the individual test results.
	at org.apache.maven.plugin.surefire.SurefireHelper.reportExecution(SurefireHelper.java:82)
	at org.apache.maven.plugin.failsafe.VerifyMojo.execute(VerifyMojo.java:194)
	at org.apache.maven.plugin.DefaultBuildPluginManager.executeMojo(DefaultBuildPluginManager.java:101)
	at org.apache.maven.lifecycle.internal.MojoExecutor.execute(MojoExecutor.java:209)
	... 19 more
[ERROR] 
[ERROR] Re-run Maven using the -X switch to enable full debug logging.
[ERROR] 
[ERROR] For more information about the errors and possible solutions, please read the following
articles:
[ERROR] [Help 1] http://cwiki.apache.org/confluence/display/MAVEN/MojoFailureException
[ERROR] 
[ERROR] After correcting the problems, you can resume the build with the command
[ERROR]   mvn <goals> -rf :cayenne-server
Build step 'Invoke top-level Maven targets' marked build as failure
Recording test results

Mime
View raw message