cayenne-commits mailing list archives

Site index · List index
Message view « Date » · « Thread »
Top « Date » · « Thread »
From Apache Jenkins Server <jenk...@builds.apache.org>
Subject Build failed in Jenkins: cayenne-master » derby,jdk-1.8.0,Ubuntu #84
Date Sat, 15 Nov 2014 10:24:11 GMT
See <https://builds.apache.org/job/cayenne-master/cayenneTestConnection=derby,jdk=jdk-1.8.0,label=Ubuntu/84/changes>

Changes:

[aadamchik] refactoring, cleanup

[aadamchik] unit test cleanup

[aadamchik] ensuring non-null cache strategy

------------------------------------------
[...truncated 43986 lines...]
  SelectQueryCacheKeyIT.testUseSharedCache » NoClassDefFound Could not initializ...
  SelectQueryCacheKeyIT.testUniqueKeyEntity » NoClassDefFound Could not initiali...
  SelectQueryCacheKeyIT.testNamedQuery » NoClassDefFound Could not initialize cl...
  SelectQueryCacheKeyIT.testSharedCache » NoClassDefFound Could not initialize c...
  SelectQueryCacheKeyIT.testLocalCache » NoClassDefFound Could not initialize cl...
  SelectQueryCacheKeyIT.testUniqueKeyEntityFetchLimit » NoClassDefFound Could no...
  SelectQueryCacheKeyIT.testNoCache » NoClassDefFound Could not initialize class...
  SelectQueryCacheKeyIT.testUniqueKeyEntityQualifier » NoClassDefFound Could not...
  SelectQueryCacheKeyIT.testUseLocalCache » NoClassDefFound Could not initialize...
  SelectQueryPrefetchRouterActionIT.testPrefetchPaintings2 » NoClassDefFound Cou...
  SelectQueryPrefetchRouterActionIT.testPaintings1 » NoClassDefFound Could not i...
  SelectQueryPrefetchRouterActionIT.testGalleries » NoClassDefFound Could not in...
  SelectQueryFetchLimitOrderingIT.testOrdering » NoClassDefFound Could not initi...
  SelectQueryPrefetchRouterActionQualifiedEntityIT.testPrefetchManager » NoClassDefFound
  SelectQueryPrefetchRouterActionQualifiedEntityIT.testPrefetchEmployee » NoClassDefFound
  SQLTemplateCacheKeyIT.testCacheFetchLimitAndOffset » NoClassDefFound Could not...
  SQLTemplateCacheKeyIT.testNamedQuery » NoClassDefFound Could not initialize cl...
  SQLTemplateCacheKeyIT.testSharedCache » NoClassDefFound Could not initialize c...
  SQLTemplateCacheKeyIT.testLocalCache » NoClassDefFound Could not initialize cl...
  SQLTemplateCacheKeyIT.testNoCache » NoClassDefFound Could not initialize class...
  SQLSelectIT.test_DataRows_FetchLimit » NoClassDefFound Could not initialize cl...
  SQLSelectIT.test_Append » NoClassDefFound Could not initialize class org.apach...
  SQLSelectIT.test_Select » NoClassDefFound Could not initialize class org.apach...
  SQLSelectIT.test_SelectLong » NoClassDefFound Could not initialize class org.a...
  SQLSelectIT.test_DataRows_DefaultRoot » NoClassDefFound Could not initialize c...
  SQLSelectIT.testSQLTemplate_PositionalParams » NoClassDefFound Could not initi...
  SQLSelectIT.test_DataRows_DataMapNameRoot » NoClassDefFound Could not initiali...
  SQLSelectIT.test_DataRows_ClassRoot_Bind » NoClassDefFound Could not initializ...
  SQLSelectIT.test_DataRows_ClassRoot » NoClassDefFound Could not initialize cla...
  SQLSelectIT.test_DataRows_FetchOffset » NoClassDefFound Could not initialize c...
  SQLSelectIT.test_SelectOne » NoClassDefFound Could not initialize class org.ap...
  SQLSelectIT.test_DataRows_ClassRoot_Parameters » NoClassDefFound Could not ini...
  SQLSelectIT.test_SelectLongArray » NoClassDefFound Could not initialize class ...
  SQLSelectIT.test_DataRows_ColumnNameCaps » NoClassDefFound Could not initializ...
  SQLSelectIT.test_SelectCount » NoClassDefFound Could not initialize class org....
  EJBQLQueryIT.testDataRows » NoClassDefFound Could not initialize class org.apa...
  EJBQLQueryIT.testNullAndNotNullParameter » NoClassDefFound Could not initializ...
  EJBQLQueryIT.testInWithSingleCollectionNamedParameter_withoutBrackets » NoClassDefFound
  EJBQLQueryIT.testUniqueKeyEntity » NoClassDefFound Could not initialize class ...
  EJBQLQueryIT.testInWithMultipleStringPositionalParameters_withBrackets » NoClassDefFound
  EJBQLQueryIT.testJoinAndCount » NoClassDefFound Could not initialize class org...
  EJBQLQueryIT.testInWithSingleCollectionNamedParameter_withBrackets » NoClassDefFound
  EJBQLQueryIT.testInWithSingleCollectionPositionalParameter_withoutBrackets » NoClassDefFound
  EJBQLQueryIT.testInWithSingleCollectionPositionalParameter_withBrackets » NoClassDefFound
  EJBQLQueryIT.testSelectRelationship » NoClassDefFound Could not initialize cla...
  EJBQLQueryIT.testOrBrackets » NoClassDefFound Could not initialize class org.a...
  EJBQLQueryIT.testGetName » NoClassDefFound Could not initialize class org.apac...
  EJBQLQueryIT.testLikeWithExplicitEscape » NoClassDefFound Could not initialize...
  EJBQLQueryIT.testParameters » NoClassDefFound Could not initialize class org.a...
  EJBQLQueryIT.testGetExpression » NoClassDefFound Could not initialize class or...
  EJBQLQueryIT.testCacheParameters » NoClassDefFound Could not initialize class ...
  EJBQLQueryIT.testRelationshipWhereClause2 » NoClassDefFound Could not initiali...
  EJBQLQueryIT.testNullPositionalParameter » NoClassDefFound Could not initializ...
  EJBQLQueryIT.testRelationshipWhereClause » NoClassDefFound Could not initializ...
  EJBQLQueryIT.testInWithSingleStringPositionalParameter_withoutBrackets » NoClassDefFound
  EJBQLQueryIT.testGetMetadata » NoClassDefFound Could not initialize class org....
  EJBQLQueryIT.testNullParameter » NoClassDefFound Could not initialize class or...
  EJBQLQueryIT.testEncodeAsXML » NoClassDefFound Could not initialize class org....
  EJBQLQueryIT.testCacheStrategy » NoClassDefFound Could not initialize class or...
  EJBQLQueryIT.testJoinToJoined » NoClassDefFound Could not initialize class org...
  EJBQLQueryIT.testNullNotEqualsParameter » NoClassDefFound Could not initialize...
  SelectQueryIT.testSelectLikeIgnoreCaseObjects1 » NoClassDefFound Could not ini...
  SelectQueryIT.testSelectLikeIgnoreCaseObjects2 » NoClassDefFound Could not ini...
  SelectQueryIT.testSelectBooleanFalse » NoClassDefFound Could not initialize cl...
  SelectQueryIT.testSelectEmptyNotIn » NoClassDefFound Could not initialize clas...
  SelectQueryIT.testRouteQueryWithPrefetchesPrefetchExpressionPath » NoClassDefFound
  SelectQueryIT.testRouteWithPrefetches » NoClassDefFound Could not initialize c...
  SelectQueryIT.testSelectLongIn » NoClassDefFound Could not initialize class or...
  SelectQueryIT.testSelectBooleanFalseOr » NoClassDefFound Could not initialize ...
  SelectQueryIT.testSelectBooleanNotTrueOr » NoClassDefFound Could not initializ...
  SelectQueryIT.testSelectAllObjectsRootObjEntity » NoClassDefFound Could not in...
  SelectQueryIT.testFetchOffsetWithQualifier » NoClassDefFound Could not initial...
  SelectQueryIT.testAndQualifier » NoClassDefFound Could not initialize class or...
  SelectQueryIT.testSelectLikeMultipleWildcardMatch » NoClassDefFound Could not ...
  SelectQueryIT.testSelectParameterizedIn » NoClassDefFound Could not initialize...
  SelectQueryIT.testSelectNotLikeIgnoreCaseSingleWildcardMatch » NoClassDefFound
  SelectQueryIT.testLeftJoinAndPrefetchToMany » NoClassDefFound Could not initia...
  SelectQueryIT.testSelectNotLikeSingleWildcardMatch » NoClassDefFound Could not...
  SelectQueryIT.testFetchLimit » NoClassDefFound Could not initialize class org....
  SelectQueryIT.testCacheOffsetAndLimit » NoClassDefFound Could not initialize c...
  SelectQueryIT.testFetchOffset » NoClassDefFound Could not initialize class org...
  SelectQueryIT.testSelectParameterizedEmptyNotIn » NoClassDefFound Could not in...
  SelectQueryIT.testSelectLikeCaseSensitive » NoClassDefFound Could not initiali...
  SelectQueryIT.testSelectAllObjectsRootClass » NoClassDefFound Could not initia...
  SelectQueryIT.testSelectLikeSingleWildcardMatch » NoClassDefFound Could not in...
  SelectQueryIT.testSelect_WithOrdering » NoClassDefFound Could not initialize c...
  SelectQueryIT.testSelectAllObjectsRootEntityName » NoClassDefFound Could not i...
  SelectQueryIT.testLeftJoinAndPrefetchToOne » NoClassDefFound Could not initial...
  SelectQueryIT.testSelectParameterizedEmptyIn » NoClassDefFound Could not initi...
  SelectQueryIT.testSelectEmptyIn » NoClassDefFound Could not initialize class o...
  SelectQueryIT.testFetchLimitWithQualifier » NoClassDefFound Could not initiali...
  SelectQueryIT.testSetQualifier » NoClassDefFound Could not initialize class or...
  SelectQueryIT.testSelectLikeExactMatch » NoClassDefFound Could not initialize ...
  SelectQueryIT.testSelect_MatchObject » NoClassDefFound Could not initialize cl...
  SelectQueryIT.testDbEntityRoot » NoClassDefFound Could not initialize class or...
  SelectQueryIT.testOrQualifier » NoClassDefFound Could not initialize class org...
  SelectQueryIT.testSelectBooleanTrue » NoClassDefFound Could not initialize cla...
  SelectQueryIT.testFetchLimitWithOffset » NoClassDefFound Could not initialize ...
  SelectQueryIT.testSelectIn » NoClassDefFound Could not initialize class org.ap...
  SelectQueryIT.testRouteQueryWithPrefetchesNoReverse » NoClassDefFound Could no...
  SelectQueryIT.testSelectLikeSingleWildcardMatchAndEscape » NoClassDefFound Cou...
  SelectQueryClobIT.testSelectLikeIgnoreCaseClob » NoClassDefFound Could not ini...
  SelectQueryClobIT.testSelectNotEqualsClob » NoClassDefFound Could not initiali...
  SelectQueryClobIT.testSelectEqualsClob » NoClassDefFound Could not initialize ...
  SelectQueryClobIT.testSelectFetchLimit_Offset_DistinctClob » NoClassDefFound C...
  SQLTemplateIT.testSQLTemplateForDataMap » NoClassDefFound Could not initialize...
  SQLTemplateIT.testSQLTemplateForDataMapWithInsert » NoClassDefFound Could not ...
  SQLTemplateIT.testSQLTemplate_PositionalParams_ToManyParams » NoClassDefFound ...
  SQLTemplateIT.testSQLTemplateForDataMapWithInsertException » NoClassDefFound C...
  SQLTemplateIT.testSQLTemplate_PositionalParams » NoClassDefFound Could not ini...
  SQLTemplateIT.testSQLTemplate_PositionalParams_ToFewParams » NoClassDefFound C...
  SQLTemplateIT.testSQLTemplate_PositionalParams_RepeatingVars » NoClassDefFound
  SelectQueryReturnTypesIT.testSelectBitwiseAnd » NoClassDefFound Could not init...
  SelectQueryReturnTypesIT.testSelectBitwiseNot » NoClassDefFound Could not init...
  SelectQueryReturnTypesIT.testSelectBitwiseXor » NoClassDefFound Could not init...
  SelectQueryReturnTypesIT.testSelectBitwiseOr » NoClassDefFound Could not initi...
  EJBQLQueryNumericIT.testLongLiteral » NoClassDefFound Could not initialize cla...
  EJBQLQueryNumericIT.testLongParameter » NoClassDefFound Could not initialize c...
  PoolManagerIT.testDataSourceUrl » NoClassDefFound Could not initialize class o...
  PoolManagerIT.testMaxConnections » NoClassDefFound Could not initialize class ...
  PoolManagerIT.testMinConnections » NoClassDefFound Could not initialize class ...
  PoolManagerIT.testPooling » NoClassDefFound Could not initialize class org.apa...
  PoolManagerIT.testUserName » NoClassDefFound Could not initialize class org.ap...
  PoolManagerIT.testPassword » NoClassDefFound Could not initialize class org.ap...
  DataContextMaxIdQualifierIT.testDisjointByIdPrefetch » NoClassDefFound Could n...
  DataContextMaxIdQualifierIT.testDisjointByIdPrefetch_Zero » NoClassDefFound Co...
  DataContextMaxIdQualifierIT.testIncrementalFaultList_Negative » NoClassDefFound
  DataContextMaxIdQualifierIT.testIncrementalFaultList_Higher » NoClassDefFound ...
  DataContextMaxIdQualifierIT.testIncrementalFaultList_Lower » NoClassDefFound C...
  DataContextMaxIdQualifierIT.testDisjointByIdPrefetch_Negative » NoClassDefFound
  DataContextMaxIdQualifierIT.testIncrementalFaultList_Zero » NoClassDefFound Co...
  CDOQualifiedEntitiesIT.testReadToMany » NoClassDefFound Could not initialize c...
  CDOQualifiedEntitiesIT.testReadToOne » NoClassDefFound Could not initialize cl...
  CDOMany2OneIT.testSavedAdd » NoClassDefFound Could not initialize class org.ap...
  CDOMany2OneIT.testSelectViaMultiRelationship » NoClassDefFound Could not initi...
  CDOMany2OneIT.testSelectViaRelationship » NoClassDefFound Could not initialize...
  CDOMany2OneIT.testMultipleToOneDeletion » NoClassDefFound Could not initialize...
  CDOMany2OneIT.testReadRO1 » NoClassDefFound Could not initialize class org.apa...
  CDOMany2OneIT.testReadRO2 » NoClassDefFound Could not initialize class org.apa...
  CDOMany2OneIT.testReplace » NoClassDefFound Could not initialize class org.apa...
  CDOMany2OneIT.testNewAdd » NoClassDefFound Could not initialize class org.apac...
  CDOMany2OneIT.testRemove » NoClassDefFound Could not initialize class org.apac...
  CDOMany2OneNoRevIT.testNewAdd » NoClassDefFound Could not initialize class org...
  GenericMappingIT.testInsertRelated » NoClassDefFound Could not initialize clas...
  GenericMappingIT.testUpdateRelated » NoClassDefFound Could not initialize clas...
  GenericMappingIT.testSelect » NoClassDefFound Could not initialize class org.a...
  GenericMappingIT.testInsertSingle » NoClassDefFound Could not initialize class...

Tests run: 1445, Failures: 0, Errors: 1444, Skipped: 0

[WARNING] File encoding has not been set, using platform encoding ISO-8859-1, i.e. build is
platform dependent!
[INFO] 
[INFO] --- maven-failsafe-plugin:2.17:verify (integration-test) @ cayenne-server ---
[INFO] Failsafe report directory: <https://builds.apache.org/job/cayenne-master/cayenneTestConnection=derby,jdk=jdk-1.8.0,label=Ubuntu/ws/cayenne-server/target/failsafe-reports>
[WARNING] File encoding has not been set, using platform encoding ISO-8859-1, i.e. build is
platform dependent!
[INFO] ------------------------------------------------------------------------
[INFO] Reactor Summary:
[INFO] 
[INFO] Cayenne ........................................... SUCCESS [0.350s]
[INFO] Cayenne Build Tools Parent ........................ SUCCESS [0.019s]
[INFO] Cayenne License and Notice Bundle ................. SUCCESS [0.885s]
[INFO] Common Unit Test Utilities ........................ SUCCESS [1.319s]
[INFO] Cayenne Code Checkers ............................. SUCCESS [0.064s]
[INFO] Cayenne Dependency Injection Container ............ SUCCESS [9.852s]
[INFO] Cayenne Server .................................... FAILURE [1:47.573s]
[INFO] Cayenne ROP Client ................................ SKIPPED
[INFO] Cayenne Project ................................... SKIPPED
[INFO] Cayenne Tools ..................................... SKIPPED
[INFO] Cayenne Lifecycle Utilities ....................... SKIPPED
[INFO] Cayenne Maven Plugins ............................. SKIPPED
[INFO] Cayenne Maven Plugin .............................. SKIPPED
[INFO] Cayenne Cryptography Extensions ................... SKIPPED
[INFO] Cayenne Integration Tests Parent .................. SKIPPED
[INFO] Integration Tests - Cayenne Tools ................. SKIPPED
[INFO] Cayenne Modeler Parent ............................ SKIPPED
[INFO] Cayenne WebObjects Compatibility Library .......... SKIPPED
[INFO] Cayenne Modeler ................................... SKIPPED
[INFO] Cayenne Modeler Generic and Windows Extensions .... SKIPPED
[INFO] Cayenne Modeler Generic ........................... SKIPPED
[INFO] Cayenne Modeler Mac OS X Extensions ............... SKIPPED
[INFO] Cayenne Modeler Mac OS X .......................... SKIPPED
[INFO] Cayenne Modeler Mac OS X - Old Apple Java ......... SKIPPED
[INFO] Cayenne Modeler Windows ........................... SKIPPED
[INFO] Cayenne Modeler Maven Plugin ...................... SKIPPED
[INFO] Cayenne Tutorial .................................. SKIPPED
[INFO] Cayenne ROP Server Tutorial ....................... SKIPPED
[INFO] Cayenne ROP Client Tutorial ....................... SKIPPED
[INFO] Cayenne Tutorials ................................. SKIPPED
[INFO] Cayenne Documenation Parent ....................... SKIPPED
[INFO] Cayenne Documentation ............................. SKIPPED
[INFO] Cayenne Docbook Documentation ..................... SKIPPED
[INFO] Docbook: Cayenne Stylesheets ...................... SKIPPED
[INFO] Docbook: Cayenne Guide ............................ SKIPPED
[INFO] Docbook: Getting Started with Cayenne ............. SKIPPED
[INFO] Docbook: Getting Started with Cayenne ROP ......... SKIPPED
[INFO] Docbook: Cayenne New Features and Upgrade Guide ... SKIPPED
[INFO] Cayenne Release Assembly .......................... SKIPPED
[INFO] ------------------------------------------------------------------------
[INFO] BUILD FAILURE
[INFO] ------------------------------------------------------------------------
[INFO] Total time: 2:00.795s
[INFO] Finished at: Sat Nov 15 10:23:18 UTC 2014
[INFO] Final Memory: 78M/2242M
[INFO] ------------------------------------------------------------------------
[ERROR] Failed to execute goal org.apache.maven.plugins:maven-failsafe-plugin:2.17:verify
(integration-test) on project cayenne-server: There are test failures.
[ERROR] 
[ERROR] Please refer to <https://builds.apache.org/job/cayenne-master/cayenneTestConnection=derby,jdk=jdk-1.8.0,label=Ubuntu/ws/cayenne-server/target/failsafe-reports>
for the individual test results.
[ERROR] -> [Help 1]
org.apache.maven.lifecycle.LifecycleExecutionException: Failed to execute goal org.apache.maven.plugins:maven-failsafe-plugin:2.17:verify
(integration-test) on project cayenne-server: There are test failures.

Please refer to <https://builds.apache.org/job/cayenne-master/cayenneTestConnection=derby,jdk=jdk-1.8.0,label=Ubuntu/ws/cayenne-server/target/failsafe-reports>
for the individual test results.
	at org.apache.maven.lifecycle.internal.MojoExecutor.execute(MojoExecutor.java:213)
	at org.apache.maven.lifecycle.internal.MojoExecutor.execute(MojoExecutor.java:153)
	at org.apache.maven.lifecycle.internal.MojoExecutor.execute(MojoExecutor.java:145)
	at org.apache.maven.lifecycle.internal.LifecycleModuleBuilder.buildProject(LifecycleModuleBuilder.java:84)
	at org.apache.maven.lifecycle.internal.LifecycleModuleBuilder.buildProject(LifecycleModuleBuilder.java:59)
	at org.apache.maven.lifecycle.internal.LifecycleStarter.singleThreadedBuild(LifecycleStarter.java:183)
	at org.apache.maven.lifecycle.internal.LifecycleStarter.execute(LifecycleStarter.java:161)
	at org.apache.maven.DefaultMaven.doExecute(DefaultMaven.java:320)
	at org.apache.maven.DefaultMaven.execute(DefaultMaven.java:156)
	at org.apache.maven.cli.MavenCli.execute(MavenCli.java:537)
	at org.apache.maven.cli.MavenCli.doMain(MavenCli.java:196)
	at org.apache.maven.cli.MavenCli.main(MavenCli.java:141)
	at sun.reflect.NativeMethodAccessorImpl.invoke0(Native Method)
	at sun.reflect.NativeMethodAccessorImpl.invoke(NativeMethodAccessorImpl.java:62)
	at sun.reflect.DelegatingMethodAccessorImpl.invoke(DelegatingMethodAccessorImpl.java:43)
	at java.lang.reflect.Method.invoke(Method.java:483)
	at org.codehaus.plexus.classworlds.launcher.Launcher.launchEnhanced(Launcher.java:290)
	at org.codehaus.plexus.classworlds.launcher.Launcher.launch(Launcher.java:230)
	at org.codehaus.plexus.classworlds.launcher.Launcher.mainWithExitCode(Launcher.java:409)
	at org.codehaus.plexus.classworlds.launcher.Launcher.main(Launcher.java:352)
Caused by: org.apache.maven.plugin.MojoFailureException: There are test failures.

Please refer to <https://builds.apache.org/job/cayenne-master/cayenneTestConnection=derby,jdk=jdk-1.8.0,label=Ubuntu/ws/cayenne-server/target/failsafe-reports>
for the individual test results.
	at org.apache.maven.plugin.surefire.SurefireHelper.reportExecution(SurefireHelper.java:82)
	at org.apache.maven.plugin.failsafe.VerifyMojo.execute(VerifyMojo.java:194)
	at org.apache.maven.plugin.DefaultBuildPluginManager.executeMojo(DefaultBuildPluginManager.java:101)
	at org.apache.maven.lifecycle.internal.MojoExecutor.execute(MojoExecutor.java:209)
	... 19 more
[ERROR] 
[ERROR] Re-run Maven using the -X switch to enable full debug logging.
[ERROR] 
[ERROR] For more information about the errors and possible solutions, please read the following
articles:
[ERROR] [Help 1] http://cwiki.apache.org/confluence/display/MAVEN/MojoFailureException
[ERROR] 
[ERROR] After correcting the problems, you can resume the build with the command
[ERROR]   mvn <goals> -rf :cayenne-server
Build step 'Invoke top-level Maven targets' marked build as failure
Recording test results

Mime
View raw message