cayenne-commits mailing list archives

Site index · List index
Message view « Date » · « Thread »
Top « Date » · « Thread »
From Apache Jenkins Server <jenk...@builds.apache.org>
Subject Build failed in Jenkins: cayenne-master » derby,jdk-1.8.0,Ubuntu #103
Date Wed, 26 Nov 2014 21:58:47 GMT
See <https://builds.apache.org/job/cayenne-master/cayenneTestConnection=derby,jdk=jdk-1.8.0,label=Ubuntu/103/>

------------------------------------------
[...truncated 100930 lines...]
INFO: === updated 1 row.
Nov 26, 2014 9:57:31 PM org.apache.cayenne.log.CommonsJdbcEventLogger logCommitTransaction
INFO: +++ transaction committed.
Nov 26, 2014 9:57:31 PM org.apache.cayenne.log.CommonsJdbcEventLogger logBeginTransaction
INFO: --- transaction started.
Nov 26, 2014 9:57:31 PM org.apache.cayenne.log.CommonsJdbcEventLogger logQuery
INFO: SELECT t0.ID FROM COLLECTION_TO_MANY t0 WHERE t0.ID = ? [bind: 1->ID:1]
Nov 26, 2014 9:57:31 PM org.apache.cayenne.log.CommonsJdbcEventLogger logSelectCount
INFO: === returned 1 row. - took 1 ms.
Nov 26, 2014 9:57:31 PM org.apache.cayenne.log.CommonsJdbcEventLogger logCommitTransaction
INFO: +++ transaction committed.
Nov 26, 2014 9:57:31 PM org.apache.cayenne.log.CommonsJdbcEventLogger logBeginTransaction
INFO: --- transaction started.
Nov 26, 2014 9:57:31 PM org.apache.cayenne.log.CommonsJdbcEventLogger logQuery
INFO: SELECT t0.COLLECTION_TO_MANY_ID, t0.ID FROM COLLECTION_TO_MANY_TARGET t0 WHERE t0.COLLECTION_TO_MANY_ID
= ? [bind: 1->COLLECTION_TO_MANY_ID:1]
Nov 26, 2014 9:57:31 PM org.apache.cayenne.log.CommonsJdbcEventLogger logSelectCount
INFO: === returned 4 rows. - took 1 ms.
Nov 26, 2014 9:57:31 PM org.apache.cayenne.log.CommonsJdbcEventLogger logCommitTransaction
INFO: +++ transaction committed.
Nov 26, 2014 9:57:31 PM org.apache.cayenne.configuration.XMLDataChannelDescriptorLoader load
INFO: Loading XML configuration resource from <https://builds.apache.org/job/cayenne-master/cayenneTestConnection=derby,jdk=jdk-1.8.0,label=Ubuntu/ws/framework/cayenne-jdk1.5-unpublished/target/test-classes/cayenne-relationships.xml>
Nov 26, 2014 9:57:31 PM org.apache.cayenne.configuration.XMLDataChannelDescriptorLoader$DataChannelChildrenHandler
createChildTagHandler
INFO: Loading XML DataMap resource from <https://builds.apache.org/job/cayenne-master/cayenneTestConnection=derby,jdk=jdk-1.8.0,label=Ubuntu/ws/framework/cayenne-jdk1.5-unpublished/target/test-classes/relationships.map.xml>
Nov 26, 2014 9:57:31 PM org.apache.cayenne.map.EntityResolver applyDBLayerDefaults
INFO: added runtime complimentary DbRelationship from DELETE_RULE_TEST3 to DELETE_RULE_TEST1
Nov 26, 2014 9:57:31 PM org.apache.cayenne.map.EntityResolver applyObjectLayerDefaults
INFO: added runtime complimentary ObjRelationship from FlattenedTest3 to FlattenedTest1
Nov 26, 2014 9:57:31 PM org.apache.cayenne.map.EntityResolver applyObjectLayerDefaults
INFO: added runtime complimentary ObjRelationship from FlattenedTest4 to FlattenedTest1
Nov 26, 2014 9:57:31 PM org.apache.cayenne.test.jdbc.UtilityLogger log
INFO: delete from COLLECTION_TO_MANY_TARGET
Nov 26, 2014 9:57:31 PM org.apache.cayenne.test.jdbc.UtilityLogger log
INFO: delete from COLLECTION_TO_MANY
Nov 26, 2014 9:57:31 PM org.apache.cayenne.test.jdbc.UtilityLogger log
INFO: INSERT INTO COLLECTION_TO_MANY (ID) VALUES (?)
Nov 26, 2014 9:57:31 PM org.apache.cayenne.test.jdbc.UtilityLogger log
INFO: INSERT INTO COLLECTION_TO_MANY (ID) VALUES (?)
Nov 26, 2014 9:57:31 PM org.apache.cayenne.test.jdbc.UtilityLogger log
INFO: INSERT INTO COLLECTION_TO_MANY_TARGET (ID, COLLECTION_TO_MANY_ID) VALUES (?, ?)
Nov 26, 2014 9:57:31 PM org.apache.cayenne.test.jdbc.UtilityLogger log
INFO: INSERT INTO COLLECTION_TO_MANY_TARGET (ID, COLLECTION_TO_MANY_ID) VALUES (?, ?)
Nov 26, 2014 9:57:31 PM org.apache.cayenne.test.jdbc.UtilityLogger log
INFO: INSERT INTO COLLECTION_TO_MANY_TARGET (ID, COLLECTION_TO_MANY_ID) VALUES (?, ?)
Nov 26, 2014 9:57:31 PM org.apache.cayenne.test.jdbc.UtilityLogger log
INFO: INSERT INTO COLLECTION_TO_MANY_TARGET (ID, COLLECTION_TO_MANY_ID) VALUES (?, ?)
Nov 26, 2014 9:57:31 PM org.apache.cayenne.log.CommonsJdbcEventLogger logBeginTransaction
INFO: --- transaction started.
Nov 26, 2014 9:57:31 PM org.apache.cayenne.log.CommonsJdbcEventLogger logQuery
INFO: SELECT t0.ID FROM COLLECTION_TO_MANY t0 WHERE t0.ID = ? [bind: 1->ID:1]
Nov 26, 2014 9:57:31 PM org.apache.cayenne.log.CommonsJdbcEventLogger logSelectCount
INFO: === returned 1 row. - took 0 ms.
Nov 26, 2014 9:57:31 PM org.apache.cayenne.log.CommonsJdbcEventLogger logCommitTransaction
INFO: +++ transaction committed.
Nov 26, 2014 9:57:31 PM org.apache.cayenne.log.CommonsJdbcEventLogger logBeginTransaction
INFO: --- transaction started.
Nov 26, 2014 9:57:31 PM org.apache.cayenne.log.CommonsJdbcEventLogger logQuery
INFO: SELECT t0.COLLECTION_TO_MANY_ID, t0.ID FROM COLLECTION_TO_MANY_TARGET t0 WHERE t0.COLLECTION_TO_MANY_ID
= ? [bind: 1->COLLECTION_TO_MANY_ID:1]
Nov 26, 2014 9:57:31 PM org.apache.cayenne.log.CommonsJdbcEventLogger logSelectCount
INFO: === returned 3 rows. - took 0 ms.
Nov 26, 2014 9:57:31 PM org.apache.cayenne.log.CommonsJdbcEventLogger logCommitTransaction
INFO: +++ transaction committed.
Nov 26, 2014 9:57:31 PM org.apache.cayenne.log.CommonsJdbcEventLogger logBeginTransaction
INFO: --- transaction started.
Nov 26, 2014 9:57:31 PM org.apache.cayenne.log.CommonsJdbcEventLogger logQuery
INFO: UPDATE COLLECTION_TO_MANY_TARGET SET COLLECTION_TO_MANY_ID = ? WHERE ID = ?
Nov 26, 2014 9:57:31 PM org.apache.cayenne.log.CommonsJdbcEventLogger logQueryParameters
INFO: [bind: 1->COLLECTION_TO_MANY_ID:NULL, 2->ID:2]
Nov 26, 2014 9:57:31 PM org.apache.cayenne.log.CommonsJdbcEventLogger logUpdateCount
INFO: === updated 1 row.
Nov 26, 2014 9:57:31 PM org.apache.cayenne.log.CommonsJdbcEventLogger logCommitTransaction
INFO: +++ transaction committed.
Nov 26, 2014 9:57:31 PM org.apache.cayenne.log.CommonsJdbcEventLogger logBeginTransaction
INFO: --- transaction started.
Nov 26, 2014 9:57:31 PM org.apache.cayenne.log.CommonsJdbcEventLogger logQuery
INFO: SELECT t0.ID FROM COLLECTION_TO_MANY t0 WHERE t0.ID = ? [bind: 1->ID:1]
Nov 26, 2014 9:57:31 PM org.apache.cayenne.log.CommonsJdbcEventLogger logSelectCount
INFO: === returned 1 row. - took 1 ms.
Nov 26, 2014 9:57:31 PM org.apache.cayenne.log.CommonsJdbcEventLogger logCommitTransaction
INFO: +++ transaction committed.
Nov 26, 2014 9:57:31 PM org.apache.cayenne.log.CommonsJdbcEventLogger logBeginTransaction
INFO: --- transaction started.
Nov 26, 2014 9:57:31 PM org.apache.cayenne.log.CommonsJdbcEventLogger logQuery
INFO: SELECT t0.COLLECTION_TO_MANY_ID, t0.ID FROM COLLECTION_TO_MANY_TARGET t0 WHERE t0.COLLECTION_TO_MANY_ID
= ? [bind: 1->COLLECTION_TO_MANY_ID:1]
Nov 26, 2014 9:57:31 PM org.apache.cayenne.log.CommonsJdbcEventLogger logSelectCount
INFO: === returned 2 rows. - took 1 ms.
Nov 26, 2014 9:57:31 PM org.apache.cayenne.log.CommonsJdbcEventLogger logCommitTransaction
INFO: +++ transaction committed.
Nov 26, 2014 9:57:31 PM org.apache.cayenne.configuration.XMLDataChannelDescriptorLoader load
INFO: Loading XML configuration resource from <https://builds.apache.org/job/cayenne-master/cayenneTestConnection=derby,jdk=jdk-1.8.0,label=Ubuntu/ws/framework/cayenne-jdk1.5-unpublished/target/test-classes/cayenne-relationships.xml>
Nov 26, 2014 9:57:31 PM org.apache.cayenne.configuration.XMLDataChannelDescriptorLoader$DataChannelChildrenHandler
createChildTagHandler
INFO: Loading XML DataMap resource from <https://builds.apache.org/job/cayenne-master/cayenneTestConnection=derby,jdk=jdk-1.8.0,label=Ubuntu/ws/framework/cayenne-jdk1.5-unpublished/target/test-classes/relationships.map.xml>
Nov 26, 2014 9:57:31 PM org.apache.cayenne.map.EntityResolver applyDBLayerDefaults
INFO: added runtime complimentary DbRelationship from DELETE_RULE_TEST3 to DELETE_RULE_TEST1
Nov 26, 2014 9:57:31 PM org.apache.cayenne.map.EntityResolver applyObjectLayerDefaults
INFO: added runtime complimentary ObjRelationship from FlattenedTest3 to FlattenedTest1
Nov 26, 2014 9:57:31 PM org.apache.cayenne.map.EntityResolver applyObjectLayerDefaults
INFO: added runtime complimentary ObjRelationship from FlattenedTest4 to FlattenedTest1
Nov 26, 2014 9:57:31 PM org.apache.cayenne.test.jdbc.UtilityLogger log
INFO: delete from COLLECTION_TO_MANY_TARGET
Nov 26, 2014 9:57:31 PM org.apache.cayenne.test.jdbc.UtilityLogger log
INFO: delete from COLLECTION_TO_MANY
Nov 26, 2014 9:57:31 PM org.apache.cayenne.test.jdbc.UtilityLogger log
INFO: INSERT INTO COLLECTION_TO_MANY (ID) VALUES (?)
Nov 26, 2014 9:57:31 PM org.apache.cayenne.test.jdbc.UtilityLogger log
INFO: INSERT INTO COLLECTION_TO_MANY (ID) VALUES (?)
Nov 26, 2014 9:57:31 PM org.apache.cayenne.test.jdbc.UtilityLogger log
INFO: INSERT INTO COLLECTION_TO_MANY_TARGET (ID, COLLECTION_TO_MANY_ID) VALUES (?, ?)
Nov 26, 2014 9:57:31 PM org.apache.cayenne.test.jdbc.UtilityLogger log
INFO: INSERT INTO COLLECTION_TO_MANY_TARGET (ID, COLLECTION_TO_MANY_ID) VALUES (?, ?)
Nov 26, 2014 9:57:31 PM org.apache.cayenne.test.jdbc.UtilityLogger log
INFO: INSERT INTO COLLECTION_TO_MANY_TARGET (ID, COLLECTION_TO_MANY_ID) VALUES (?, ?)
Nov 26, 2014 9:57:31 PM org.apache.cayenne.test.jdbc.UtilityLogger log
INFO: INSERT INTO COLLECTION_TO_MANY_TARGET (ID, COLLECTION_TO_MANY_ID) VALUES (?, ?)
Nov 26, 2014 9:57:31 PM org.apache.cayenne.log.CommonsJdbcEventLogger logBeginTransaction
INFO: --- transaction started.
Nov 26, 2014 9:57:31 PM org.apache.cayenne.log.CommonsJdbcEventLogger logQuery
INFO: SELECT t0.ID FROM COLLECTION_TO_MANY t0 WHERE t0.ID = ? [bind: 1->ID:1]
Nov 26, 2014 9:57:31 PM org.apache.cayenne.log.CommonsJdbcEventLogger logSelectCount
INFO: === returned 1 row. - took 0 ms.
Nov 26, 2014 9:57:31 PM org.apache.cayenne.log.CommonsJdbcEventLogger logCommitTransaction
INFO: +++ transaction committed.
Nov 26, 2014 9:57:31 PM org.apache.cayenne.log.CommonsJdbcEventLogger logBeginTransaction
INFO: --- transaction started.
Nov 26, 2014 9:57:31 PM org.apache.cayenne.log.CommonsJdbcEventLogger logQuery
INFO: SELECT t0.COLLECTION_TO_MANY_ID, t0.ID FROM COLLECTION_TO_MANY_TARGET t0 WHERE t0.COLLECTION_TO_MANY_ID
= ? [bind: 1->COLLECTION_TO_MANY_ID:1]
Nov 26, 2014 9:57:31 PM org.apache.cayenne.log.CommonsJdbcEventLogger logSelectCount
INFO: === returned 3 rows. - took 0 ms.
Nov 26, 2014 9:57:31 PM org.apache.cayenne.log.CommonsJdbcEventLogger logCommitTransaction
INFO: +++ transaction committed.
Nov 26, 2014 9:57:31 PM org.apache.cayenne.log.CommonsJdbcEventLogger logBeginTransaction
INFO: --- transaction started.
Nov 26, 2014 9:57:31 PM org.apache.cayenne.log.CommonsJdbcEventLogger logQuery
INFO: INSERT INTO COLLECTION_TO_MANY_TARGET (COLLECTION_TO_MANY_ID, ID) VALUES (?, ?)
Nov 26, 2014 9:57:31 PM org.apache.cayenne.log.CommonsJdbcEventLogger logQueryParameters
INFO: [bind: 1->COLLECTION_TO_MANY_ID:1, 2->ID:201]
Nov 26, 2014 9:57:31 PM org.apache.cayenne.log.CommonsJdbcEventLogger logUpdateCount
INFO: === updated 1 row.
Nov 26, 2014 9:57:31 PM org.apache.cayenne.log.CommonsJdbcEventLogger logCommitTransaction
INFO: +++ transaction committed.
Nov 26, 2014 9:57:31 PM org.apache.cayenne.log.CommonsJdbcEventLogger logBeginTransaction
INFO: --- transaction started.
Nov 26, 2014 9:57:31 PM org.apache.cayenne.log.CommonsJdbcEventLogger logQuery
INFO: SELECT t0.ID FROM COLLECTION_TO_MANY t0 WHERE t0.ID = ? [bind: 1->ID:1]
Nov 26, 2014 9:57:31 PM org.apache.cayenne.log.CommonsJdbcEventLogger logSelectCount
INFO: === returned 1 row. - took 0 ms.
Nov 26, 2014 9:57:31 PM org.apache.cayenne.log.CommonsJdbcEventLogger logCommitTransaction
INFO: +++ transaction committed.
Nov 26, 2014 9:57:31 PM org.apache.cayenne.log.CommonsJdbcEventLogger logBeginTransaction
INFO: --- transaction started.
Nov 26, 2014 9:57:31 PM org.apache.cayenne.log.CommonsJdbcEventLogger logQuery
INFO: SELECT t0.COLLECTION_TO_MANY_ID, t0.ID FROM COLLECTION_TO_MANY_TARGET t0 WHERE t0.COLLECTION_TO_MANY_ID
= ? [bind: 1->COLLECTION_TO_MANY_ID:1]
Nov 26, 2014 9:57:31 PM org.apache.cayenne.log.CommonsJdbcEventLogger logSelectCount
INFO: === returned 4 rows. - took 0 ms.
Nov 26, 2014 9:57:31 PM org.apache.cayenne.log.CommonsJdbcEventLogger logCommitTransaction
INFO: +++ transaction committed.
[INFO] ------------------------------------------------------------------------
[INFO] Reactor Summary:
[INFO] 
[INFO] Cayenne ........................................... SUCCESS [0.179s]
[INFO] Common Unit Test Utilities ........................ SUCCESS [1.339s]
[INFO] Cayenne Internal Build Plugin ..................... SUCCESS [1.285s]
[INFO] Cayenne Build Tools Parent ........................ SUCCESS [0.005s]
[INFO] Cayenne License and Notice Bundle ................. SUCCESS [0.297s]
[INFO] Cayenne Dependency Injection Container ............ SUCCESS [2.396s]
[INFO] Cayenne Java 1.5 Unpublished ...................... FAILURE [4:55.690s]
[INFO] Cayenne WebObjects Compatibility Library .......... SKIPPED
[INFO] Cayenne Aggregated Server Jar ..................... SKIPPED
[INFO] Cayenne Aggregated Client Jar ..................... SKIPPED
[INFO] Cayenne Project ................................... SKIPPED
[INFO] Cayenne Tools ..................................... SKIPPED
[INFO] Library: cayenne-lifecycle ........................ SKIPPED
[INFO] Cayenne Maven Plugin .............................. SKIPPED
[INFO] Cayenne Framework Aggregator Project .............. SKIPPED
[INFO] Cayenne Integration Tests Parent .................. SKIPPED
[INFO] Integration Tests - Cayenne Runtime ............... SKIPPED
[INFO] Integration Tests - Cayenne Tools ................. SKIPPED
[INFO] Cayenne Modeler ................................... SKIPPED
[INFO] Cayenne Modeler Maven Plugin ...................... SKIPPED
[INFO] Cayenne Modeler Generic and Windows Extensions .... SKIPPED
[INFO] Cayenne Modeler Generic ........................... SKIPPED
[INFO] Cayenne Modeler Mac OS X Extensions ............... SKIPPED
[INFO] Cayenne Modeler Mac OS X .......................... SKIPPED
[INFO] Cayenne Modeler Mac OS X - Old Apple Java ......... SKIPPED
[INFO] Cayenne Modeler Windows ........................... SKIPPED
[INFO] Cayenne Modeler Parent ............................ SKIPPED
[INFO] Cayenne Tutorial .................................. SKIPPED
[INFO] Cayenne ROP Server Tutorial ....................... SKIPPED
[INFO] Cayenne ROP Client Tutorial ....................... SKIPPED
[INFO] Cayenne Tutorials ................................. SKIPPED
[INFO] Cayenne Documentation ............................. SKIPPED
[INFO] Cayenne Documenation Parent ....................... SKIPPED
[INFO] Cayenne Docbook Documentation ..................... SKIPPED
[INFO] Docbook: Cayenne Stylesheets ...................... SKIPPED
[INFO] Docbook: Cayenne Guide ............................ SKIPPED
[INFO] Docbook: Getting Started with Cayenne ............. SKIPPED
[INFO] Docbook: Getting Started with Cayenne ROP ......... SKIPPED
[INFO] Docbook: Cayenne New Features and Upgrade Guide ... SKIPPED
[INFO] Cayenne Release Assembly .......................... SKIPPED
[INFO] ------------------------------------------------------------------------
[INFO] BUILD FAILURE
[INFO] ------------------------------------------------------------------------
[INFO] Total time: 5:01.998s
[INFO] Finished at: Wed Nov 26 21:57:34 UTC 2014
[INFO] Final Memory: 90M/1215M
[INFO] ------------------------------------------------------------------------
[ERROR] Failed to execute goal org.apache.maven.plugins:maven-surefire-plugin:2.5:test (default-test)
on project cayenne-jdk1.5-unpublished: There are test failures.
[ERROR] 
[ERROR] Please refer to <https://builds.apache.org/job/cayenne-master/cayenneTestConnection=derby,jdk=jdk-1.8.0,label=Ubuntu/ws/framework/cayenne-jdk1.5-unpublished/target/surefire-reports>
for the individual test results.
[ERROR] -> [Help 1]
org.apache.maven.lifecycle.LifecycleExecutionException: Failed to execute goal org.apache.maven.plugins:maven-surefire-plugin:2.5:test
(default-test) on project cayenne-jdk1.5-unpublished: There are test failures.

Please refer to <https://builds.apache.org/job/cayenne-master/cayenneTestConnection=derby,jdk=jdk-1.8.0,label=Ubuntu/ws/framework/cayenne-jdk1.5-unpublished/target/surefire-reports>
for the individual test results.
	at org.apache.maven.lifecycle.internal.MojoExecutor.execute(MojoExecutor.java:213)
	at org.apache.maven.lifecycle.internal.MojoExecutor.execute(MojoExecutor.java:153)
	at org.apache.maven.lifecycle.internal.MojoExecutor.execute(MojoExecutor.java:145)
	at org.apache.maven.lifecycle.internal.LifecycleModuleBuilder.buildProject(LifecycleModuleBuilder.java:84)
	at org.apache.maven.lifecycle.internal.LifecycleModuleBuilder.buildProject(LifecycleModuleBuilder.java:59)
	at org.apache.maven.lifecycle.internal.LifecycleStarter.singleThreadedBuild(LifecycleStarter.java:183)
	at org.apache.maven.lifecycle.internal.LifecycleStarter.execute(LifecycleStarter.java:161)
	at org.apache.maven.DefaultMaven.doExecute(DefaultMaven.java:320)
	at org.apache.maven.DefaultMaven.execute(DefaultMaven.java:156)
	at org.apache.maven.cli.MavenCli.execute(MavenCli.java:537)
	at org.apache.maven.cli.MavenCli.doMain(MavenCli.java:196)
	at org.apache.maven.cli.MavenCli.main(MavenCli.java:141)
	at sun.reflect.NativeMethodAccessorImpl.invoke0(Native Method)
	at sun.reflect.NativeMethodAccessorImpl.invoke(NativeMethodAccessorImpl.java:62)
	at sun.reflect.DelegatingMethodAccessorImpl.invoke(DelegatingMethodAccessorImpl.java:43)
	at java.lang.reflect.Method.invoke(Method.java:483)
	at org.codehaus.plexus.classworlds.launcher.Launcher.launchEnhanced(Launcher.java:290)
	at org.codehaus.plexus.classworlds.launcher.Launcher.launch(Launcher.java:230)
	at org.codehaus.plexus.classworlds.launcher.Launcher.mainWithExitCode(Launcher.java:409)
	at org.codehaus.plexus.classworlds.launcher.Launcher.main(Launcher.java:352)
Caused by: org.apache.maven.plugin.MojoFailureException: There are test failures.

Please refer to <https://builds.apache.org/job/cayenne-master/cayenneTestConnection=derby,jdk=jdk-1.8.0,label=Ubuntu/ws/framework/cayenne-jdk1.5-unpublished/target/surefire-reports>
for the individual test results.
	at org.apache.maven.plugin.surefire.SurefirePlugin.execute(SurefirePlugin.java:629)
	at org.apache.maven.plugin.DefaultBuildPluginManager.executeMojo(DefaultBuildPluginManager.java:101)
	at org.apache.maven.lifecycle.internal.MojoExecutor.execute(MojoExecutor.java:209)
	... 19 more
[ERROR] 
[ERROR] Re-run Maven using the -X switch to enable full debug logging.
[ERROR] 
[ERROR] For more information about the errors and possible solutions, please read the following
articles:
[ERROR] [Help 1] http://cwiki.apache.org/confluence/display/MAVEN/MojoFailureException
[ERROR] 
[ERROR] After correcting the problems, you can resume the build with the command
[ERROR]   mvn <goals> -rf :cayenne-jdk1.5-unpublished
Build step 'Invoke top-level Maven targets' marked build as failure
Recording test results

Mime
View raw message