cayenne-commits mailing list archives

Site index · List index
Message view « Date » · « Thread »
Top « Date » · « Thread »
From Apache Jenkins Server <jenk...@builds.apache.org>
Subject Build failed in Jenkins: cayenne-master » derby,JDK 1.7 (latest),Ubuntu #79
Date Mon, 10 Nov 2014 17:56:22 GMT
See <https://builds.apache.org/job/cayenne-master/cayenneTestConnection=derby,jdk=JDK%201.7%20(latest),label=Ubuntu/79/changes>

Changes:

[s.kolbachev] Refactor Locking Project

[s.kolbachev] Refactor People Project & Inheritance Projects

[s.kolbachev] Refactor Relationships Project

------------------------------------------
[...truncated 38149 lines...]
[main] INFO org.apache.cayenne.log.CommonsJdbcEventLogger - === returned 1 row. - took 3 ms.
[main] INFO org.apache.cayenne.log.CommonsJdbcEventLogger - +++ transaction committed.
[main] INFO org.apache.cayenne.log.CommonsJdbcEventLogger - --- transaction started.
[main] INFO org.apache.cayenne.log.CommonsJdbcEventLogger - UPDATE oneway_table4 SET TABLE3_ID
= ? WHERE ID = ?
[main] INFO org.apache.cayenne.log.CommonsJdbcEventLogger - [batch bind: 1->TABLE3_ID:1,
2->ID:2]
[main] INFO org.apache.cayenne.log.CommonsJdbcEventLogger - === updated 1 row.
[main] INFO org.apache.cayenne.log.CommonsJdbcEventLogger - +++ transaction committed.
[main] INFO org.apache.cayenne.log.CommonsJdbcEventLogger - --- transaction started.
[main] INFO org.apache.cayenne.log.CommonsJdbcEventLogger - SELECT TABLE3_ID FROM oneway_table4
[main] INFO org.apache.cayenne.log.CommonsJdbcEventLogger - === returned 2 rows. - took 2
ms.
[main] INFO org.apache.cayenne.log.CommonsJdbcEventLogger - +++ transaction committed.
[main] INFO org.apache.cayenne.configuration.XMLDataChannelDescriptorLoader - Loading XML
configuration resource from <https://builds.apache.org/job/cayenne-master/cayenneTestConnection=derby,jdk=JDK%201.7%20(latest),label=Ubuntu/ws/cayenne-server/target/test-classes/cayenne-oneway-rels.xml>
[main] INFO org.apache.cayenne.configuration.XMLDataChannelDescriptorLoader - Loading XML
DataMap resource from <https://builds.apache.org/job/cayenne-master/cayenneTestConnection=derby,jdk=JDK%201.7%20(latest),label=Ubuntu/ws/cayenne-server/target/test-classes/oneway-rels.map.xml>
[main] INFO org.apache.cayenne.map.EntityResolver - added runtime complimentary DbRelationship
from oneway_table1 to oneway_table2
[main] INFO org.apache.cayenne.map.EntityResolver - added runtime complimentary DbRelationship
from oneway_table4 to oneway_table3
[main] INFO org.apache.cayenne.test.jdbc.UtilityLogger - delete from oneway_table2
[main] INFO org.apache.cayenne.test.jdbc.UtilityLogger - delete from oneway_table1
[main] INFO org.apache.cayenne.test.jdbc.UtilityLogger - delete from oneway_table4
[main] INFO org.apache.cayenne.test.jdbc.UtilityLogger - delete from oneway_table3
[main] INFO org.apache.cayenne.test.jdbc.UtilityLogger - INSERT INTO oneway_table3 (ID) VALUES
(?)
[main] INFO org.apache.cayenne.test.jdbc.UtilityLogger - INSERT INTO oneway_table4 (ID, TABLE3_ID)
VALUES (?, ?)
[main] INFO org.apache.cayenne.test.jdbc.UtilityLogger - INSERT INTO oneway_table4 (ID, TABLE3_ID)
VALUES (?, ?)
[main] INFO org.apache.cayenne.log.CommonsJdbcEventLogger - --- transaction started.
[main] INFO org.apache.cayenne.log.CommonsJdbcEventLogger - SELECT t0.ID FROM oneway_table3
t0 WHERE t0.ID = ? [bind: 1->ID:1]
[main] INFO org.apache.cayenne.log.CommonsJdbcEventLogger - === returned 1 row. - took 0 ms.
[main] INFO org.apache.cayenne.log.CommonsJdbcEventLogger - +++ transaction committed.
[main] INFO org.apache.cayenne.log.CommonsJdbcEventLogger - --- transaction started.
[main] INFO org.apache.cayenne.log.CommonsJdbcEventLogger - SELECT t0.ID FROM oneway_table4
t0 WHERE t0.TABLE3_ID = ? [bind: 1->TABLE3_ID:1]
[main] INFO org.apache.cayenne.log.CommonsJdbcEventLogger - === returned 2 rows. - took 0
ms.
[main] INFO org.apache.cayenne.log.CommonsJdbcEventLogger - +++ transaction committed.
[main] INFO org.apache.cayenne.log.CommonsJdbcEventLogger - --- transaction started.
[main] INFO org.apache.cayenne.log.CommonsJdbcEventLogger - UPDATE oneway_table4 SET TABLE3_ID
= ? WHERE ID = ?
[main] INFO org.apache.cayenne.log.CommonsJdbcEventLogger - [batch bind: 1->TABLE3_ID:NULL,
2->ID:2]
[main] INFO org.apache.cayenne.log.CommonsJdbcEventLogger - === updated 1 row.
[main] INFO org.apache.cayenne.log.CommonsJdbcEventLogger - +++ transaction committed.
[main] INFO org.apache.cayenne.log.CommonsJdbcEventLogger - --- transaction started.
[main] INFO org.apache.cayenne.log.CommonsJdbcEventLogger - SELECT TABLE3_ID FROM oneway_table4
[main] INFO org.apache.cayenne.log.CommonsJdbcEventLogger - === returned 2 rows. - took 0
ms.
[main] INFO org.apache.cayenne.log.CommonsJdbcEventLogger - +++ transaction committed.
[main] INFO org.apache.cayenne.configuration.XMLDataChannelDescriptorLoader - Loading XML
configuration resource from <https://builds.apache.org/job/cayenne-master/cayenneTestConnection=derby,jdk=JDK%201.7%20(latest),label=Ubuntu/ws/cayenne-server/target/test-classes/cayenne-oneway-rels.xml>
[main] INFO org.apache.cayenne.configuration.XMLDataChannelDescriptorLoader - Loading XML
DataMap resource from <https://builds.apache.org/job/cayenne-master/cayenneTestConnection=derby,jdk=JDK%201.7%20(latest),label=Ubuntu/ws/cayenne-server/target/test-classes/oneway-rels.map.xml>
[main] INFO org.apache.cayenne.map.EntityResolver - added runtime complimentary DbRelationship
from oneway_table1 to oneway_table2
[main] INFO org.apache.cayenne.map.EntityResolver - added runtime complimentary DbRelationship
from oneway_table4 to oneway_table3
[main] INFO org.apache.cayenne.test.jdbc.UtilityLogger - delete from oneway_table2
[main] INFO org.apache.cayenne.test.jdbc.UtilityLogger - delete from oneway_table1
[main] INFO org.apache.cayenne.test.jdbc.UtilityLogger - delete from oneway_table4
[main] INFO org.apache.cayenne.test.jdbc.UtilityLogger - delete from oneway_table3
[main] INFO org.apache.cayenne.test.jdbc.UtilityLogger - INSERT INTO oneway_table3 (ID) VALUES
(?)
[main] INFO org.apache.cayenne.test.jdbc.UtilityLogger - INSERT INTO oneway_table4 (ID, TABLE3_ID)
VALUES (?, ?)
[main] INFO org.apache.cayenne.log.CommonsJdbcEventLogger - --- transaction started.
[main] INFO org.apache.cayenne.log.CommonsJdbcEventLogger - SELECT t0.ID FROM oneway_table3
t0 WHERE t0.ID = ? [bind: 1->ID:1]
[main] INFO org.apache.cayenne.log.CommonsJdbcEventLogger - === returned 1 row. - took 0 ms.
[main] INFO org.apache.cayenne.log.CommonsJdbcEventLogger - +++ transaction committed.
[main] INFO org.apache.cayenne.log.CommonsJdbcEventLogger - --- transaction started.
[main] INFO org.apache.cayenne.log.CommonsJdbcEventLogger - SELECT t0.ID FROM oneway_table4
t0 WHERE t0.TABLE3_ID = ? [bind: 1->TABLE3_ID:1]
[main] INFO org.apache.cayenne.log.CommonsJdbcEventLogger - === returned 1 row. - took 1 ms.
[main] INFO org.apache.cayenne.log.CommonsJdbcEventLogger - +++ transaction committed.
[main] INFO org.apache.cayenne.log.CommonsJdbcEventLogger - SELECT NEXT_ID FROM AUTO_PK_SUPPORT
WHERE TABLE_NAME = ? FOR UPDATE [bind: 1:'oneway_table4']
[main] INFO org.apache.cayenne.log.CommonsJdbcEventLogger - --- transaction started.
[main] INFO org.apache.cayenne.log.CommonsJdbcEventLogger - INSERT INTO oneway_table4 (ID,
TABLE3_ID) VALUES (?, ?)
[main] INFO org.apache.cayenne.log.CommonsJdbcEventLogger - [batch bind: 1->ID:200, 2->TABLE3_ID:1]
[main] INFO org.apache.cayenne.log.CommonsJdbcEventLogger - === updated 1 row.
[main] INFO org.apache.cayenne.log.CommonsJdbcEventLogger - +++ transaction committed.
[main] INFO org.apache.cayenne.log.CommonsJdbcEventLogger - --- transaction started.
[main] INFO org.apache.cayenne.log.CommonsJdbcEventLogger - SELECT TABLE3_ID FROM oneway_table4
[main] INFO org.apache.cayenne.log.CommonsJdbcEventLogger - === returned 2 rows. - took 0
ms.
[main] INFO org.apache.cayenne.log.CommonsJdbcEventLogger - +++ transaction committed.
[main] INFO org.apache.cayenne.configuration.XMLDataChannelDescriptorLoader - Loading XML
configuration resource from <https://builds.apache.org/job/cayenne-master/cayenneTestConnection=derby,jdk=JDK%201.7%20(latest),label=Ubuntu/ws/cayenne-server/target/test-classes/cayenne-oneway-rels.xml>
[main] INFO org.apache.cayenne.configuration.XMLDataChannelDescriptorLoader - Loading XML
DataMap resource from <https://builds.apache.org/job/cayenne-master/cayenneTestConnection=derby,jdk=JDK%201.7%20(latest),label=Ubuntu/ws/cayenne-server/target/test-classes/oneway-rels.map.xml>
[main] INFO org.apache.cayenne.map.EntityResolver - added runtime complimentary DbRelationship
from oneway_table1 to oneway_table2
[main] INFO org.apache.cayenne.map.EntityResolver - added runtime complimentary DbRelationship
from oneway_table4 to oneway_table3
[main] INFO org.apache.cayenne.test.jdbc.UtilityLogger - delete from oneway_table2
[main] INFO org.apache.cayenne.test.jdbc.UtilityLogger - delete from oneway_table1
[main] INFO org.apache.cayenne.test.jdbc.UtilityLogger - delete from oneway_table4
[main] INFO org.apache.cayenne.test.jdbc.UtilityLogger - delete from oneway_table3
[main] INFO org.apache.cayenne.log.CommonsJdbcEventLogger - SELECT NEXT_ID FROM AUTO_PK_SUPPORT
WHERE TABLE_NAME = ? FOR UPDATE [bind: 1:'oneway_table3']
[main] INFO org.apache.cayenne.log.CommonsJdbcEventLogger - --- transaction started.
[main] INFO org.apache.cayenne.log.CommonsJdbcEventLogger - INSERT INTO oneway_table3 (ID)
VALUES (?)
[main] INFO org.apache.cayenne.log.CommonsJdbcEventLogger - [batch bind: 1->ID:200]
[main] INFO org.apache.cayenne.log.CommonsJdbcEventLogger - === updated 1 row.
[main] INFO org.apache.cayenne.log.CommonsJdbcEventLogger - INSERT INTO oneway_table4 (ID,
TABLE3_ID) VALUES (?, ?)
[main] INFO org.apache.cayenne.log.CommonsJdbcEventLogger - [batch bind: 1->ID:201, 2->TABLE3_ID:200]
[main] INFO org.apache.cayenne.log.CommonsJdbcEventLogger - === updated 1 row.
[main] INFO org.apache.cayenne.log.CommonsJdbcEventLogger - +++ transaction committed.
[main] INFO org.apache.cayenne.test.jdbc.UtilityLogger - select ID from oneway_table3
[main] INFO org.apache.cayenne.test.jdbc.UtilityLogger - select TABLE3_ID from oneway_table4
[main] INFO org.apache.cayenne.configuration.XMLDataChannelDescriptorLoader - Loading XML
configuration resource from <https://builds.apache.org/job/cayenne-master/cayenneTestConnection=derby,jdk=JDK%201.7%20(latest),label=Ubuntu/ws/cayenne-server/target/test-classes/cayenne-oneway-rels.xml>
[main] INFO org.apache.cayenne.configuration.XMLDataChannelDescriptorLoader - Loading XML
DataMap resource from <https://builds.apache.org/job/cayenne-master/cayenneTestConnection=derby,jdk=JDK%201.7%20(latest),label=Ubuntu/ws/cayenne-server/target/test-classes/oneway-rels.map.xml>
[main] INFO org.apache.cayenne.map.EntityResolver - added runtime complimentary DbRelationship
from oneway_table1 to oneway_table2
[main] INFO org.apache.cayenne.map.EntityResolver - added runtime complimentary DbRelationship
from oneway_table4 to oneway_table3
[main] INFO org.apache.cayenne.test.jdbc.UtilityLogger - delete from oneway_table2
[main] INFO org.apache.cayenne.test.jdbc.UtilityLogger - delete from oneway_table1
[main] INFO org.apache.cayenne.test.jdbc.UtilityLogger - delete from oneway_table4
[main] INFO org.apache.cayenne.test.jdbc.UtilityLogger - delete from oneway_table3
[main] INFO org.apache.cayenne.test.jdbc.UtilityLogger - INSERT INTO oneway_table1 (ID) VALUES
(?)
[main] INFO org.apache.cayenne.test.jdbc.UtilityLogger - INSERT INTO oneway_table2 (ID, TABLE1_ID)
VALUES (?, ?)
[main] INFO org.apache.cayenne.log.CommonsJdbcEventLogger - --- transaction started.
[main] INFO org.apache.cayenne.log.CommonsJdbcEventLogger - SELECT t0.ID FROM oneway_table1
t0 WHERE t0.ID = ? [bind: 1->ID:1]
[main] INFO org.apache.cayenne.log.CommonsJdbcEventLogger - === returned 1 row. - took 3 ms.
[main] INFO org.apache.cayenne.log.CommonsJdbcEventLogger - +++ transaction committed.
[main] INFO org.apache.cayenne.log.CommonsJdbcEventLogger - --- transaction started.
[main] INFO org.apache.cayenne.log.CommonsJdbcEventLogger - SELECT t0.ID, t0.TABLE1_ID FROM
oneway_table2 t0 WHERE t0.ID = ? [bind: 1->ID:1]
[main] INFO org.apache.cayenne.log.CommonsJdbcEventLogger - === returned 1 row. - took 3 ms.
[main] INFO org.apache.cayenne.log.CommonsJdbcEventLogger - +++ transaction committed.
[main] INFO org.apache.cayenne.log.CommonsJdbcEventLogger - --- transaction started.
[main] INFO org.apache.cayenne.log.CommonsJdbcEventLogger - UPDATE oneway_table2 SET TABLE1_ID
= ? WHERE ID = ?
[main] INFO org.apache.cayenne.log.CommonsJdbcEventLogger - [batch bind: 1->TABLE1_ID:NULL,
2->ID:1]
[main] INFO org.apache.cayenne.log.CommonsJdbcEventLogger - === updated 1 row.
[main] INFO org.apache.cayenne.log.CommonsJdbcEventLogger - +++ transaction committed.
[main] INFO org.apache.cayenne.test.jdbc.UtilityLogger - select TABLE1_ID from oneway_table2
[main] INFO org.apache.cayenne.configuration.XMLDataChannelDescriptorLoader - Loading XML
configuration resource from <https://builds.apache.org/job/cayenne-master/cayenneTestConnection=derby,jdk=JDK%201.7%20(latest),label=Ubuntu/ws/cayenne-server/target/test-classes/cayenne-oneway-rels.xml>
[main] INFO org.apache.cayenne.configuration.XMLDataChannelDescriptorLoader - Loading XML
DataMap resource from <https://builds.apache.org/job/cayenne-master/cayenneTestConnection=derby,jdk=JDK%201.7%20(latest),label=Ubuntu/ws/cayenne-server/target/test-classes/oneway-rels.map.xml>
[main] INFO org.apache.cayenne.map.EntityResolver - added runtime complimentary DbRelationship
from oneway_table1 to oneway_table2
[main] INFO org.apache.cayenne.map.EntityResolver - added runtime complimentary DbRelationship
from oneway_table4 to oneway_table3
[main] INFO org.apache.cayenne.test.jdbc.UtilityLogger - delete from oneway_table2
[main] INFO org.apache.cayenne.test.jdbc.UtilityLogger - delete from oneway_table1
[main] INFO org.apache.cayenne.test.jdbc.UtilityLogger - delete from oneway_table4
[main] INFO org.apache.cayenne.test.jdbc.UtilityLogger - delete from oneway_table3
[main] INFO org.apache.cayenne.test.jdbc.UtilityLogger - INSERT INTO oneway_table1 (ID) VALUES
(?)
[main] INFO org.apache.cayenne.test.jdbc.UtilityLogger - INSERT INTO oneway_table1 (ID) VALUES
(?)
[main] INFO org.apache.cayenne.test.jdbc.UtilityLogger - INSERT INTO oneway_table2 (ID, TABLE1_ID)
VALUES (?, ?)
[main] INFO org.apache.cayenne.log.CommonsJdbcEventLogger - --- transaction started.
[main] INFO org.apache.cayenne.log.CommonsJdbcEventLogger - SELECT t0.ID FROM oneway_table1
t0 WHERE t0.ID = ? [bind: 1->ID:1]
[main] INFO org.apache.cayenne.log.CommonsJdbcEventLogger - === returned 1 row. - took 0 ms.
[main] INFO org.apache.cayenne.log.CommonsJdbcEventLogger - +++ transaction committed.
[main] INFO org.apache.cayenne.log.CommonsJdbcEventLogger - --- transaction started.
[main] INFO org.apache.cayenne.log.CommonsJdbcEventLogger - SELECT t0.ID FROM oneway_table1
t0 WHERE t0.ID = ? [bind: 1->ID:2]
[main] INFO org.apache.cayenne.log.CommonsJdbcEventLogger - === returned 1 row. - took 0 ms.
[main] INFO org.apache.cayenne.log.CommonsJdbcEventLogger - +++ transaction committed.
[main] INFO org.apache.cayenne.log.CommonsJdbcEventLogger - --- transaction started.
[main] INFO org.apache.cayenne.log.CommonsJdbcEventLogger - SELECT t0.ID, t0.TABLE1_ID FROM
oneway_table2 t0 WHERE t0.ID = ? [bind: 1->ID:1]
[main] INFO org.apache.cayenne.log.CommonsJdbcEventLogger - === returned 1 row. - took 0 ms.
[main] INFO org.apache.cayenne.log.CommonsJdbcEventLogger - +++ transaction committed.
[main] INFO org.apache.cayenne.log.CommonsJdbcEventLogger - --- transaction started.
[main] INFO org.apache.cayenne.log.CommonsJdbcEventLogger - UPDATE oneway_table2 SET TABLE1_ID
= ? WHERE ID = ?
[main] INFO org.apache.cayenne.log.CommonsJdbcEventLogger - [batch bind: 1->TABLE1_ID:2,
2->ID:1]
[main] INFO org.apache.cayenne.log.CommonsJdbcEventLogger - === updated 1 row.
[main] INFO org.apache.cayenne.log.CommonsJdbcEventLogger - +++ transaction committed.
[main] INFO org.apache.cayenne.test.jdbc.UtilityLogger - select TABLE1_ID from oneway_table2
Tests run: 7, Failures: 0, Errors: 0, Skipped: 0, Time elapsed: 0.286 sec - in org.apache.cayenne.OneWayRelationshipsIT

Results :

Tests in error: 
  PregeneratedPKIT>DICase.setUp:37->setUpAfterInjection:57 » SQLIntegrityConstraintViolation
  Expression_InContextIT>DICase.setUp:37->setUpAfterInjection:62 » SQLIntegrityConstraintViolation
  Expression_InContextIT>DICase.setUp:37->setUpAfterInjection:62 » SQLIntegrityConstraintViolation

Tests run: 1429, Failures: 0, Errors: 3, Skipped: 0

[WARNING] File encoding has not been set, using platform encoding ISO-8859-1, i.e. build is
platform dependent!
[INFO] 
[INFO] --- maven-failsafe-plugin:2.17:verify (integration-test) @ cayenne-server ---
[INFO] Failsafe report directory: <https://builds.apache.org/job/cayenne-master/cayenneTestConnection=derby,jdk=JDK%201.7%20(latest),label=Ubuntu/ws/cayenne-server/target/failsafe-reports>
[WARNING] File encoding has not been set, using platform encoding ISO-8859-1, i.e. build is
platform dependent!
[INFO] ------------------------------------------------------------------------
[INFO] Reactor Summary:
[INFO] 
[INFO] Cayenne ........................................... SUCCESS [0.390s]
[INFO] Cayenne Build Tools Parent ........................ SUCCESS [0.014s]
[INFO] Cayenne License and Notice Bundle ................. SUCCESS [1.340s]
[INFO] Common Unit Test Utilities ........................ SUCCESS [0.901s]
[INFO] Cayenne Code Checkers ............................. SUCCESS [0.070s]
[INFO] Cayenne Dependency Injection Container ............ SUCCESS [10.531s]
[INFO] Cayenne Server .................................... FAILURE [2:33.736s]
[INFO] Cayenne ROP Client ................................ SKIPPED
[INFO] Cayenne Project ................................... SKIPPED
[INFO] Cayenne Tools ..................................... SKIPPED
[INFO] Cayenne Lifecycle Utilities ....................... SKIPPED
[INFO] Cayenne Maven Plugins ............................. SKIPPED
[INFO] Cayenne Maven Plugin .............................. SKIPPED
[INFO] Cayenne Cryptography Extensions ................... SKIPPED
[INFO] Cayenne Integration Tests Parent .................. SKIPPED
[INFO] Integration Tests - Cayenne Tools ................. SKIPPED
[INFO] Cayenne Modeler Parent ............................ SKIPPED
[INFO] Cayenne WebObjects Compatibility Library .......... SKIPPED
[INFO] Cayenne Modeler ................................... SKIPPED
[INFO] Cayenne Modeler Generic and Windows Extensions .... SKIPPED
[INFO] Cayenne Modeler Generic ........................... SKIPPED
[INFO] Cayenne Modeler Mac OS X Extensions ............... SKIPPED
[INFO] Cayenne Modeler Mac OS X .......................... SKIPPED
[INFO] Cayenne Modeler Mac OS X - Old Apple Java ......... SKIPPED
[INFO] Cayenne Modeler Windows ........................... SKIPPED
[INFO] Cayenne Modeler Maven Plugin ...................... SKIPPED
[INFO] Cayenne Tutorial .................................. SKIPPED
[INFO] Cayenne ROP Server Tutorial ....................... SKIPPED
[INFO] Cayenne ROP Client Tutorial ....................... SKIPPED
[INFO] Cayenne Tutorials ................................. SKIPPED
[INFO] Cayenne Documenation Parent ....................... SKIPPED
[INFO] Cayenne Documentation ............................. SKIPPED
[INFO] Cayenne Docbook Documentation ..................... SKIPPED
[INFO] Docbook: Cayenne Stylesheets ...................... SKIPPED
[INFO] Docbook: Cayenne Guide ............................ SKIPPED
[INFO] Docbook: Getting Started with Cayenne ............. SKIPPED
[INFO] Docbook: Getting Started with Cayenne ROP ......... SKIPPED
[INFO] Docbook: Cayenne New Features and Upgrade Guide ... SKIPPED
[INFO] Cayenne Release Assembly .......................... SKIPPED
[INFO] ------------------------------------------------------------------------
[INFO] BUILD FAILURE
[INFO] ------------------------------------------------------------------------
[INFO] Total time: 2:48.285s
[INFO] Finished at: Mon Nov 10 17:55:33 UTC 2014
[INFO] Final Memory: 52M/454M
[INFO] ------------------------------------------------------------------------
[ERROR] Failed to execute goal org.apache.maven.plugins:maven-failsafe-plugin:2.17:verify
(integration-test) on project cayenne-server: There are test failures.
[ERROR] 
[ERROR] Please refer to <https://builds.apache.org/job/cayenne-master/cayenneTestConnection=derby,jdk=JDK%201.7%20(latest),label=Ubuntu/ws/cayenne-server/target/failsafe-reports>
for the individual test results.
[ERROR] -> [Help 1]
org.apache.maven.lifecycle.LifecycleExecutionException: Failed to execute goal org.apache.maven.plugins:maven-failsafe-plugin:2.17:verify
(integration-test) on project cayenne-server: There are test failures.

Please refer to <https://builds.apache.org/job/cayenne-master/cayenneTestConnection=derby,jdk=JDK%201.7%20(latest),label=Ubuntu/ws/cayenne-server/target/failsafe-reports>
for the individual test results.
	at org.apache.maven.lifecycle.internal.MojoExecutor.execute(MojoExecutor.java:213)
	at org.apache.maven.lifecycle.internal.MojoExecutor.execute(MojoExecutor.java:153)
	at org.apache.maven.lifecycle.internal.MojoExecutor.execute(MojoExecutor.java:145)
	at org.apache.maven.lifecycle.internal.LifecycleModuleBuilder.buildProject(LifecycleModuleBuilder.java:84)
	at org.apache.maven.lifecycle.internal.LifecycleModuleBuilder.buildProject(LifecycleModuleBuilder.java:59)
	at org.apache.maven.lifecycle.internal.LifecycleStarter.singleThreadedBuild(LifecycleStarter.java:183)
	at org.apache.maven.lifecycle.internal.LifecycleStarter.execute(LifecycleStarter.java:161)
	at org.apache.maven.DefaultMaven.doExecute(DefaultMaven.java:320)
	at org.apache.maven.DefaultMaven.execute(DefaultMaven.java:156)
	at org.apache.maven.cli.MavenCli.execute(MavenCli.java:537)
	at org.apache.maven.cli.MavenCli.doMain(MavenCli.java:196)
	at org.apache.maven.cli.MavenCli.main(MavenCli.java:141)
	at sun.reflect.NativeMethodAccessorImpl.invoke0(Native Method)
	at sun.reflect.NativeMethodAccessorImpl.invoke(NativeMethodAccessorImpl.java:57)
	at sun.reflect.DelegatingMethodAccessorImpl.invoke(DelegatingMethodAccessorImpl.java:43)
	at java.lang.reflect.Method.invoke(Method.java:606)
	at org.codehaus.plexus.classworlds.launcher.Launcher.launchEnhanced(Launcher.java:290)
	at org.codehaus.plexus.classworlds.launcher.Launcher.launch(Launcher.java:230)
	at org.codehaus.plexus.classworlds.launcher.Launcher.mainWithExitCode(Launcher.java:409)
	at org.codehaus.plexus.classworlds.launcher.Launcher.main(Launcher.java:352)
Caused by: org.apache.maven.plugin.MojoFailureException: There are test failures.

Please refer to <https://builds.apache.org/job/cayenne-master/cayenneTestConnection=derby,jdk=JDK%201.7%20(latest),label=Ubuntu/ws/cayenne-server/target/failsafe-reports>
for the individual test results.
	at org.apache.maven.plugin.surefire.SurefireHelper.reportExecution(SurefireHelper.java:82)
	at org.apache.maven.plugin.failsafe.VerifyMojo.execute(VerifyMojo.java:194)
	at org.apache.maven.plugin.DefaultBuildPluginManager.executeMojo(DefaultBuildPluginManager.java:101)
	at org.apache.maven.lifecycle.internal.MojoExecutor.execute(MojoExecutor.java:209)
	... 19 more
[ERROR] 
[ERROR] Re-run Maven using the -X switch to enable full debug logging.
[ERROR] 
[ERROR] For more information about the errors and possible solutions, please read the following
articles:
[ERROR] [Help 1] http://cwiki.apache.org/confluence/display/MAVEN/MojoFailureException
[ERROR] 
[ERROR] After correcting the problems, you can resume the build with the command
[ERROR]   mvn <goals> -rf :cayenne-server
Build step 'Invoke top-level Maven targets' marked build as failure
Recording test results

Mime
View raw message