cayenne-commits mailing list archives

Site index · List index
Message view « Date » · « Thread »
Top « Date » · « Thread »
From Apache Jenkins Server <jenk...@builds.apache.org>
Subject Build failed in Jenkins: cayenne-master » hsql,JDK 1.7 (latest),Ubuntu #99
Date Tue, 25 Nov 2014 09:05:40 GMT
See <https://builds.apache.org/job/cayenne-master/cayenneTestConnection=hsql,jdk=JDK%201.7%20(latest),label=Ubuntu/99/changes>

Changes:

[aadamchik] attempt to fix Jenkins failure

------------------------------------------
[...truncated 68759 lines...]
[INFO] ------------------------------------------------------------------------
[INFO] Building Cayenne Tutorials 4.0.M2-SNAPSHOT
[INFO] ------------------------------------------------------------------------
[INFO] 
[INFO] --- maven-clean-plugin:2.4.1:clean (default-clean) @ cayenne-tutorials-parent ---
[INFO] 
[INFO] >>> maven-source-plugin:2.1.2:jar (bundle-source-jar) @ cayenne-tutorials-parent
>>>
[INFO] 
[INFO] <<< maven-source-plugin:2.1.2:jar (bundle-source-jar) @ cayenne-tutorials-parent
<<<
[INFO] 
[INFO] --- maven-source-plugin:2.1.2:jar (bundle-source-jar) @ cayenne-tutorials-parent ---
[INFO] 
[INFO] --- maven-install-plugin:2.3.1:install (default-install) @ cayenne-tutorials-parent
---
[INFO] Installing <https://builds.apache.org/job/cayenne-master/cayenneTestConnection=hsql,jdk=JDK%201.7%20(latest),label=Ubuntu/ws/tutorials/pom.xml>
to /home/jenkins/.m2/repository/org/apache/cayenne/parents/cayenne-tutorials-parent/4.0.M2-SNAPSHOT/cayenne-tutorials-parent-4.0.M2-SNAPSHOT.pom
[INFO]                                                                         
[INFO] ------------------------------------------------------------------------
[INFO] Building Cayenne Documenation Parent 4.0.M2-SNAPSHOT
[INFO] ------------------------------------------------------------------------
[INFO] 
[INFO] --- maven-clean-plugin:2.4.1:clean (default-clean) @ cayenne-docs-parent ---
[INFO] 
[INFO] >>> maven-source-plugin:2.1.2:jar (bundle-source-jar) @ cayenne-docs-parent
>>>
[INFO] 
[INFO] <<< maven-source-plugin:2.1.2:jar (bundle-source-jar) @ cayenne-docs-parent
<<<
[INFO] 
[INFO] --- maven-source-plugin:2.1.2:jar (bundle-source-jar) @ cayenne-docs-parent ---
[INFO] 
[INFO] --- maven-install-plugin:2.3.1:install (default-install) @ cayenne-docs-parent ---
[INFO] Installing <https://builds.apache.org/job/cayenne-master/cayenneTestConnection=hsql,jdk=JDK%201.7%20(latest),label=Ubuntu/ws/docs/pom.xml>
to /home/jenkins/.m2/repository/org/apache/cayenne/docs/cayenne-docs-parent/4.0.M2-SNAPSHOT/cayenne-docs-parent-4.0.M2-SNAPSHOT.pom
[INFO]                                                                         
[INFO] ------------------------------------------------------------------------
[INFO] Building Cayenne Documentation 4.0.M2-SNAPSHOT
[INFO] ------------------------------------------------------------------------
[INFO] 
[INFO] --- maven-clean-plugin:2.4.1:clean (default-clean) @ cayenne-doc ---
[INFO] 
[INFO] --- dependency-maven-plugin:1.0:unpack (unpack-sources) @ cayenne-doc ---
[INFO] Configured Artifact: org.apache.cayenne:cayenne-di:sources:4.0.M2-SNAPSHOT:jar
[INFO] Configured Artifact: org.apache.cayenne:cayenne-server:sources:4.0.M2-SNAPSHOT:jar
[INFO] Configured Artifact: org.apache.cayenne:cayenne-client:sources:4.0.M2-SNAPSHOT:jar
[INFO] Expanding: <https://builds.apache.org/job/cayenne-master/cayenneTestConnection=hsql,jdk=JDK%201.7%20(latest),label=Ubuntu/ws/cayenne-di/target/cayenne-di-4.0.M2-SNAPSHOT-sources.jar>
into <https://builds.apache.org/job/cayenne-master/cayenneTestConnection=hsql,jdk=JDK%201.7%20(latest),label=Ubuntu/ws/docs/doc/target/sources>
[INFO] Expanding: <https://builds.apache.org/job/cayenne-master/cayenneTestConnection=hsql,jdk=JDK%201.7%20(latest),label=Ubuntu/ws/cayenne-server/target/cayenne-server-4.0.M2-SNAPSHOT-sources.jar>
into <https://builds.apache.org/job/cayenne-master/cayenneTestConnection=hsql,jdk=JDK%201.7%20(latest),label=Ubuntu/ws/docs/doc/target/sources>
[INFO] Expanding: <https://builds.apache.org/job/cayenne-master/cayenneTestConnection=hsql,jdk=JDK%201.7%20(latest),label=Ubuntu/ws/cayenne-client/target/cayenne-client-4.0.M2-SNAPSHOT-sources.jar>
into <https://builds.apache.org/job/cayenne-master/cayenneTestConnection=hsql,jdk=JDK%201.7%20(latest),label=Ubuntu/ws/docs/doc/target/sources>
[INFO] 
[INFO] >>> maven-javadoc-plugin:2.9.1:javadoc (javadoc) @ cayenne-doc >>>
[INFO] 
[INFO] --- dependency-maven-plugin:1.0:unpack (unpack-sources) @ cayenne-doc ---
[INFO] Configured Artifact: org.apache.cayenne:cayenne-di:sources:4.0.M2-SNAPSHOT:jar
[INFO] Configured Artifact: org.apache.cayenne:cayenne-server:sources:4.0.M2-SNAPSHOT:jar
[INFO] Configured Artifact: org.apache.cayenne:cayenne-client:sources:4.0.M2-SNAPSHOT:jar
[INFO] cayenne-di-4.0.M2-SNAPSHOT-sources.jar already unpacked.
[INFO] cayenne-server-4.0.M2-SNAPSHOT-sources.jar already unpacked.
[INFO] cayenne-client-4.0.M2-SNAPSHOT-sources.jar already unpacked.
[INFO] 
[INFO] <<< maven-javadoc-plugin:2.9.1:javadoc (javadoc) @ cayenne-doc <<<
[INFO] 
[INFO] --- maven-javadoc-plugin:2.9.1:javadoc (javadoc) @ cayenne-doc ---
[WARNING] Source files encoding has not been set, using platform encoding ISO-8859-1, i.e.
build is platform dependent!
[INFO] The goal 'org.apache.maven.plugins:maven-javadoc-plugin:2.9.1:javadoc' has not been
previously called for the module: 'org.apache.cayenne:cayenne-server:jar:4.0.M2-SNAPSHOT'.
Trying to invoke it...
[ERROR] MavenInvocationException: Error when invoking Maven, consult the invoker log file:
<https://builds.apache.org/job/cayenne-master/cayenneTestConnection=hsql,jdk=JDK%201.7%20(latest),label=Ubuntu/ws/docs/doc/target/invoker/maven-javadoc-plugin94812911.txt>
[WARNING] Creating fake javadoc directory to prevent repeated invocations: <https://builds.apache.org/job/cayenne-master/cayenneTestConnection=hsql,jdk=JDK%201.7%20(latest),label=Ubuntu/ws/cayenne-server/target/site/apidocs/doc/api>
[INFO] The goal 'org.apache.maven.plugins:maven-javadoc-plugin:2.9.1:javadoc' has not been
previously called for the module: 'org.apache.cayenne.modeler:cayenne-modeler:jar:4.0.M2-SNAPSHOT'.
Trying to invoke it...
[ERROR] MavenInvocationException: Error when invoking Maven, consult the invoker log file:
<https://builds.apache.org/job/cayenne-master/cayenneTestConnection=hsql,jdk=JDK%201.7%20(latest),label=Ubuntu/ws/docs/doc/target/invoker/maven-javadoc-plugin290676869.txt>
[WARNING] Creating fake javadoc directory to prevent repeated invocations: <https://builds.apache.org/job/cayenne-master/cayenneTestConnection=hsql,jdk=JDK%201.7%20(latest),label=Ubuntu/ws/modeler/cayenne-modeler/target/site/apidocs/doc/api>
[ERROR] Error fetching link: <https://builds.apache.org/job/cayenne-master/cayenneTestConnection=hsql,jdk=JDK%201.7%20(latest),label=Ubuntu/ws/cayenne-server/target/site/apidocs/doc/api/package-list.>
Ignored it.
[ERROR] Error fetching link: <https://builds.apache.org/job/cayenne-master/cayenneTestConnection=hsql,jdk=JDK%201.7%20(latest),label=Ubuntu/ws/modeler/cayenne-modeler/target/site/apidocs/doc/api/package-list.>
Ignored it.
[INFO] 
usage: javadoc [options] [packagenames] [sourcefiles] [@files]
-overview <file>          Read overview documentation from HTML file
-public                   Show only public classes and members
-protected                Show protected/public classes and members (default)
-package                  Show package/protected/public classes and members
-private                  Show all classes and members
-help                     Display command line options and exit
-doclet <class>           Generate output via alternate doclet
-docletpath <path>        Specify where to find doclet class files
-sourcepath <pathlist>    Specify where to find source files
-classpath <pathlist>     Specify where to find user class files
-exclude <pkglist>        Specify a list of packages to exclude
-subpackages <subpkglist> Specify subpackages to recursively load
-breakiterator            Compute 1st sentence with BreakIterator
-bootclasspath <pathlist> Override location of class files loaded
			  by the bootstrap class loader
-source <release>         Provide source compatibility with specified release
-extdirs <dirlist>        Override location of installed extensions
-verbose                  Output messages about what Javadoc is doing
-locale <name>            Locale to be used, e.g. en_US or en_US_WIN
-encoding <name>          Source file encoding name
-quiet                    Do not display status messages
-J<flag>                  Pass <flag> directly to the runtime system
-X                        Print a synopsis of nonstandard options

Provided by Standard doclet:
-d <directory>                    Destination directory for output files
-use                              Create class and package usage pages
-version                          Include @version paragraphs
-author                           Include @author paragraphs
-docfilessubdirs                  Recursively copy doc-file subdirectories
-splitindex                       Split index into one file per letter
-windowtitle <text>               Browser window title for the documenation
-doctitle <html-code>             Include title for the overview page
-header <html-code>               Include header text for each page
-footer <html-code>               Include footer text for each page
-top    <html-code>               Include top text for each page
-bottom <html-code>               Include bottom text for each page
-link <url>                       Create links to javadoc output at <url>
-linkoffline <url> <url2>         Link to docs at <url> using package list
at <url2>
-excludedocfilessubdir <name1>:.. Exclude any doc-files subdirectories with given name.
-group <name> <p1>:<p2>..         Group specified packages together in overview
page
-nocomment                        Supress description and tags, generate only declarations.
-nodeprecated                     Do not include @deprecated information
-noqualifier <name1>:<name2>:...  Exclude the list of qualifiers from the output.
-nosince                          Do not include @since information
-notimestamp                      Do not include hidden time stamp
-nodeprecatedlist                 Do not generate deprecated list
-notree                           Do not generate class hierarchy
-noindex                          Do not generate index
-nohelp                           Do not generate help link
-nonavbar                         Do not generate navigation bar
-serialwarn                       Generate warning about @serial tag
-tag <name>:<locations>:<header>  Specify single argument custom tags
-taglet                           The fully qualified name of Taglet to register
-tagletpath                       The path to Taglets
-Xdocrootparent <url>             Replaces all appearances of @docRoot followed by /..
in doc comments with <url>
-charset <charset>                Charset for cross-platform viewing of generated documentation.
-helpfile <file>                  Include file that help link links to
-linksource                       Generate source in HTML
-sourcetab <tab length>           Specify the number of spaces each tab takes up in
the source
-keywords                         Include HTML meta tags with package, class and member info
-stylesheetfile <path>            File to change style of the generated documentation
-docencoding <name>               Output encoding name
1 error
[INFO] ------------------------------------------------------------------------
[INFO] Reactor Summary:
[INFO] 
[INFO] Cayenne ........................................... SUCCESS [0.382s]
[INFO] Cayenne Build Tools Parent ........................ SUCCESS [0.015s]
[INFO] Cayenne License and Notice Bundle ................. SUCCESS [1.019s]
[INFO] Common Unit Test Utilities ........................ SUCCESS [0.900s]
[INFO] Cayenne Code Checkers ............................. SUCCESS [0.070s]
[INFO] Cayenne Dependency Injection Container ............ SUCCESS [10.706s]
[INFO] Cayenne Server .................................... SUCCESS [3:32.774s]
[INFO] Cayenne ROP Client ................................ SUCCESS [41.889s]
[INFO] Cayenne Project ................................... SUCCESS [7.904s]
[INFO] Cayenne Tools ..................................... SUCCESS [8.520s]
[INFO] Cayenne Lifecycle Utilities ....................... SUCCESS [7.433s]
[INFO] Cayenne Maven Plugins ............................. SUCCESS [0.015s]
[INFO] Cayenne Maven Plugin .............................. SUCCESS [9.280s]
[INFO] Cayenne Cryptography Extensions ................... SUCCESS [8.809s]
[INFO] Cayenne Integration Tests Parent .................. SUCCESS [0.008s]
[INFO] Integration Tests - Cayenne Tools ................. SUCCESS [1.595s]
[INFO] Cayenne Modeler Parent ............................ SUCCESS [0.019s]
[INFO] Cayenne WebObjects Compatibility Library .......... SUCCESS [6.109s]
[INFO] Cayenne Modeler ................................... SUCCESS [15.528s]
[INFO] Cayenne Modeler Generic and Windows Extensions .... SUCCESS [1.819s]
[INFO] Cayenne Modeler Generic ........................... SUCCESS [0.739s]
[INFO] Cayenne Modeler Mac OS X Extensions ............... SUCCESS [2.033s]
[INFO] Cayenne Modeler Mac OS X .......................... SUCCESS [0.766s]
[INFO] Cayenne Modeler Mac OS X - Old Apple Java ......... SUCCESS [0.699s]
[INFO] Cayenne Modeler Windows ........................... SUCCESS [0.299s]
[INFO] Cayenne Modeler Maven Plugin ...................... SUCCESS [1.791s]
[INFO] Cayenne Tutorial .................................. SUCCESS [1.025s]
[INFO] Cayenne ROP Server Tutorial ....................... SUCCESS [1.576s]
[INFO] Cayenne ROP Client Tutorial ....................... SUCCESS [0.997s]
[INFO] Cayenne Tutorials ................................. SUCCESS [0.006s]
[INFO] Cayenne Documenation Parent ....................... SUCCESS [0.005s]
[INFO] Cayenne Documentation ............................. FAILURE [8.483s]
[INFO] Cayenne Docbook Documentation ..................... SKIPPED
[INFO] Docbook: Cayenne Stylesheets ...................... SKIPPED
[INFO] Docbook: Cayenne Guide ............................ SKIPPED
[INFO] Docbook: Getting Started with Cayenne ............. SKIPPED
[INFO] Docbook: Getting Started with Cayenne ROP ......... SKIPPED
[INFO] Docbook: Cayenne New Features and Upgrade Guide ... SKIPPED
[INFO] Cayenne Release Assembly .......................... SKIPPED
[INFO] ------------------------------------------------------------------------
[INFO] BUILD FAILURE
[INFO] ------------------------------------------------------------------------
[INFO] Total time: 5:54.536s
[INFO] Finished at: Tue Nov 25 09:05:18 UTC 2014
[INFO] Final Memory: 94M/563M
[INFO] ------------------------------------------------------------------------
[ERROR] Failed to execute goal org.apache.maven.plugins:maven-javadoc-plugin:2.9.1:javadoc
(javadoc) on project cayenne-doc: An error has occurred in JavaDocs report generation:
[ERROR] Exit code: 1 - javadoc: error - invalid flag: -Xdoclint:none
[ERROR] 
[ERROR] Command line was: /home/jenkins/tools/java/jdk1.7.0_25-32/jre/../bin/javadoc @options
@argfile
[ERROR] 
[ERROR] Refer to the generated Javadoc files in '<https://builds.apache.org/job/cayenne-master/cayenneTestConnection=hsql,jdk=JDK%201.7%20(latest),label=Ubuntu/ws/docs/doc/target/site/apidocs/doc/api'>
dir.
[ERROR] -> [Help 1]
org.apache.maven.lifecycle.LifecycleExecutionException: Failed to execute goal org.apache.maven.plugins:maven-javadoc-plugin:2.9.1:javadoc
(javadoc) on project cayenne-doc: An error has occurred in JavaDocs report generation: 
Exit code: 1 - javadoc: error - invalid flag: -Xdoclint:none

Command line was: /home/jenkins/tools/java/jdk1.7.0_25-32/jre/../bin/javadoc @options @argfile

Refer to the generated Javadoc files in '<https://builds.apache.org/job/cayenne-master/cayenneTestConnection=hsql,jdk=JDK%201.7%20(latest),label=Ubuntu/ws/docs/doc/target/site/apidocs/doc/api'>
dir.

	at org.apache.maven.lifecycle.internal.MojoExecutor.execute(MojoExecutor.java:217)
	at org.apache.maven.lifecycle.internal.MojoExecutor.execute(MojoExecutor.java:153)
	at org.apache.maven.lifecycle.internal.MojoExecutor.execute(MojoExecutor.java:145)
	at org.apache.maven.lifecycle.internal.LifecycleModuleBuilder.buildProject(LifecycleModuleBuilder.java:84)
	at org.apache.maven.lifecycle.internal.LifecycleModuleBuilder.buildProject(LifecycleModuleBuilder.java:59)
	at org.apache.maven.lifecycle.internal.LifecycleStarter.singleThreadedBuild(LifecycleStarter.java:183)
	at org.apache.maven.lifecycle.internal.LifecycleStarter.execute(LifecycleStarter.java:161)
	at org.apache.maven.DefaultMaven.doExecute(DefaultMaven.java:320)
	at org.apache.maven.DefaultMaven.execute(DefaultMaven.java:156)
	at org.apache.maven.cli.MavenCli.execute(MavenCli.java:537)
	at org.apache.maven.cli.MavenCli.doMain(MavenCli.java:196)
	at org.apache.maven.cli.MavenCli.main(MavenCli.java:141)
	at sun.reflect.NativeMethodAccessorImpl.invoke0(Native Method)
	at sun.reflect.NativeMethodAccessorImpl.invoke(NativeMethodAccessorImpl.java:57)
	at sun.reflect.DelegatingMethodAccessorImpl.invoke(DelegatingMethodAccessorImpl.java:43)
	at java.lang.reflect.Method.invoke(Method.java:606)
	at org.codehaus.plexus.classworlds.launcher.Launcher.launchEnhanced(Launcher.java:290)
	at org.codehaus.plexus.classworlds.launcher.Launcher.launch(Launcher.java:230)
	at org.codehaus.plexus.classworlds.launcher.Launcher.mainWithExitCode(Launcher.java:409)
	at org.codehaus.plexus.classworlds.launcher.Launcher.main(Launcher.java:352)
Caused by: org.apache.maven.plugin.MojoExecutionException: An error has occurred in JavaDocs
report generation: 
Exit code: 1 - javadoc: error - invalid flag: -Xdoclint:none

Command line was: /home/jenkins/tools/java/jdk1.7.0_25-32/jre/../bin/javadoc @options @argfile

Refer to the generated Javadoc files in '<https://builds.apache.org/job/cayenne-master/cayenneTestConnection=hsql,jdk=JDK%201.7%20(latest),label=Ubuntu/ws/docs/doc/target/site/apidocs/doc/api'>
dir.

	at org.apache.maven.plugin.javadoc.AbstractJavadocMojo.failOnError(AbstractJavadocMojo.java:5913)
	at org.apache.maven.plugin.javadoc.JavadocReport.execute(JavadocReport.java:319)
	at org.apache.maven.plugin.DefaultBuildPluginManager.executeMojo(DefaultBuildPluginManager.java:101)
	at org.apache.maven.lifecycle.internal.MojoExecutor.execute(MojoExecutor.java:209)
	... 19 more
Caused by: org.apache.maven.reporting.MavenReportException: 
Exit code: 1 - javadoc: error - invalid flag: -Xdoclint:none

Command line was: /home/jenkins/tools/java/jdk1.7.0_25-32/jre/../bin/javadoc @options @argfile

Refer to the generated Javadoc files in '<https://builds.apache.org/job/cayenne-master/cayenneTestConnection=hsql,jdk=JDK%201.7%20(latest),label=Ubuntu/ws/docs/doc/target/site/apidocs/doc/api'>
dir.

	at org.apache.maven.plugin.javadoc.AbstractJavadocMojo.executeJavadocCommandLine(AbstractJavadocMojo.java:5074)
	at org.apache.maven.plugin.javadoc.AbstractJavadocMojo.executeReport(AbstractJavadocMojo.java:1999)
	at org.apache.maven.plugin.javadoc.JavadocReport.generate(JavadocReport.java:130)
	at org.apache.maven.plugin.javadoc.JavadocReport.execute(JavadocReport.java:315)
	... 21 more
[ERROR] 
[ERROR] Re-run Maven using the -X switch to enable full debug logging.
[ERROR] 
[ERROR] For more information about the errors and possible solutions, please read the following
articles:
[ERROR] [Help 1] http://cwiki.apache.org/confluence/display/MAVEN/MojoExecutionException
[ERROR] 
[ERROR] After correcting the problems, you can resume the build with the command
[ERROR]   mvn <goals> -rf :cayenne-doc
Build step 'Invoke top-level Maven targets' marked build as failure
Recording test results

Mime
View raw message