cayenne-commits mailing list archives

Site index · List index
Message view « Date » · « Thread »
Top « Date » · « Thread »
From Apache Jenkins Server <jenk...@builds.apache.org>
Subject Build failed in Jenkins: cayenne-master » hsql,JDK 1.6 (latest),Ubuntu #108
Date Fri, 28 Nov 2014 15:08:25 GMT
See <https://builds.apache.org/job/cayenne-master/cayenneTestConnection=hsql,jdk=JDK%201.6%20(latest),label=Ubuntu/108/changes>

Changes:

[aadamchik] CAY-1971 Variants of Property.like(..) : contains(..), startsWith(..), endsWith(..)

[aadamchik] CAY-1971 Variants of Property.like(..) : contains(..), startsWith(..), endsWith(..)

[aadamchik] CAY-1959 Chainable API for SelectQuery

[aadamchik] CAY-1958 SelectById - a new full-featured select query to get objects by id

------------------------------------------
[...truncated 69387 lines...]
[INFO] --- maven-clean-plugin:2.4.1:clean (default-clean) @ maven-cayenne-modeler-plugin ---
[INFO] 
[INFO] --- maven-checkstyle-plugin:2.9.1:check (default) @ maven-cayenne-modeler-plugin ---
[WARNING] File encoding has not been set, using platform encoding ISO-8859-1, i.e. build is
platform dependent!
[INFO] Starting audit...
Audit done.

[INFO] 
[INFO] >>> maven-pmd-plugin:3.2:check (default) @ maven-cayenne-modeler-plugin >>>
[INFO] 
[INFO] --- maven-pmd-plugin:3.2:pmd (pmd) @ maven-cayenne-modeler-plugin ---
[INFO] 
[INFO] <<< maven-pmd-plugin:3.2:check (default) @ maven-cayenne-modeler-plugin <<<
[INFO] 
[INFO] --- maven-pmd-plugin:3.2:check (default) @ maven-cayenne-modeler-plugin ---
[INFO] PMD Failure: org.apache.cayenne.tools.CayenneModelerMojo:82 Rule:AvoidPrintStackTrace
Priority:1 Avoid printStackTrace(); use a logger call instead..
[INFO] You have 1 PMD violation. For more details see:<https://builds.apache.org/job/cayenne-master/cayenneTestConnection=hsql,jdk=JDK%201.6%20(latest),label=Ubuntu/ws/plugins/maven-cayenne-modeler-plugin/target/pmd.xml>
[INFO] 
[INFO] --- maven-plugin-plugin:3.3:descriptor (default-descriptor) @ maven-cayenne-modeler-plugin
---
[ERROR] 

Artifact Ids of the format maven-___-plugin are reserved for 
plugins in the Group Id org.apache.maven.plugins
Please change your artifactId to the format ___-maven-plugin
In the future this error will break the build.


[WARNING] 

Goal prefix is specified as: 'signature'. Maven currently expects it to be 'cayenne-modeler'.

[WARNING] Using platform encoding (ISO-8859-1 actually) to read mojo metadata, i.e. build
is platform dependent!
[INFO] Applying mojo extractor for language: java-annotations
[INFO] Mojo extractor for language: java-annotations found 0 mojo descriptors.
[INFO] Applying mojo extractor for language: java
[WARNING] org.apache.cayenne.tools.CayenneModelerMojo#modelFile:
[WARNING]   The syntax
[WARNING]     @parameter expression="${property}"
[WARNING]   is deprecated, please use
[WARNING]     @parameter property="property"
[WARNING]   instead.
[INFO] Mojo extractor for language: java found 1 mojo descriptors.
[INFO] Applying mojo extractor for language: bsh
[INFO] Mojo extractor for language: bsh found 0 mojo descriptors.
[INFO] 
[INFO] --- maven-remote-resources-plugin:1.5:process (default) @ maven-cayenne-modeler-plugin
---
[INFO] 
[INFO] --- maven-resources-plugin:2.4.3:resources (default-resources) @ maven-cayenne-modeler-plugin
---
[INFO] Using 'UTF-8' encoding to copy filtered resources.
[INFO] skip non existing resourceDirectory <https://builds.apache.org/job/cayenne-master/cayenneTestConnection=hsql,jdk=JDK%201.6%20(latest),label=Ubuntu/ws/plugins/maven-cayenne-modeler-plugin/src/main/resources>
[INFO] Copying 4 resources
[INFO] 
[INFO] --- maven-compiler-plugin:2.3.2:compile (default-compile) @ maven-cayenne-modeler-plugin
---
[INFO] Compiling 1 source file to <https://builds.apache.org/job/cayenne-master/cayenneTestConnection=hsql,jdk=JDK%201.6%20(latest),label=Ubuntu/ws/plugins/maven-cayenne-modeler-plugin/target/classes>
[INFO] 
[INFO] --- maven-plugin-plugin:3.3:descriptor (default) @ maven-cayenne-modeler-plugin ---
[ERROR] 

Artifact Ids of the format maven-___-plugin are reserved for 
plugins in the Group Id org.apache.maven.plugins
Please change your artifactId to the format ___-maven-plugin
In the future this error will break the build.


[WARNING] 

Goal prefix is specified as: 'signature'. Maven currently expects it to be 'cayenne-modeler'.

[WARNING] Using platform encoding (ISO-8859-1 actually) to read mojo metadata, i.e. build
is platform dependent!
[INFO] Applying mojo extractor for language: java-annotations
[INFO] Mojo extractor for language: java-annotations found 0 mojo descriptors.
[INFO] Applying mojo extractor for language: java
[WARNING] org.apache.cayenne.tools.CayenneModelerMojo#modelFile:
[WARNING]   The syntax
[WARNING]     @parameter expression="${property}"
[WARNING]   is deprecated, please use
[WARNING]     @parameter property="property"
[WARNING]   instead.
[INFO] Mojo extractor for language: java found 1 mojo descriptors.
[INFO] Applying mojo extractor for language: bsh
[INFO] Mojo extractor for language: bsh found 0 mojo descriptors.
[INFO] 
[INFO] --- maven-resources-plugin:2.4.3:testResources (default-testResources) @ maven-cayenne-modeler-plugin
---
[INFO] Using 'UTF-8' encoding to copy filtered resources.
[INFO] skip non existing resourceDirectory <https://builds.apache.org/job/cayenne-master/cayenneTestConnection=hsql,jdk=JDK%201.6%20(latest),label=Ubuntu/ws/plugins/maven-cayenne-modeler-plugin/src/test/resources>
[INFO] Copying 5 resources
[INFO] 
[INFO] --- maven-compiler-plugin:2.3.2:testCompile (default-testCompile) @ maven-cayenne-modeler-plugin
---
[INFO] No sources to compile
[INFO] 
[INFO] --- maven-surefire-plugin:2.5:test (default-test) @ maven-cayenne-modeler-plugin ---
[INFO] Surefire report directory: <https://builds.apache.org/job/cayenne-master/cayenneTestConnection=hsql,jdk=JDK%201.6%20(latest),label=Ubuntu/ws/plugins/maven-cayenne-modeler-plugin/target/surefire-reports>

-------------------------------------------------------
 T E S T S
-------------------------------------------------------
There are no tests to run.

Results :

Tests run: 0, Failures: 0, Errors: 0, Skipped: 0

[INFO] 
[INFO] --- maven-jar-plugin:2.3.1:jar (default-jar) @ maven-cayenne-modeler-plugin ---
[INFO] Building jar: <https://builds.apache.org/job/cayenne-master/cayenneTestConnection=hsql,jdk=JDK%201.6%20(latest),label=Ubuntu/ws/plugins/maven-cayenne-modeler-plugin/target/maven-cayenne-modeler-plugin-4.0.M2-SNAPSHOT.jar>
[INFO] 
[INFO] --- maven-plugin-plugin:3.3:addPluginArtifactMetadata (default-addPluginArtifactMetadata)
@ maven-cayenne-modeler-plugin ---
[INFO] 
[INFO] >>> maven-source-plugin:2.1.2:jar (bundle-source-jar) @ maven-cayenne-modeler-plugin
>>>
[INFO] 
[INFO] <<< maven-source-plugin:2.1.2:jar (bundle-source-jar) @ maven-cayenne-modeler-plugin
<<<
[INFO] 
[INFO] --- maven-source-plugin:2.1.2:jar (bundle-source-jar) @ maven-cayenne-modeler-plugin
---
[INFO] org already added, skipping
[INFO] org/apache already added, skipping
[INFO] org/apache/cayenne already added, skipping
[INFO] org/apache/cayenne/tools already added, skipping
[INFO] Building jar: <https://builds.apache.org/job/cayenne-master/cayenneTestConnection=hsql,jdk=JDK%201.6%20(latest),label=Ubuntu/ws/plugins/maven-cayenne-modeler-plugin/target/maven-cayenne-modeler-plugin-4.0.M2-SNAPSHOT-sources.jar>
[INFO] org already added, skipping
[INFO] org/apache already added, skipping
[INFO] org/apache/cayenne already added, skipping
[INFO] org/apache/cayenne/tools already added, skipping
[INFO] 
[INFO] --- maven-install-plugin:2.3.1:install (default-install) @ maven-cayenne-modeler-plugin
---
[INFO] Installing <https://builds.apache.org/job/cayenne-master/cayenneTestConnection=hsql,jdk=JDK%201.6%20(latest),label=Ubuntu/ws/plugins/maven-cayenne-modeler-plugin/target/maven-cayenne-modeler-plugin-4.0.M2-SNAPSHOT.jar>
to /home/jenkins/.m2/repository/org/apache/cayenne/plugins/maven-cayenne-modeler-plugin/4.0.M2-SNAPSHOT/maven-cayenne-modeler-plugin-4.0.M2-SNAPSHOT.jar
[INFO] Installing <https://builds.apache.org/job/cayenne-master/cayenneTestConnection=hsql,jdk=JDK%201.6%20(latest),label=Ubuntu/ws/plugins/maven-cayenne-modeler-plugin/pom.xml>
to /home/jenkins/.m2/repository/org/apache/cayenne/plugins/maven-cayenne-modeler-plugin/4.0.M2-SNAPSHOT/maven-cayenne-modeler-plugin-4.0.M2-SNAPSHOT.pom
[INFO] Installing <https://builds.apache.org/job/cayenne-master/cayenneTestConnection=hsql,jdk=JDK%201.6%20(latest),label=Ubuntu/ws/plugins/maven-cayenne-modeler-plugin/target/maven-cayenne-modeler-plugin-4.0.M2-SNAPSHOT-sources.jar>
to /home/jenkins/.m2/repository/org/apache/cayenne/plugins/maven-cayenne-modeler-plugin/4.0.M2-SNAPSHOT/maven-cayenne-modeler-plugin-4.0.M2-SNAPSHOT-sources.jar
[INFO]                                                                         
[INFO] ------------------------------------------------------------------------
[INFO] Building Cayenne Tutorial 4.0.M2-SNAPSHOT
[INFO] ------------------------------------------------------------------------
[INFO] 
[INFO] --- maven-clean-plugin:2.4.1:clean (default-clean) @ tutorial ---
[INFO] 
[INFO] --- maven-resources-plugin:2.5:resources (default-resources) @ tutorial ---
[debug] execute contextualize
[WARNING] Using platform encoding (ISO-8859-1 actually) to copy filtered resources, i.e. build
is platform dependent!
[INFO] Copying 2 resources
[INFO] 
[INFO] --- maven-compiler-plugin:2.3.2:compile (default-compile) @ tutorial ---
[WARNING] File encoding has not been set, using platform encoding ISO-8859-1, i.e. build is
platform dependent!
[INFO] Compiling 9 source files to <https://builds.apache.org/job/cayenne-master/cayenneTestConnection=hsql,jdk=JDK%201.6%20(latest),label=Ubuntu/ws/tutorials/tutorial/target/classes>
[INFO] -------------------------------------------------------------
[ERROR] COMPILATION ERROR : 
[INFO] -------------------------------------------------------------
[ERROR] <https://builds.apache.org/job/cayenne-master/cayenneTestConnection=hsql,jdk=JDK%201.6%20(latest),label=Ubuntu/ws/tutorials/tutorial/src/main/java/org/apache/cayenne/tutorial/Main.java>:[83,45]
cannot find symbol
symbol  : method likeInsensitive(java.lang.String)
location: class org.apache.cayenne.exp.Property<java.lang.String>
[INFO] 1 error
[INFO] -------------------------------------------------------------
[INFO] ------------------------------------------------------------------------
[INFO] Reactor Summary:
[INFO] 
[INFO] Cayenne ........................................... SUCCESS [0.416s]
[INFO] Cayenne Build Tools Parent ........................ SUCCESS [0.033s]
[INFO] Cayenne License and Notice Bundle ................. SUCCESS [1.081s]
[INFO] Common Unit Test Utilities ........................ SUCCESS [0.877s]
[INFO] Cayenne Code Checkers ............................. SUCCESS [0.099s]
[INFO] Cayenne Dependency Injection Container ............ SUCCESS [13.385s]
[INFO] Cayenne Server .................................... SUCCESS [5:35.022s]
[INFO] Cayenne ROP Client ................................ SUCCESS [1:00.565s]
[INFO] Cayenne Project ................................... SUCCESS [8.005s]
[INFO] Cayenne Tools ..................................... SUCCESS [10.998s]
[INFO] Cayenne Lifecycle Utilities ....................... SUCCESS [7.743s]
[INFO] Cayenne Maven Plugins ............................. SUCCESS [0.425s]
[INFO] Cayenne Maven Plugin .............................. SUCCESS [15.280s]
[INFO] Cayenne Cryptography Extensions ................... SUCCESS [9.490s]
[INFO] Cayenne Integration Tests Parent .................. SUCCESS [0.028s]
[INFO] Integration Tests - Cayenne Tools ................. SUCCESS [1.675s]
[INFO] Cayenne Modeler Parent ............................ SUCCESS [0.038s]
[INFO] Cayenne WebObjects Compatibility Library .......... SUCCESS [6.106s]
[INFO] Cayenne Modeler ................................... SUCCESS [15.616s]
[INFO] Cayenne Modeler Generic and Windows Extensions .... SUCCESS [2.062s]
[INFO] Cayenne Modeler Generic ........................... SUCCESS [0.780s]
[INFO] Cayenne Modeler Mac OS X Extensions ............... SUCCESS [3.117s]
[INFO] Cayenne Modeler Mac OS X .......................... SUCCESS [0.828s]
[INFO] Cayenne Modeler Mac OS X - Old Apple Java ......... SUCCESS [0.753s]
[INFO] Cayenne Modeler Windows ........................... SUCCESS [0.373s]
[INFO] Cayenne Modeler Maven Plugin ...................... SUCCESS [3.391s]
[INFO] Cayenne Tutorial .................................. FAILURE [0.684s]
[INFO] Cayenne ROP Server Tutorial ....................... SKIPPED
[INFO] Cayenne ROP Client Tutorial ....................... SKIPPED
[INFO] Cayenne Tutorials ................................. SKIPPED
[INFO] Cayenne Documenation Parent ....................... SKIPPED
[INFO] Cayenne Documentation ............................. SKIPPED
[INFO] Cayenne Docbook Documentation ..................... SKIPPED
[INFO] Docbook: Cayenne Stylesheets ...................... SKIPPED
[INFO] Docbook: Cayenne Guide ............................ SKIPPED
[INFO] Docbook: Getting Started with Cayenne ............. SKIPPED
[INFO] Docbook: Getting Started with Cayenne ROP ......... SKIPPED
[INFO] Docbook: Cayenne New Features and Upgrade Guide ... SKIPPED
[INFO] Cayenne Release Assembly .......................... SKIPPED
[INFO] ------------------------------------------------------------------------
[INFO] BUILD FAILURE
[INFO] ------------------------------------------------------------------------
[INFO] Total time: 8:20.495s
[INFO] Finished at: Fri Nov 28 15:07:32 UTC 2014
[INFO] Final Memory: 44M/543M
[INFO] ------------------------------------------------------------------------
[ERROR] Failed to execute goal org.apache.maven.plugins:maven-compiler-plugin:2.3.2:compile
(default-compile) on project tutorial: Compilation failure
[ERROR] <https://builds.apache.org/job/cayenne-master/cayenneTestConnection=hsql,jdk=JDK%201.6%20(latest),label=Ubuntu/ws/tutorials/tutorial/src/main/java/org/apache/cayenne/tutorial/Main.java>:[83,45]
cannot find symbol
[ERROR] symbol  : method likeInsensitive(java.lang.String)
[ERROR] location: class org.apache.cayenne.exp.Property<java.lang.String>
[ERROR] -> [Help 1]
org.apache.maven.lifecycle.LifecycleExecutionException: Failed to execute goal org.apache.maven.plugins:maven-compiler-plugin:2.3.2:compile
(default-compile) on project tutorial: Compilation failure
<https://builds.apache.org/job/cayenne-master/cayenneTestConnection=hsql,jdk=JDK%201.6%20(latest),label=Ubuntu/ws/tutorials/tutorial/src/main/java/org/apache/cayenne/tutorial/Main.java>:[83,45]
cannot find symbol
symbol  : method likeInsensitive(java.lang.String)
location: class org.apache.cayenne.exp.Property<java.lang.String>

	at org.apache.maven.lifecycle.internal.MojoExecutor.execute(MojoExecutor.java:213)
	at org.apache.maven.lifecycle.internal.MojoExecutor.execute(MojoExecutor.java:153)
	at org.apache.maven.lifecycle.internal.MojoExecutor.execute(MojoExecutor.java:145)
	at org.apache.maven.lifecycle.internal.LifecycleModuleBuilder.buildProject(LifecycleModuleBuilder.java:84)
	at org.apache.maven.lifecycle.internal.LifecycleModuleBuilder.buildProject(LifecycleModuleBuilder.java:59)
	at org.apache.maven.lifecycle.internal.LifecycleStarter.singleThreadedBuild(LifecycleStarter.java:183)
	at org.apache.maven.lifecycle.internal.LifecycleStarter.execute(LifecycleStarter.java:161)
	at org.apache.maven.DefaultMaven.doExecute(DefaultMaven.java:320)
	at org.apache.maven.DefaultMaven.execute(DefaultMaven.java:156)
	at org.apache.maven.cli.MavenCli.execute(MavenCli.java:537)
	at org.apache.maven.cli.MavenCli.doMain(MavenCli.java:196)
	at org.apache.maven.cli.MavenCli.main(MavenCli.java:141)
	at sun.reflect.NativeMethodAccessorImpl.invoke0(Native Method)
	at sun.reflect.NativeMethodAccessorImpl.invoke(NativeMethodAccessorImpl.java:39)
	at sun.reflect.DelegatingMethodAccessorImpl.invoke(DelegatingMethodAccessorImpl.java:25)
	at java.lang.reflect.Method.invoke(Method.java:597)
	at org.codehaus.plexus.classworlds.launcher.Launcher.launchEnhanced(Launcher.java:290)
	at org.codehaus.plexus.classworlds.launcher.Launcher.launch(Launcher.java:230)
	at org.codehaus.plexus.classworlds.launcher.Launcher.mainWithExitCode(Launcher.java:409)
	at org.codehaus.plexus.classworlds.launcher.Launcher.main(Launcher.java:352)
Caused by: org.apache.maven.plugin.CompilationFailureException: Compilation failure
<https://builds.apache.org/job/cayenne-master/cayenneTestConnection=hsql,jdk=JDK%201.6%20(latest),label=Ubuntu/ws/tutorials/tutorial/src/main/java/org/apache/cayenne/tutorial/Main.java>:[83,45]
cannot find symbol
symbol  : method likeInsensitive(java.lang.String)
location: class org.apache.cayenne.exp.Property<java.lang.String>

	at org.apache.maven.plugin.AbstractCompilerMojo.execute(AbstractCompilerMojo.java:656)
	at org.apache.maven.plugin.CompilerMojo.execute(CompilerMojo.java:128)
	at org.apache.maven.plugin.DefaultBuildPluginManager.executeMojo(DefaultBuildPluginManager.java:101)
	at org.apache.maven.lifecycle.internal.MojoExecutor.execute(MojoExecutor.java:209)
	... 19 more
[ERROR] 
[ERROR] Re-run Maven using the -X switch to enable full debug logging.
[ERROR] 
[ERROR] For more information about the errors and possible solutions, please read the following
articles:
[ERROR] [Help 1] http://cwiki.apache.org/confluence/display/MAVEN/MojoFailureException
[ERROR] 
[ERROR] After correcting the problems, you can resume the build with the command
[ERROR]   mvn <goals> -rf :tutorial
Build step 'Invoke top-level Maven targets' marked build as failure
Recording test results

Mime
View raw message