cayenne-commits mailing list archives

Site index · List index
Message view « Date » · « Thread »
Top « Date » · « Thread »
From Apache Jenkins Server <jenk...@builds.apache.org>
Subject Build failed in Jenkins: cayenne-master » h2,JDK 1.7 (latest),Ubuntu #37
Date Sat, 20 Sep 2014 07:57:40 GMT
See <https://builds.apache.org/job/cayenne-master/cayenneTestConnection=h2,jdk=JDK%201.7%20(latest),label=Ubuntu/37/changes>

Changes:

[aadamchik] migration from SVN leftover

------------------------------------------
[...truncated 94143 lines...]
2202/2574 KB   
2206/2574 KB   
2210/2574 KB   
2214/2574 KB   
2218/2574 KB   
2222/2574 KB   
2226/2574 KB   
2230/2574 KB   
2234/2574 KB   
2238/2574 KB   
2242/2574 KB   
2246/2574 KB   
2250/2574 KB   
2253/2574 KB   
2257/2574 KB   
2261/2574 KB   
2265/2574 KB   
2269/2574 KB   
2273/2574 KB   
2275/2574 KB   
2279/2574 KB   
2283/2574 KB   
2287/2574 KB   
2291/2574 KB   
2295/2574 KB   
2296/2574 KB   
2300/2574 KB   
2304/2574 KB   
2308/2574 KB   
2312/2574 KB   
2316/2574 KB   
2318/2574 KB   
2322/2574 KB   
2326/2574 KB   
2330/2574 KB   
2332/2574 KB   
2336/2574 KB   
2339/2574 KB   
2343/2574 KB   
2346/2574 KB   
2350/2574 KB   
2353/2574 KB   
2357/2574 KB   
2361/2574 KB   
2365/2574 KB   
2369/2574 KB   
2373/2574 KB   
2377/2574 KB   
2381/2574 KB   
2385/2574 KB   
2388/2574 KB   
2392/2574 KB   
2396/2574 KB   
2400/2574 KB   
2404/2574 KB   
2408/2574 KB   
2410/2574 KB   
2414/2574 KB   
2418/2574 KB   
2422/2574 KB   
2426/2574 KB   
2430/2574 KB   
2434/2574 KB   
2438/2574 KB   
2442/2574 KB   
2446/2574 KB   
2450/2574 KB   
2452/2574 KB   
2456/2574 KB   
2460/2574 KB   
2464/2574 KB   
2468/2574 KB   
2472/2574 KB   
2475/2574 KB   
2479/2574 KB   
2483/2574 KB   
2487/2574 KB   
2491/2574 KB   
2492/2574 KB   
2496/2574 KB   
2500/2574 KB   
2504/2574 KB   
2508/2574 KB   
2512/2574 KB   
2516/2574 KB   
2520/2574 KB   
2524/2574 KB   
2528/2574 KB   
2532/2574 KB   
2536/2574 KB   
2540/2574 KB   
2544/2574 KB   
2548/2574 KB   
2551/2574 KB   
2555/2574 KB   
2559/2574 KB   
2563/2574 KB   
2567/2574 KB   
2571/2574 KB   
2574/2574 KB   
               
Downloaded: http://maven.objectstyle.org/nexus/content/groups/cayenne-deps/org/apache/derby/derby/10.7.1.1/derby-10.7.1.1.jar
(2574 KB at 4539.5 KB/sec)
[INFO] 
[INFO] --- maven-clean-plugin:2.4.1:clean (default-clean) @ maven-cayenne-plugin ---
[INFO] 
[INFO] --- maven-plugin-plugin:2.9:descriptor (default-descriptor) @ maven-cayenne-plugin
---
[ERROR] 

Artifact Ids of the format maven-___-plugin are reserved for 
plugins in the Group Id org.apache.maven.plugins
Please change your artifactId to the format ___-maven-plugin
In the future this error will break the build.


[WARNING] Using platform encoding (UTF-8 actually) to read mojo metadata, i.e. build is platform
dependent!
[INFO] Applying mojo extractor for language: java
[INFO] Mojo extractor for language: java found 3 mojo descriptors.
[INFO] Applying mojo extractor for language: bsh
[INFO] Mojo extractor for language: bsh found 0 mojo descriptors.
[INFO] 
[INFO] --- maven-remote-resources-plugin:1.5:process (default) @ maven-cayenne-plugin ---
[INFO] 
[INFO] --- maven-resources-plugin:2.4.3:resources (default-resources) @ maven-cayenne-plugin
---
[INFO] Using 'UTF-8' encoding to copy filtered resources.
[INFO] Copying 1 resource
[INFO] Copying 4 resources
[INFO] 
[INFO] --- maven-compiler-plugin:2.3.2:compile (default-compile) @ maven-cayenne-plugin ---
[INFO] Compiling 4 source files to <https://builds.apache.org/job/cayenne-master/cayenneTestConnection=h2,jdk=JDK%201.7%20(latest),label=Ubuntu/ws/plugins/maven-cayenne-plugin/target/classes>
[INFO] 
[INFO] --- maven-resources-plugin:2.4.3:testResources (default-testResources) @ maven-cayenne-plugin
---
[INFO] Using 'UTF-8' encoding to copy filtered resources.
[INFO] Copying 17 resources
[INFO] Copying 8 resources
[INFO] 
[INFO] --- maven-compiler-plugin:2.3.2:testCompile (default-testCompile) @ maven-cayenne-plugin
---
[INFO] Compiling 2 source files to <https://builds.apache.org/job/cayenne-master/cayenneTestConnection=h2,jdk=JDK%201.7%20(latest),label=Ubuntu/ws/plugins/maven-cayenne-plugin/target/test-classes>
[INFO] 
[INFO] --- maven-surefire-plugin:2.5:test (default-test) @ maven-cayenne-plugin ---
[INFO] Surefire report directory: <https://builds.apache.org/job/cayenne-master/cayenneTestConnection=h2,jdk=JDK%201.7%20(latest),label=Ubuntu/ws/plugins/maven-cayenne-plugin/target/surefire-reports>

-------------------------------------------------------
 T E S T S
-------------------------------------------------------
Running org.apache.cayenne.tools.CayenneGeneratorMojoTest
[INFO] Generating superclass file: <https://builds.apache.org/job/cayenne-master/cayenneTestConnection=h2,jdk=JDK%201.7%20(latest),label=Ubuntu/ws/plugins/maven-cayenne-plugin/target/cayenneGeneratedClasses/superPkg/_TestEntity.txt>
[INFO] Generating class file: <https://builds.apache.org/job/cayenne-master/cayenneTestConnection=h2,jdk=JDK%201.7%20(latest),label=Ubuntu/ws/plugins/maven-cayenne-plugin/target/cayenneGeneratedClasses/pack/TestEntity.txt>
[INFO] Generating superclass file: <https://builds.apache.org/job/cayenne-master/cayenneTestConnection=h2,jdk=JDK%201.7%20(latest),label=Ubuntu/ws/plugins/maven-cayenne-plugin/target/cayenneGeneratedClasses/superPkg/_Embeddable.txt>
[INFO] Generating class file: <https://builds.apache.org/job/cayenne-master/cayenneTestConnection=h2,jdk=JDK%201.7%20(latest),label=Ubuntu/ws/plugins/maven-cayenne-plugin/target/cayenneGeneratedClasses/pack/Embeddable.txt>
[INFO] Generating superclass file: <https://builds.apache.org/job/cayenne-master/cayenneTestConnection=h2,jdk=JDK%201.7%20(latest),label=Ubuntu/ws/plugins/maven-cayenne-plugin/target/cayenneGeneratedClasses/superPkg/_TestDomainMap.txt>
[INFO] Generating class file: <https://builds.apache.org/job/cayenne-master/cayenneTestConnection=h2,jdk=JDK%201.7%20(latest),label=Ubuntu/ws/plugins/maven-cayenne-plugin/target/cayenneGeneratedClasses/pack/TestDomainMap.txt>
Tests run: 1, Failures: 0, Errors: 0, Skipped: 0, Time elapsed: 0.797 sec
Running org.apache.cayenne.tools.DbImporterMojoTest
[WARNING] 'meaningfulPk' property is deprecated. Use 'meaningfulPkTables' pattern instead
Tests run: 5, Failures: 0, Errors: 3, Skipped: 0, Time elapsed: 1.159 sec <<< FAILURE!

Results :

Tests in error: 
  testImportNewDataMap(org.apache.cayenne.tools.DbImporterMojoTest)
  testImportAddTableAndColumn(org.apache.cayenne.tools.DbImporterMojoTest)
  testImportWithoutChanges(org.apache.cayenne.tools.DbImporterMojoTest)

Tests run: 6, Failures: 0, Errors: 3, Skipped: 0

[INFO] ------------------------------------------------------------------------
[INFO] Reactor Summary:
[INFO] 
[INFO] Cayenne ........................................... SUCCESS [0.387s]
[INFO] Cayenne Build Tools Parent ........................ SUCCESS [0.013s]
[INFO] Cayenne License and Notice Bundle ................. SUCCESS [3.625s]
[INFO] Common Unit Test Utilities ........................ SUCCESS [1.473s]
[INFO] Cayenne Dependency Injection Container ............ SUCCESS [5.573s]
[INFO] Cayenne Server .................................... SUCCESS [5:52.781s]
[INFO] Cayenne ROP Client ................................ SUCCESS [1:06.143s]
[INFO] Cayenne Project ................................... SUCCESS [2.809s]
[INFO] Cayenne Tools ..................................... SUCCESS [4.661s]
[INFO] Cayenne Lifecycle Utilities ....................... SUCCESS [3.879s]
[INFO] Cayenne Maven Plugins ............................. SUCCESS [0.015s]
[INFO] Cayenne Maven Plugin .............................. FAILURE [4.793s]
[INFO] Cayenne Cryptography Extensions ................... SKIPPED
[INFO] Cayenne Integration Tests Parent .................. SKIPPED
[INFO] Integration Tests - Cayenne Tools ................. SKIPPED
[INFO] Cayenne Modeler Parent ............................ SKIPPED
[INFO] Cayenne WebObjects Compatibility Library .......... SKIPPED
[INFO] Cayenne Modeler ................................... SKIPPED
[INFO] Cayenne Modeler Maven Plugin ...................... SKIPPED
[INFO] Cayenne Tutorial .................................. SKIPPED
[INFO] Cayenne ROP Server Tutorial ....................... SKIPPED
[INFO] Cayenne ROP Client Tutorial ....................... SKIPPED
[INFO] Cayenne Tutorials ................................. SKIPPED
[INFO] Cayenne Documenation Parent ....................... SKIPPED
[INFO] Cayenne Documentation ............................. SKIPPED
[INFO] Cayenne Docbook Documentation ..................... SKIPPED
[INFO] Docbook: Cayenne Stylesheets ...................... SKIPPED
[INFO] Docbook: Cayenne Guide ............................ SKIPPED
[INFO] Docbook: Getting Started with Cayenne ............. SKIPPED
[INFO] Docbook: Getting Started with Cayenne ROP ......... SKIPPED
[INFO] Docbook: Cayenne New Features and Upgrade Guide ... SKIPPED
[INFO] ------------------------------------------------------------------------
[INFO] BUILD FAILURE
[INFO] ------------------------------------------------------------------------
[INFO] Total time: 7:27.135s
[INFO] Finished at: Sat Sep 20 07:56:23 UTC 2014
[INFO] Final Memory: 84M/376M
[INFO] ------------------------------------------------------------------------
[ERROR] Failed to execute goal org.apache.maven.plugins:maven-surefire-plugin:2.5:test (default-test)
on project maven-cayenne-plugin: There are test failures.
[ERROR] 
[ERROR] Please refer to <https://builds.apache.org/job/cayenne-master/cayenneTestConnection=h2,jdk=JDK%201.7%20(latest),label=Ubuntu/ws/plugins/maven-cayenne-plugin/target/surefire-reports>
for the individual test results.
[ERROR] -> [Help 1]
org.apache.maven.lifecycle.LifecycleExecutionException: Failed to execute goal org.apache.maven.plugins:maven-surefire-plugin:2.5:test
(default-test) on project maven-cayenne-plugin: There are test failures.

Please refer to <https://builds.apache.org/job/cayenne-master/cayenneTestConnection=h2,jdk=JDK%201.7%20(latest),label=Ubuntu/ws/plugins/maven-cayenne-plugin/target/surefire-reports>
for the individual test results.
	at org.apache.maven.lifecycle.internal.MojoExecutor.execute(MojoExecutor.java:213)
	at org.apache.maven.lifecycle.internal.MojoExecutor.execute(MojoExecutor.java:153)
	at org.apache.maven.lifecycle.internal.MojoExecutor.execute(MojoExecutor.java:145)
	at org.apache.maven.lifecycle.internal.LifecycleModuleBuilder.buildProject(LifecycleModuleBuilder.java:84)
	at org.apache.maven.lifecycle.internal.LifecycleModuleBuilder.buildProject(LifecycleModuleBuilder.java:59)
	at org.apache.maven.lifecycle.internal.LifecycleStarter.singleThreadedBuild(LifecycleStarter.java:183)
	at org.apache.maven.lifecycle.internal.LifecycleStarter.execute(LifecycleStarter.java:161)
	at org.apache.maven.DefaultMaven.doExecute(DefaultMaven.java:320)
	at org.apache.maven.DefaultMaven.execute(DefaultMaven.java:156)
	at org.apache.maven.cli.MavenCli.execute(MavenCli.java:537)
	at org.apache.maven.cli.MavenCli.doMain(MavenCli.java:196)
	at org.apache.maven.cli.MavenCli.main(MavenCli.java:141)
	at sun.reflect.NativeMethodAccessorImpl.invoke0(Native Method)
	at sun.reflect.NativeMethodAccessorImpl.invoke(NativeMethodAccessorImpl.java:57)
	at sun.reflect.DelegatingMethodAccessorImpl.invoke(DelegatingMethodAccessorImpl.java:43)
	at java.lang.reflect.Method.invoke(Method.java:606)
	at org.codehaus.plexus.classworlds.launcher.Launcher.launchEnhanced(Launcher.java:290)
	at org.codehaus.plexus.classworlds.launcher.Launcher.launch(Launcher.java:230)
	at org.codehaus.plexus.classworlds.launcher.Launcher.mainWithExitCode(Launcher.java:409)
	at org.codehaus.plexus.classworlds.launcher.Launcher.main(Launcher.java:352)
Caused by: org.apache.maven.plugin.MojoFailureException: There are test failures.

Please refer to <https://builds.apache.org/job/cayenne-master/cayenneTestConnection=h2,jdk=JDK%201.7%20(latest),label=Ubuntu/ws/plugins/maven-cayenne-plugin/target/surefire-reports>
for the individual test results.
	at org.apache.maven.plugin.surefire.SurefirePlugin.execute(SurefirePlugin.java:629)
	at org.apache.maven.plugin.DefaultBuildPluginManager.executeMojo(DefaultBuildPluginManager.java:101)
	at org.apache.maven.lifecycle.internal.MojoExecutor.execute(MojoExecutor.java:209)
	... 19 more
[ERROR] 
[ERROR] Re-run Maven using the -X switch to enable full debug logging.
[ERROR] 
[ERROR] For more information about the errors and possible solutions, please read the following
articles:
[ERROR] [Help 1] http://cwiki.apache.org/confluence/display/MAVEN/MojoFailureException
[ERROR] 
[ERROR] After correcting the problems, you can resume the build with the command
[ERROR]   mvn <goals> -rf :maven-cayenne-plugin
Build step 'Invoke top-level Maven targets' marked build as failure

Mime
View raw message