cayenne-commits mailing list archives

Site index · List index
Message view « Date » · « Thread »
Top « Date » · « Thread »
From Apache Jenkins Server <jenk...@builds.apache.org>
Subject Build failed in Jenkins: cayenne-master » h2,JDK 1.7 (latest),Ubuntu #44
Date Sat, 20 Sep 2014 14:29:49 GMT
See <https://builds.apache.org/job/cayenne-master/cayenneTestConnection=h2,jdk=JDK%201.7%20(latest),label=Ubuntu/44/changes>

Changes:

[aadamchik] resolving a release snag and removing profile conditions from top level of the
build

------------------------------------------
[...truncated 101625 lines...]
74/172 KB   
78/172 KB   
82/172 KB   
85/172 KB   
89/172 KB   
93/172 KB   
97/172 KB   
101/172 KB   
105/172 KB   
109/172 KB   
111/172 KB   
115/172 KB   
119/172 KB   
123/172 KB   
123/172 KB   
127/172 KB   
131/172 KB   
135/172 KB   
138/172 KB   
142/172 KB   
146/172 KB   
150/172 KB   
154/172 KB   
158/172 KB   
162/172 KB   
166/172 KB   
166/172 KB   
170/172 KB   
172/172 KB   
172/172 KB   4/237 KB   
172/172 KB   6/237 KB   
172/172 KB   10/237 KB   
172/172 KB   11/237 KB   
172/172 KB   15/237 KB   
172/172 KB   19/237 KB   
172/172 KB   23/237 KB   
172/172 KB   27/237 KB   
172/172 KB   31/237 KB   
172/172 KB   35/237 KB   
172/172 KB   39/237 KB   
172/172 KB   43/237 KB   
172/172 KB   47/237 KB   
172/172 KB   51/237 KB   
172/172 KB   55/237 KB   
172/172 KB   59/237 KB   
172/172 KB   63/237 KB   
172/172 KB   63/237 KB   
172/172 KB   67/237 KB   
172/172 KB   71/237 KB   
172/172 KB   75/237 KB   
172/172 KB   79/237 KB   
172/172 KB   83/237 KB   
172/172 KB   87/237 KB   
                         
Downloaded: http://maven.objectstyle.org/nexus/content/groups/cayenne-deps/com/thoughtworks/qdox/qdox/1.11/qdox-1.11.jar
(172 KB at 1717.0 KB/sec)
89/237 KB                
93/237 KB   
97/237 KB   
101/237 KB   
105/237 KB   
106/237 KB   
110/237 KB   
114/237 KB   
118/237 KB   
122/237 KB   
126/237 KB   
130/237 KB   
134/237 KB   
138/237 KB   
142/237 KB   
146/237 KB   
150/237 KB   
154/237 KB   
158/237 KB   
158/237 KB   
162/237 KB   
166/237 KB   
170/237 KB   
174/237 KB   
178/237 KB   
182/237 KB   
186/237 KB   
190/237 KB   
194/237 KB   
198/237 KB   
202/237 KB   
205/237 KB   
209/237 KB   
213/237 KB   
217/237 KB   
221/237 KB   
222/237 KB   
226/237 KB   
230/237 KB   
234/237 KB   
236/237 KB   
237/237 KB   
             
Downloaded: http://maven.objectstyle.org/nexus/content/groups/cayenne-deps/bsh/bsh/1.3.0/bsh-1.3.0.jar
(237 KB at 1833.2 KB/sec)
[ERROR] 

Artifact Ids of the format maven-___-plugin are reserved for 
plugins in the Group Id org.apache.maven.plugins
Please change your artifactId to the format ___-maven-plugin
In the future this error will break the build.


[WARNING] Using platform encoding (UTF-8 actually) to read mojo metadata, i.e. build is platform
dependent!
[INFO] Applying mojo extractor for language: java
[INFO] Mojo extractor for language: java found 3 mojo descriptors.
[INFO] Applying mojo extractor for language: bsh
[INFO] Mojo extractor for language: bsh found 0 mojo descriptors.
[INFO] 
[INFO] --- maven-remote-resources-plugin:1.5:process (default) @ maven-cayenne-plugin ---
[INFO] 
[INFO] --- maven-resources-plugin:2.4.3:resources (default-resources) @ maven-cayenne-plugin
---
[INFO] Using 'UTF-8' encoding to copy filtered resources.
[INFO] Copying 1 resource
[INFO] Copying 4 resources
[INFO] 
[INFO] --- maven-compiler-plugin:2.3.2:compile (default-compile) @ maven-cayenne-plugin ---
[INFO] Compiling 4 source files to <https://builds.apache.org/job/cayenne-master/cayenneTestConnection=h2,jdk=JDK%201.7%20(latest),label=Ubuntu/ws/plugins/maven-cayenne-plugin/target/classes>
[INFO] 
[INFO] --- maven-resources-plugin:2.4.3:testResources (default-testResources) @ maven-cayenne-plugin
---
[INFO] Using 'UTF-8' encoding to copy filtered resources.
[INFO] Copying 17 resources
[INFO] Copying 8 resources
[INFO] 
[INFO] --- maven-compiler-plugin:2.3.2:testCompile (default-testCompile) @ maven-cayenne-plugin
---
[INFO] Compiling 2 source files to <https://builds.apache.org/job/cayenne-master/cayenneTestConnection=h2,jdk=JDK%201.7%20(latest),label=Ubuntu/ws/plugins/maven-cayenne-plugin/target/test-classes>
[INFO] 
[INFO] --- maven-surefire-plugin:2.5:test (default-test) @ maven-cayenne-plugin ---
[INFO] Surefire report directory: <https://builds.apache.org/job/cayenne-master/cayenneTestConnection=h2,jdk=JDK%201.7%20(latest),label=Ubuntu/ws/plugins/maven-cayenne-plugin/target/surefire-reports>

-------------------------------------------------------
 T E S T S
-------------------------------------------------------
Running org.apache.cayenne.tools.CayenneGeneratorMojoTest
[INFO] Generating superclass file: <https://builds.apache.org/job/cayenne-master/cayenneTestConnection=h2,jdk=JDK%201.7%20(latest),label=Ubuntu/ws/plugins/maven-cayenne-plugin/target/cayenneGeneratedClasses/superPkg/_TestEntity.txt>
[INFO] Generating class file: <https://builds.apache.org/job/cayenne-master/cayenneTestConnection=h2,jdk=JDK%201.7%20(latest),label=Ubuntu/ws/plugins/maven-cayenne-plugin/target/cayenneGeneratedClasses/pack/TestEntity.txt>
[INFO] Generating superclass file: <https://builds.apache.org/job/cayenne-master/cayenneTestConnection=h2,jdk=JDK%201.7%20(latest),label=Ubuntu/ws/plugins/maven-cayenne-plugin/target/cayenneGeneratedClasses/superPkg/_Embeddable.txt>
[INFO] Generating class file: <https://builds.apache.org/job/cayenne-master/cayenneTestConnection=h2,jdk=JDK%201.7%20(latest),label=Ubuntu/ws/plugins/maven-cayenne-plugin/target/cayenneGeneratedClasses/pack/Embeddable.txt>
[INFO] Generating superclass file: <https://builds.apache.org/job/cayenne-master/cayenneTestConnection=h2,jdk=JDK%201.7%20(latest),label=Ubuntu/ws/plugins/maven-cayenne-plugin/target/cayenneGeneratedClasses/superPkg/_TestDomainMap.txt>
[INFO] Generating class file: <https://builds.apache.org/job/cayenne-master/cayenneTestConnection=h2,jdk=JDK%201.7%20(latest),label=Ubuntu/ws/plugins/maven-cayenne-plugin/target/cayenneGeneratedClasses/pack/TestDomainMap.txt>
Tests run: 1, Failures: 0, Errors: 0, Skipped: 0, Time elapsed: 0.813 sec
Running org.apache.cayenne.tools.DbImporterMojoTest
[WARNING] 'meaningfulPk' property is deprecated. Use 'meaningfulPkTables' pattern instead
Tests run: 5, Failures: 0, Errors: 3, Skipped: 0, Time elapsed: 1.178 sec <<< FAILURE!

Results :

Tests in error: 
  testImportNewDataMap(org.apache.cayenne.tools.DbImporterMojoTest)
  testImportAddTableAndColumn(org.apache.cayenne.tools.DbImporterMojoTest)
  testImportWithoutChanges(org.apache.cayenne.tools.DbImporterMojoTest)

Tests run: 6, Failures: 0, Errors: 3, Skipped: 0

[INFO] ------------------------------------------------------------------------
[INFO] Reactor Summary:
[INFO] 
[INFO] Cayenne ........................................... SUCCESS [2.548s]
[INFO] Cayenne Build Tools Parent ........................ SUCCESS [0.015s]
[INFO] Cayenne License and Notice Bundle ................. SUCCESS [7.094s]
[INFO] Common Unit Test Utilities ........................ SUCCESS [1.386s]
[INFO] Cayenne Dependency Injection Container ............ SUCCESS [5.317s]
[INFO] Cayenne Server .................................... SUCCESS [4:36.889s]
[INFO] Cayenne ROP Client ................................ SUCCESS [57.387s]
[INFO] Cayenne Project ................................... SUCCESS [2.787s]
[INFO] Cayenne Tools ..................................... SUCCESS [5.858s]
[INFO] Cayenne Lifecycle Utilities ....................... SUCCESS [4.346s]
[INFO] Cayenne Maven Plugins ............................. SUCCESS [0.015s]
[INFO] Cayenne Maven Plugin .............................. FAILURE [10.393s]
[INFO] Cayenne Cryptography Extensions ................... SKIPPED
[INFO] Cayenne Integration Tests Parent .................. SKIPPED
[INFO] Integration Tests - Cayenne Tools ................. SKIPPED
[INFO] Cayenne Modeler Parent ............................ SKIPPED
[INFO] Cayenne WebObjects Compatibility Library .......... SKIPPED
[INFO] Cayenne Modeler ................................... SKIPPED
[INFO] Cayenne Modeler Generic and Windows Extensions .... SKIPPED
[INFO] Cayenne Modeler Generic ........................... SKIPPED
[INFO] Cayenne Modeler Mac OS X Extensions ............... SKIPPED
[INFO] Cayenne Modeler Mac OS X .......................... SKIPPED
[INFO] Cayenne Modeler Mac OS X - Old Apple Java ......... SKIPPED
[INFO] Cayenne Modeler Windows ........................... SKIPPED
[INFO] Cayenne Modeler Maven Plugin ...................... SKIPPED
[INFO] Cayenne Tutorial .................................. SKIPPED
[INFO] Cayenne ROP Server Tutorial ....................... SKIPPED
[INFO] Cayenne ROP Client Tutorial ....................... SKIPPED
[INFO] Cayenne Tutorials ................................. SKIPPED
[INFO] Cayenne Documenation Parent ....................... SKIPPED
[INFO] Cayenne Documentation ............................. SKIPPED
[INFO] Cayenne Docbook Documentation ..................... SKIPPED
[INFO] Docbook: Cayenne Stylesheets ...................... SKIPPED
[INFO] Docbook: Cayenne Guide ............................ SKIPPED
[INFO] Docbook: Getting Started with Cayenne ............. SKIPPED
[INFO] Docbook: Getting Started with Cayenne ROP ......... SKIPPED
[INFO] Docbook: Cayenne New Features and Upgrade Guide ... SKIPPED
[INFO] Cayenne Release Assembly .......................... SKIPPED
[INFO] ------------------------------------------------------------------------
[INFO] BUILD FAILURE
[INFO] ------------------------------------------------------------------------
[INFO] Total time: 6:16.408s
[INFO] Finished at: Sat Sep 20 14:28:37 UTC 2014
[INFO] Final Memory: 85M/386M
[INFO] ------------------------------------------------------------------------
[ERROR] Failed to execute goal org.apache.maven.plugins:maven-surefire-plugin:2.5:test (default-test)
on project maven-cayenne-plugin: There are test failures.
[ERROR] 
[ERROR] Please refer to <https://builds.apache.org/job/cayenne-master/cayenneTestConnection=h2,jdk=JDK%201.7%20(latest),label=Ubuntu/ws/plugins/maven-cayenne-plugin/target/surefire-reports>
for the individual test results.
[ERROR] -> [Help 1]
org.apache.maven.lifecycle.LifecycleExecutionException: Failed to execute goal org.apache.maven.plugins:maven-surefire-plugin:2.5:test
(default-test) on project maven-cayenne-plugin: There are test failures.

Please refer to <https://builds.apache.org/job/cayenne-master/cayenneTestConnection=h2,jdk=JDK%201.7%20(latest),label=Ubuntu/ws/plugins/maven-cayenne-plugin/target/surefire-reports>
for the individual test results.
	at org.apache.maven.lifecycle.internal.MojoExecutor.execute(MojoExecutor.java:213)
	at org.apache.maven.lifecycle.internal.MojoExecutor.execute(MojoExecutor.java:153)
	at org.apache.maven.lifecycle.internal.MojoExecutor.execute(MojoExecutor.java:145)
	at org.apache.maven.lifecycle.internal.LifecycleModuleBuilder.buildProject(LifecycleModuleBuilder.java:84)
	at org.apache.maven.lifecycle.internal.LifecycleModuleBuilder.buildProject(LifecycleModuleBuilder.java:59)
	at org.apache.maven.lifecycle.internal.LifecycleStarter.singleThreadedBuild(LifecycleStarter.java:183)
	at org.apache.maven.lifecycle.internal.LifecycleStarter.execute(LifecycleStarter.java:161)
	at org.apache.maven.DefaultMaven.doExecute(DefaultMaven.java:320)
	at org.apache.maven.DefaultMaven.execute(DefaultMaven.java:156)
	at org.apache.maven.cli.MavenCli.execute(MavenCli.java:537)
	at org.apache.maven.cli.MavenCli.doMain(MavenCli.java:196)
	at org.apache.maven.cli.MavenCli.main(MavenCli.java:141)
	at sun.reflect.NativeMethodAccessorImpl.invoke0(Native Method)
	at sun.reflect.NativeMethodAccessorImpl.invoke(NativeMethodAccessorImpl.java:57)
	at sun.reflect.DelegatingMethodAccessorImpl.invoke(DelegatingMethodAccessorImpl.java:43)
	at java.lang.reflect.Method.invoke(Method.java:606)
	at org.codehaus.plexus.classworlds.launcher.Launcher.launchEnhanced(Launcher.java:290)
	at org.codehaus.plexus.classworlds.launcher.Launcher.launch(Launcher.java:230)
	at org.codehaus.plexus.classworlds.launcher.Launcher.mainWithExitCode(Launcher.java:409)
	at org.codehaus.plexus.classworlds.launcher.Launcher.main(Launcher.java:352)
Caused by: org.apache.maven.plugin.MojoFailureException: There are test failures.

Please refer to <https://builds.apache.org/job/cayenne-master/cayenneTestConnection=h2,jdk=JDK%201.7%20(latest),label=Ubuntu/ws/plugins/maven-cayenne-plugin/target/surefire-reports>
for the individual test results.
	at org.apache.maven.plugin.surefire.SurefirePlugin.execute(SurefirePlugin.java:629)
	at org.apache.maven.plugin.DefaultBuildPluginManager.executeMojo(DefaultBuildPluginManager.java:101)
	at org.apache.maven.lifecycle.internal.MojoExecutor.execute(MojoExecutor.java:209)
	... 19 more
[ERROR] 
[ERROR] Re-run Maven using the -X switch to enable full debug logging.
[ERROR] 
[ERROR] For more information about the errors and possible solutions, please read the following
articles:
[ERROR] [Help 1] http://cwiki.apache.org/confluence/display/MAVEN/MojoFailureException
[ERROR] 
[ERROR] After correcting the problems, you can resume the build with the command
[ERROR]   mvn <goals> -rf :maven-cayenne-plugin
Build step 'Invoke top-level Maven targets' marked build as failure

Mime
View raw message