cayenne-commits mailing list archives

Site index · List index
Message view « Date » · « Thread »
Top « Date » · « Thread »
From Apache Jenkins Server <jenk...@builds.apache.org>
Subject Build failed in Jenkins: cayenne-master » h2,JDK 1.7 (latest),Ubuntu #33
Date Wed, 10 Sep 2014 07:31:42 GMT
See <https://builds.apache.org/job/cayenne-master/cayenneTestConnection=h2,jdk=JDK%201.7%20(latest),label=Ubuntu/33/changes>

Changes:

[aadamchik] CAY-1953 Redo ResultIteratorCallback to handle single row callback instead of
iterator

------------------------------------------
[...truncated 89380 lines...]
Sep 10, 2014 7:29:44 AM org.apache.cayenne.configuration.XMLDataChannelDescriptorLoader$DataChannelChildrenHandler
createChildTagHandler
INFO: Loading XML DataMap resource from <https://builds.apache.org/job/cayenne-master/cayenneTestConnection=h2,jdk=JDK%201.7%20(latest),label=Ubuntu/ws/cayenne-lifecycle/target/test-classes/lifecycle-map.map.xml>
Sep 10, 2014 7:29:44 AM org.apache.cayenne.configuration.XMLDataChannelDescriptorLoader$DataSourceChildrenHandler
createChildTagHandler
INFO: loading user name and password.
Sep 10, 2014 7:29:44 AM org.apache.cayenne.configuration.server.DataDomainProvider createAndInitDataDomain
INFO: setting DataNode 'lifecycle-db' as default, used by all unlinked DataMaps
Sep 10, 2014 7:29:44 AM org.apache.cayenne.test.jdbc.UtilityLogger log
INFO: delete from E1
Sep 10, 2014 7:29:44 AM org.apache.cayenne.log.CommonsJdbcEventLogger logConnect
INFO: Opening connection: jdbc:hsqldb:mem:lifecycle
	Login: sa
	Password: *******
Sep 10, 2014 7:29:44 AM org.apache.cayenne.log.CommonsJdbcEventLogger logConnectSuccess
INFO: +++ Connecting: SUCCESS.
Sep 10, 2014 7:29:44 AM org.apache.cayenne.log.CommonsJdbcEventLogger log
INFO: Detected and installed adapter: org.apache.cayenne.dba.hsqldb.HSQLDBAdapter
Sep 10, 2014 7:29:44 AM org.apache.cayenne.access.dbsync.CreateIfNoSchemaStrategy processSchemaUpdate
INFO: Full or partial schema detected, skipping tables creation
Sep 10, 2014 7:29:44 AM org.apache.cayenne.test.jdbc.UtilityLogger log
INFO: INSERT INTO E1 (ID) VALUES (?)
Sep 10, 2014 7:29:44 AM org.apache.cayenne.test.jdbc.UtilityLogger log
INFO: INSERT INTO E1 (ID) VALUES (?)
Sep 10, 2014 7:29:44 AM org.apache.cayenne.log.CommonsJdbcEventLogger logBeginTransaction
INFO: --- transaction started.
Sep 10, 2014 7:29:44 AM org.apache.cayenne.log.CommonsJdbcEventLogger logQuery
INFO: SELECT t0.ID FROM E1 t0 WHERE (t0.ID = ?) OR (t0.ID = ?) OR (t0.ID = ?) [bind: 1->ID:4,
2->ID:5, 3->ID:3]
Sep 10, 2014 7:29:44 AM org.apache.cayenne.log.CommonsJdbcEventLogger logSelectCount
INFO: === returned 2 rows. - took 1 ms.
Sep 10, 2014 7:29:44 AM org.apache.cayenne.log.CommonsJdbcEventLogger logCommitTransaction
INFO: +++ transaction committed.
Sep 10, 2014 7:29:44 AM org.apache.cayenne.configuration.XMLDataChannelDescriptorLoader load
INFO: Loading XML configuration resource from <https://builds.apache.org/job/cayenne-master/cayenneTestConnection=h2,jdk=JDK%201.7%20(latest),label=Ubuntu/ws/cayenne-lifecycle/target/test-classes/cayenne-lifecycle.xml>
Sep 10, 2014 7:29:44 AM org.apache.cayenne.configuration.XMLDataChannelDescriptorLoader$DataChannelChildrenHandler
createChildTagHandler
INFO: Loading XML DataMap resource from <https://builds.apache.org/job/cayenne-master/cayenneTestConnection=h2,jdk=JDK%201.7%20(latest),label=Ubuntu/ws/cayenne-lifecycle/target/test-classes/lifecycle-map.map.xml>
Sep 10, 2014 7:29:44 AM org.apache.cayenne.configuration.XMLDataChannelDescriptorLoader$DataSourceChildrenHandler
createChildTagHandler
INFO: loading user name and password.
Sep 10, 2014 7:29:44 AM org.apache.cayenne.configuration.server.DataDomainProvider createAndInitDataDomain
INFO: setting DataNode 'lifecycle-db' as default, used by all unlinked DataMaps
Tests run: 3, Failures: 0, Errors: 0, Skipped: 0, Time elapsed: 0.082 sec

Results :

Tests run: 31, Failures: 0, Errors: 0, Skipped: 0

[INFO] 
[INFO] --- maven-jar-plugin:2.3.2:jar (default-jar) @ cayenne-lifecycle ---
[INFO] Building jar: <https://builds.apache.org/job/cayenne-master/cayenneTestConnection=h2,jdk=JDK%201.7%20(latest),label=Ubuntu/ws/cayenne-lifecycle/target/cayenne-lifecycle-3.2.M2-SNAPSHOT.jar>
[INFO] 
[INFO] >>> maven-source-plugin:2.1.2:jar (bundle-source-jar) @ cayenne-lifecycle
>>>
[INFO] 
[INFO] <<< maven-source-plugin:2.1.2:jar (bundle-source-jar) @ cayenne-lifecycle
<<<
[INFO] 
[INFO] --- maven-source-plugin:2.1.2:jar (bundle-source-jar) @ cayenne-lifecycle ---
[INFO] org already added, skipping
[INFO] org/apache already added, skipping
[INFO] org/apache/cayenne already added, skipping
[INFO] org/apache/cayenne/lifecycle already added, skipping
[INFO] org/apache/cayenne/lifecycle/sort already added, skipping
[INFO] org/apache/cayenne/lifecycle/audit already added, skipping
[INFO] org/apache/cayenne/lifecycle/id already added, skipping
[INFO] org/apache/cayenne/lifecycle/cache already added, skipping
[INFO] org/apache/cayenne/lifecycle/changeset already added, skipping
[INFO] org/apache/cayenne/lifecycle/relationship already added, skipping
[INFO] Building jar: <https://builds.apache.org/job/cayenne-master/cayenneTestConnection=h2,jdk=JDK%201.7%20(latest),label=Ubuntu/ws/cayenne-lifecycle/target/cayenne-lifecycle-3.2.M2-SNAPSHOT-sources.jar>
[INFO] org already added, skipping
[INFO] org/apache already added, skipping
[INFO] org/apache/cayenne already added, skipping
[INFO] org/apache/cayenne/lifecycle already added, skipping
[INFO] org/apache/cayenne/lifecycle/sort already added, skipping
[INFO] org/apache/cayenne/lifecycle/audit already added, skipping
[INFO] org/apache/cayenne/lifecycle/id already added, skipping
[INFO] org/apache/cayenne/lifecycle/cache already added, skipping
[INFO] org/apache/cayenne/lifecycle/changeset already added, skipping
[INFO] org/apache/cayenne/lifecycle/relationship already added, skipping
[INFO] 
[INFO] --- maven-install-plugin:2.3.1:install (default-install) @ cayenne-lifecycle ---
[INFO] Installing <https://builds.apache.org/job/cayenne-master/cayenneTestConnection=h2,jdk=JDK%201.7%20(latest),label=Ubuntu/ws/cayenne-lifecycle/target/cayenne-lifecycle-3.2.M2-SNAPSHOT.jar>
to /home/jenkins/.m2/repository/org/apache/cayenne/cayenne-lifecycle/3.2.M2-SNAPSHOT/cayenne-lifecycle-3.2.M2-SNAPSHOT.jar
[INFO] Installing <https://builds.apache.org/job/cayenne-master/cayenneTestConnection=h2,jdk=JDK%201.7%20(latest),label=Ubuntu/ws/cayenne-lifecycle/pom.xml>
to /home/jenkins/.m2/repository/org/apache/cayenne/cayenne-lifecycle/3.2.M2-SNAPSHOT/cayenne-lifecycle-3.2.M2-SNAPSHOT.pom
[INFO] Installing <https://builds.apache.org/job/cayenne-master/cayenneTestConnection=h2,jdk=JDK%201.7%20(latest),label=Ubuntu/ws/cayenne-lifecycle/target/cayenne-lifecycle-3.2.M2-SNAPSHOT-sources.jar>
to /home/jenkins/.m2/repository/org/apache/cayenne/cayenne-lifecycle/3.2.M2-SNAPSHOT/cayenne-lifecycle-3.2.M2-SNAPSHOT-sources.jar
[INFO]                                                                         
[INFO] ------------------------------------------------------------------------
[INFO] Building Cayenne Maven Plugins 3.2.M2-SNAPSHOT
[INFO] ------------------------------------------------------------------------
[INFO] 
[INFO] --- maven-clean-plugin:2.4.1:clean (default-clean) @ cayenne-plugins-parent ---
[INFO] Deleting <https://builds.apache.org/job/cayenne-master/cayenneTestConnection=h2,jdk=JDK%201.7%20(latest),label=Ubuntu/ws/plugins/target>
[INFO] 
[INFO] --- maven-remote-resources-plugin:1.5:process (default) @ cayenne-plugins-parent ---
[INFO] 
[INFO] >>> maven-source-plugin:2.1.2:jar (bundle-source-jar) @ cayenne-plugins-parent
>>>
[INFO] 
[INFO] <<< maven-source-plugin:2.1.2:jar (bundle-source-jar) @ cayenne-plugins-parent
<<<
[INFO] 
[INFO] --- maven-source-plugin:2.1.2:jar (bundle-source-jar) @ cayenne-plugins-parent ---
[INFO] 
[INFO] --- maven-install-plugin:2.3.1:install (default-install) @ cayenne-plugins-parent ---
[INFO] Installing <https://builds.apache.org/job/cayenne-master/cayenneTestConnection=h2,jdk=JDK%201.7%20(latest),label=Ubuntu/ws/plugins/pom.xml>
to /home/jenkins/.m2/repository/org/apache/cayenne/plugins/cayenne-plugins-parent/3.2.M2-SNAPSHOT/cayenne-plugins-parent-3.2.M2-SNAPSHOT.pom
[INFO]                                                                         
[INFO] ------------------------------------------------------------------------
[INFO] Building Cayenne Maven Plugin 3.2.M2-SNAPSHOT
[INFO] ------------------------------------------------------------------------
[INFO] 
[INFO] --- maven-clean-plugin:2.4.1:clean (default-clean) @ maven-cayenne-plugin ---
[INFO] Deleting <https://builds.apache.org/job/cayenne-master/cayenneTestConnection=h2,jdk=JDK%201.7%20(latest),label=Ubuntu/ws/plugins/maven-cayenne-plugin/target>
[INFO] 
[INFO] --- maven-plugin-plugin:2.9:descriptor (default-descriptor) @ maven-cayenne-plugin
---
[ERROR] 

Artifact Ids of the format maven-___-plugin are reserved for 
plugins in the Group Id org.apache.maven.plugins
Please change your artifactId to the format ___-maven-plugin
In the future this error will break the build.


[WARNING] Using platform encoding (ANSI_X3.4-1968 actually) to read mojo metadata, i.e. build
is platform dependent!
[INFO] Applying mojo extractor for language: java
[INFO] Mojo extractor for language: java found 3 mojo descriptors.
[INFO] Applying mojo extractor for language: bsh
[INFO] Mojo extractor for language: bsh found 0 mojo descriptors.
[INFO] 
[INFO] --- maven-remote-resources-plugin:1.5:process (default) @ maven-cayenne-plugin ---
[INFO] 
[INFO] --- maven-resources-plugin:2.4.3:resources (default-resources) @ maven-cayenne-plugin
---
[INFO] Using 'UTF-8' encoding to copy filtered resources.
[INFO] Copying 1 resource
[INFO] Copying 4 resources
[INFO] 
[INFO] --- maven-compiler-plugin:2.3.2:compile (default-compile) @ maven-cayenne-plugin ---
[INFO] Compiling 4 source files to <https://builds.apache.org/job/cayenne-master/cayenneTestConnection=h2,jdk=JDK%201.7%20(latest),label=Ubuntu/ws/plugins/maven-cayenne-plugin/target/classes>
[INFO] 
[INFO] --- maven-resources-plugin:2.4.3:testResources (default-testResources) @ maven-cayenne-plugin
---
[INFO] Using 'UTF-8' encoding to copy filtered resources.
[INFO] Copying 17 resources
[INFO] Copying 8 resources
[INFO] 
[INFO] --- maven-compiler-plugin:2.3.2:testCompile (default-testCompile) @ maven-cayenne-plugin
---
[INFO] Compiling 2 source files to <https://builds.apache.org/job/cayenne-master/cayenneTestConnection=h2,jdk=JDK%201.7%20(latest),label=Ubuntu/ws/plugins/maven-cayenne-plugin/target/test-classes>
[INFO] 
[INFO] --- maven-surefire-plugin:2.5:test (default-test) @ maven-cayenne-plugin ---
[INFO] Surefire report directory: <https://builds.apache.org/job/cayenne-master/cayenneTestConnection=h2,jdk=JDK%201.7%20(latest),label=Ubuntu/ws/plugins/maven-cayenne-plugin/target/surefire-reports>

-------------------------------------------------------
 T E S T S
-------------------------------------------------------
Running org.apache.cayenne.tools.CayenneGeneratorMojoTest
[INFO] Generating superclass file: <https://builds.apache.org/job/cayenne-master/cayenneTestConnection=h2,jdk=JDK%201.7%20(latest),label=Ubuntu/ws/plugins/maven-cayenne-plugin/target/cayenneGeneratedClasses/superPkg/_TestEntity.txt>
[INFO] Generating class file: <https://builds.apache.org/job/cayenne-master/cayenneTestConnection=h2,jdk=JDK%201.7%20(latest),label=Ubuntu/ws/plugins/maven-cayenne-plugin/target/cayenneGeneratedClasses/pack/TestEntity.txt>
[INFO] Generating superclass file: <https://builds.apache.org/job/cayenne-master/cayenneTestConnection=h2,jdk=JDK%201.7%20(latest),label=Ubuntu/ws/plugins/maven-cayenne-plugin/target/cayenneGeneratedClasses/superPkg/_Embeddable.txt>
[INFO] Generating class file: <https://builds.apache.org/job/cayenne-master/cayenneTestConnection=h2,jdk=JDK%201.7%20(latest),label=Ubuntu/ws/plugins/maven-cayenne-plugin/target/cayenneGeneratedClasses/pack/Embeddable.txt>
[INFO] Generating superclass file: <https://builds.apache.org/job/cayenne-master/cayenneTestConnection=h2,jdk=JDK%201.7%20(latest),label=Ubuntu/ws/plugins/maven-cayenne-plugin/target/cayenneGeneratedClasses/superPkg/_TestDomainMap.txt>
[INFO] Generating class file: <https://builds.apache.org/job/cayenne-master/cayenneTestConnection=h2,jdk=JDK%201.7%20(latest),label=Ubuntu/ws/plugins/maven-cayenne-plugin/target/cayenneGeneratedClasses/pack/TestDomainMap.txt>
Tests run: 1, Failures: 0, Errors: 0, Skipped: 0, Time elapsed: 0.842 sec
Running org.apache.cayenne.tools.DbImporterMojoTest
[WARNING] 'meaningfulPk' property is deprecated. Use 'meaningfulPkTables' pattern instead
Tests run: 5, Failures: 0, Errors: 3, Skipped: 0, Time elapsed: 1.27 sec <<< FAILURE!

Results :

Tests in error: 
  testImportNewDataMap(org.apache.cayenne.tools.DbImporterMojoTest)
  testImportAddTableAndColumn(org.apache.cayenne.tools.DbImporterMojoTest)
  testImportWithoutChanges(org.apache.cayenne.tools.DbImporterMojoTest)

Tests run: 6, Failures: 0, Errors: 3, Skipped: 0

[INFO] ------------------------------------------------------------------------
[INFO] Reactor Summary:
[INFO] 
[INFO] Cayenne ........................................... SUCCESS [0.569s]
[INFO] Cayenne Build Tools Parent ........................ SUCCESS [0.014s]
[INFO] Cayenne License and Notice Bundle ................. SUCCESS [2.226s]
[INFO] Common Unit Test Utilities ........................ SUCCESS [0.984s]
[INFO] Cayenne Dependency Injection Container ............ SUCCESS [4.082s]
[INFO] Cayenne Server .................................... SUCCESS [6:18.422s]
[INFO] Cayenne ROP Client ................................ SUCCESS [59.138s]
[INFO] Cayenne Project ................................... SUCCESS [3.207s]
[INFO] Cayenne Tools ..................................... SUCCESS [5.286s]
[INFO] Cayenne Lifecycle Utilities ....................... SUCCESS [4.205s]
[INFO] Cayenne Maven Plugins ............................. SUCCESS [0.031s]
[INFO] Cayenne Maven Plugin .............................. FAILURE [6.275s]
[INFO] Cayenne Cryptography Extensions ................... SKIPPED
[INFO] Cayenne Integration Tests Parent .................. SKIPPED
[INFO] Integration Tests - Cayenne Tools ................. SKIPPED
[INFO] Cayenne Modeler Parent ............................ SKIPPED
[INFO] Cayenne WebObjects Compatibility Library .......... SKIPPED
[INFO] Cayenne Modeler ................................... SKIPPED
[INFO] Cayenne Modeler Maven Plugin ...................... SKIPPED
[INFO] Cayenne Tutorial .................................. SKIPPED
[INFO] Cayenne ROP Server Tutorial ....................... SKIPPED
[INFO] Cayenne ROP Client Tutorial ....................... SKIPPED
[INFO] Cayenne Tutorials ................................. SKIPPED
[INFO] Cayenne Documenation Parent ....................... SKIPPED
[INFO] Cayenne Documentation ............................. SKIPPED
[INFO] Cayenne Docbook Documentation ..................... SKIPPED
[INFO] Docbook: Cayenne Stylesheets ...................... SKIPPED
[INFO] Docbook: Cayenne Guide ............................ SKIPPED
[INFO] Docbook: Getting Started with Cayenne ............. SKIPPED
[INFO] Docbook: Getting Started with Cayenne ROP ......... SKIPPED
[INFO] Docbook: Cayenne New Features and Upgrade Guide ... SKIPPED
[INFO] ------------------------------------------------------------------------
[INFO] BUILD FAILURE
[INFO] ------------------------------------------------------------------------
[INFO] Total time: 7:45.760s
[INFO] Finished at: Wed Sep 10 07:29:51 UTC 2014
[INFO] Final Memory: 84M/397M
[INFO] ------------------------------------------------------------------------
[ERROR] Failed to execute goal org.apache.maven.plugins:maven-surefire-plugin:2.5:test (default-test)
on project maven-cayenne-plugin: There are test failures.
[ERROR] 
[ERROR] Please refer to <https://builds.apache.org/job/cayenne-master/cayenneTestConnection=h2,jdk=JDK%201.7%20(latest),label=Ubuntu/ws/plugins/maven-cayenne-plugin/target/surefire-reports>
for the individual test results.
[ERROR] -> [Help 1]
org.apache.maven.lifecycle.LifecycleExecutionException: Failed to execute goal org.apache.maven.plugins:maven-surefire-plugin:2.5:test
(default-test) on project maven-cayenne-plugin: There are test failures.

Please refer to <https://builds.apache.org/job/cayenne-master/cayenneTestConnection=h2,jdk=JDK%201.7%20(latest),label=Ubuntu/ws/plugins/maven-cayenne-plugin/target/surefire-reports>
for the individual test results.
	at org.apache.maven.lifecycle.internal.MojoExecutor.execute(MojoExecutor.java:213)
	at org.apache.maven.lifecycle.internal.MojoExecutor.execute(MojoExecutor.java:153)
	at org.apache.maven.lifecycle.internal.MojoExecutor.execute(MojoExecutor.java:145)
	at org.apache.maven.lifecycle.internal.LifecycleModuleBuilder.buildProject(LifecycleModuleBuilder.java:84)
	at org.apache.maven.lifecycle.internal.LifecycleModuleBuilder.buildProject(LifecycleModuleBuilder.java:59)
	at org.apache.maven.lifecycle.internal.LifecycleStarter.singleThreadedBuild(LifecycleStarter.java:183)
	at org.apache.maven.lifecycle.internal.LifecycleStarter.execute(LifecycleStarter.java:161)
	at org.apache.maven.DefaultMaven.doExecute(DefaultMaven.java:320)
	at org.apache.maven.DefaultMaven.execute(DefaultMaven.java:156)
	at org.apache.maven.cli.MavenCli.execute(MavenCli.java:537)
	at org.apache.maven.cli.MavenCli.doMain(MavenCli.java:196)
	at org.apache.maven.cli.MavenCli.main(MavenCli.java:141)
	at sun.reflect.NativeMethodAccessorImpl.invoke0(Native Method)
	at sun.reflect.NativeMethodAccessorImpl.invoke(NativeMethodAccessorImpl.java:57)
	at sun.reflect.DelegatingMethodAccessorImpl.invoke(DelegatingMethodAccessorImpl.java:43)
	at java.lang.reflect.Method.invoke(Method.java:606)
	at org.codehaus.plexus.classworlds.launcher.Launcher.launchEnhanced(Launcher.java:290)
	at org.codehaus.plexus.classworlds.launcher.Launcher.launch(Launcher.java:230)
	at org.codehaus.plexus.classworlds.launcher.Launcher.mainWithExitCode(Launcher.java:409)
	at org.codehaus.plexus.classworlds.launcher.Launcher.main(Launcher.java:352)
Caused by: org.apache.maven.plugin.MojoFailureException: There are test failures.

Please refer to <https://builds.apache.org/job/cayenne-master/cayenneTestConnection=h2,jdk=JDK%201.7%20(latest),label=Ubuntu/ws/plugins/maven-cayenne-plugin/target/surefire-reports>
for the individual test results.
	at org.apache.maven.plugin.surefire.SurefirePlugin.execute(SurefirePlugin.java:629)
	at org.apache.maven.plugin.DefaultBuildPluginManager.executeMojo(DefaultBuildPluginManager.java:101)
	at org.apache.maven.lifecycle.internal.MojoExecutor.execute(MojoExecutor.java:209)
	... 19 more
[ERROR] 
[ERROR] Re-run Maven using the -X switch to enable full debug logging.
[ERROR] 
[ERROR] For more information about the errors and possible solutions, please read the following
articles:
[ERROR] [Help 1] http://cwiki.apache.org/confluence/display/MAVEN/MojoFailureException
[ERROR] 
[ERROR] After correcting the problems, you can resume the build with the command
[ERROR]   mvn <goals> -rf :maven-cayenne-plugin
Build step 'Invoke top-level Maven targets' marked build as failure

Mime
View raw message