cayenne-commits mailing list archives

Site index · List index
Message view « Date » · « Thread »
Top « Date » · « Thread »
From Apache Jenkins Server <jenk...@builds.apache.org>
Subject Build failed in Jenkins: cayenne-master » hsql,JDK 1.7 (latest),Ubuntu #10
Date Mon, 23 Jun 2014 11:32:37 GMT
See <https://builds.apache.org/job/cayenne-master/cayenneTestConnection=hsql,jdk=JDK%201.7%20(latest),label=Ubuntu/10/changes>

Changes:

[aadamchik] CAY-1870 cgen - smarter default for 'superPkg' and 'destDir',

[aadamchik] CAY-1870 cgen - smarter default for 'superPkg' and 'destDir',

[aadamchik] CAY-1870 cgen - smarter default for 'superPkg' and 'destDir',

------------------------------------------
[...truncated 94366 lines...]
Generating <https://builds.apache.org/job/cayenne-master/cayenneTestConnection=hsql,jdk=JDK%201.7%20(latest),label=Ubuntu/ws/docs/doc/target/site/apidocs/doc/api/org/apache/cayenne/util/concurrentlinkedhashmap/package-use.html...>
Generating <https://builds.apache.org/job/cayenne-master/cayenneTestConnection=hsql,jdk=JDK%201.7%20(latest),label=Ubuntu/ws/docs/doc/target/site/apidocs/doc/api/org/apache/cayenne/validation/package-use.html...>
Building index for all the packages and classes...
Generating <https://builds.apache.org/job/cayenne-master/cayenneTestConnection=hsql,jdk=JDK%201.7%20(latest),label=Ubuntu/ws/docs/doc/target/site/apidocs/doc/api/overview-tree.html...>
Generating <https://builds.apache.org/job/cayenne-master/cayenneTestConnection=hsql,jdk=JDK%201.7%20(latest),label=Ubuntu/ws/docs/doc/target/site/apidocs/doc/api/index-all.html...>
Generating <https://builds.apache.org/job/cayenne-master/cayenneTestConnection=hsql,jdk=JDK%201.7%20(latest),label=Ubuntu/ws/docs/doc/target/site/apidocs/doc/api/deprecated-list.html...>
Building index for all classes...
Generating <https://builds.apache.org/job/cayenne-master/cayenneTestConnection=hsql,jdk=JDK%201.7%20(latest),label=Ubuntu/ws/docs/doc/target/site/apidocs/doc/api/allclasses-frame.html...>
Generating <https://builds.apache.org/job/cayenne-master/cayenneTestConnection=hsql,jdk=JDK%201.7%20(latest),label=Ubuntu/ws/docs/doc/target/site/apidocs/doc/api/allclasses-noframe.html...>
Generating <https://builds.apache.org/job/cayenne-master/cayenneTestConnection=hsql,jdk=JDK%201.7%20(latest),label=Ubuntu/ws/docs/doc/target/site/apidocs/doc/api/index.html...>
Generating <https://builds.apache.org/job/cayenne-master/cayenneTestConnection=hsql,jdk=JDK%201.7%20(latest),label=Ubuntu/ws/docs/doc/target/site/apidocs/doc/api/overview-summary.html...>
Generating <https://builds.apache.org/job/cayenne-master/cayenneTestConnection=hsql,jdk=JDK%201.7%20(latest),label=Ubuntu/ws/docs/doc/target/site/apidocs/doc/api/help-doc.html...>
2 warnings
[WARNING] Javadoc Warnings
[WARNING] <https://builds.apache.org/job/cayenne-master/cayenneTestConnection=hsql,jdk=JDK%201.7%20(latest),label=Ubuntu/ws/docs/doc/target/sources/org/apache/cayenne/dba/JdbcAdapter.java>:566:
warning - @return tag has no arguments.
[WARNING] <https://builds.apache.org/job/cayenne-master/cayenneTestConnection=hsql,jdk=JDK%201.7%20(latest),label=Ubuntu/ws/docs/doc/target/sources/org/apache/cayenne/log/JdbcEventLogger.java>:71:
warning - Tag @link: can't find logQueryParameters(String, List) in org.apache.cayenne.log.JdbcEventLogger
[INFO] 
[INFO] --- maven-resources-plugin:2.4.3:resources (default-resources) @ cayenne-doc ---
[INFO] Using 'UTF-8' encoding to copy filtered resources.
[INFO] Copying 1865 resources
[INFO] Copying 84 resources
[INFO] Copying 1 resource
[INFO] 
[INFO] --- maven-compiler-plugin:2.3.2:compile (default-compile) @ cayenne-doc ---
[INFO] No sources to compile
[INFO] 
[INFO] --- maven-resources-plugin:2.4.3:testResources (default-testResources) @ cayenne-doc
---
[INFO] Using 'UTF-8' encoding to copy filtered resources.
[INFO] skip non existing resourceDirectory <https://builds.apache.org/job/cayenne-master/cayenneTestConnection=hsql,jdk=JDK%201.7%20(latest),label=Ubuntu/ws/docs/doc/src/test/resources>
[INFO] 
[INFO] --- maven-compiler-plugin:2.3.2:testCompile (default-testCompile) @ cayenne-doc ---
[INFO] No sources to compile
[INFO] 
[INFO] --- maven-surefire-plugin:2.5:test (default-test) @ cayenne-doc ---
[INFO] No tests to run.
[INFO] 
[INFO] --- maven-jar-plugin:2.3.2:jar (default-jar) @ cayenne-doc ---
[INFO] Building jar: <https://builds.apache.org/job/cayenne-master/cayenneTestConnection=hsql,jdk=JDK%201.7%20(latest),label=Ubuntu/ws/docs/doc/target/cayenne-doc-3.2.M2-SNAPSHOT.jar>
[INFO] 
[INFO] >>> maven-source-plugin:2.1.2:jar (bundle-source-jar) @ cayenne-doc >>>
[INFO] 
[INFO] --- dependency-maven-plugin:1.0:unpack (unpack-sources) @ cayenne-doc ---
[INFO] Configured Artifact: org.apache.cayenne:cayenne-di:sources:3.2.M2-SNAPSHOT:jar
[INFO] Configured Artifact: org.apache.cayenne:cayenne-server:sources:3.2.M2-SNAPSHOT:jar
[INFO] Configured Artifact: org.apache.cayenne:cayenne-client:sources:3.2.M2-SNAPSHOT:jar
[INFO] cayenne-di-3.2.M2-SNAPSHOT-sources.jar already unpacked.
[INFO] cayenne-server-3.2.M2-SNAPSHOT-sources.jar already unpacked.
[INFO] cayenne-client-3.2.M2-SNAPSHOT-sources.jar already unpacked.
[INFO] 
[INFO] <<< maven-source-plugin:2.1.2:jar (bundle-source-jar) @ cayenne-doc <<<
[INFO] 
[INFO] --- maven-source-plugin:2.1.2:jar (bundle-source-jar) @ cayenne-doc ---
[INFO] doc already added, skipping
[INFO] Building jar: <https://builds.apache.org/job/cayenne-master/cayenneTestConnection=hsql,jdk=JDK%201.7%20(latest),label=Ubuntu/ws/docs/doc/target/cayenne-doc-3.2.M2-SNAPSHOT-sources.jar>
[INFO] doc already added, skipping
[INFO] 
[INFO] --- maven-install-plugin:2.3.1:install (default-install) @ cayenne-doc ---
[INFO] Installing <https://builds.apache.org/job/cayenne-master/cayenneTestConnection=hsql,jdk=JDK%201.7%20(latest),label=Ubuntu/ws/docs/doc/target/cayenne-doc-3.2.M2-SNAPSHOT.jar>
to /home/jenkins/.m2/repository/org/apache/cayenne/docs/cayenne-doc/3.2.M2-SNAPSHOT/cayenne-doc-3.2.M2-SNAPSHOT.jar
[INFO] Installing <https://builds.apache.org/job/cayenne-master/cayenneTestConnection=hsql,jdk=JDK%201.7%20(latest),label=Ubuntu/ws/docs/doc/pom.xml>
to /home/jenkins/.m2/repository/org/apache/cayenne/docs/cayenne-doc/3.2.M2-SNAPSHOT/cayenne-doc-3.2.M2-SNAPSHOT.pom
[INFO] Installing <https://builds.apache.org/job/cayenne-master/cayenneTestConnection=hsql,jdk=JDK%201.7%20(latest),label=Ubuntu/ws/docs/doc/target/cayenne-doc-3.2.M2-SNAPSHOT-sources.jar>
to /home/jenkins/.m2/repository/org/apache/cayenne/docs/cayenne-doc/3.2.M2-SNAPSHOT/cayenne-doc-3.2.M2-SNAPSHOT-sources.jar
[INFO]                                                                         
[INFO] ------------------------------------------------------------------------
[INFO] Building Cayenne Docbook Documentation 3.2.M2-SNAPSHOT
[INFO] ------------------------------------------------------------------------
[INFO] 
[INFO] --- maven-clean-plugin:2.4.1:clean (default-clean) @ cayenne-docbook ---
[INFO] 
[INFO] --- docbkx-maven-plugin:2.0.14:generate-pdf (build-pdf) @ cayenne-docbook ---
[INFO] 
[INFO] --- docbkx-maven-plugin:2.0.14:generate-html (build-html) @ cayenne-docbook ---
[INFO] 
[INFO] >>> maven-source-plugin:2.1.2:jar (bundle-source-jar) @ cayenne-docbook >>>
[INFO] 
[INFO] <<< maven-source-plugin:2.1.2:jar (bundle-source-jar) @ cayenne-docbook <<<
[INFO] 
[INFO] --- maven-source-plugin:2.1.2:jar (bundle-source-jar) @ cayenne-docbook ---
[INFO] 
[INFO] --- maven-install-plugin:2.3.1:install (default-install) @ cayenne-docbook ---
[INFO] Installing <https://builds.apache.org/job/cayenne-master/cayenneTestConnection=hsql,jdk=JDK%201.7%20(latest),label=Ubuntu/ws/docs/docbook/pom.xml>
to /home/jenkins/.m2/repository/org/apache/cayenne/docs/cayenne-docbook/3.2.M2-SNAPSHOT/cayenne-docbook-3.2.M2-SNAPSHOT.pom
[INFO]                                                                         
[INFO] ------------------------------------------------------------------------
[INFO] Building Docbook: Cayenne Stylesheets 3.2.M2-SNAPSHOT
[INFO] ------------------------------------------------------------------------
[INFO] 
[INFO] --- maven-clean-plugin:2.4.1:clean (default-clean) @ docbook-stylesheets ---
[INFO] 
[INFO] --- docbkx-maven-plugin:2.0.14:generate-pdf (build-pdf) @ docbook-stylesheets ---
[INFO] 
[INFO] --- docbkx-maven-plugin:2.0.14:generate-html (build-html) @ docbook-stylesheets ---
[INFO] 
[INFO] --- maven-resources-plugin:2.4.3:resources (default-resources) @ docbook-stylesheets
---
[INFO] Using 'UTF-8' encoding to copy filtered resources.
[INFO] Copying 6 resources
[INFO] 
[INFO] --- maven-compiler-plugin:2.3.2:compile (default-compile) @ docbook-stylesheets ---
[INFO] No sources to compile
[INFO] 
[INFO] --- maven-resources-plugin:2.4.3:testResources (default-testResources) @ docbook-stylesheets
---
[INFO] Using 'UTF-8' encoding to copy filtered resources.
[INFO] skip non existing resourceDirectory <https://builds.apache.org/job/cayenne-master/cayenneTestConnection=hsql,jdk=JDK%201.7%20(latest),label=Ubuntu/ws/docs/docbook/docbook-stylesheets/src/test/resources>
[INFO] 
[INFO] --- maven-compiler-plugin:2.3.2:testCompile (default-testCompile) @ docbook-stylesheets
---
[INFO] No sources to compile
[INFO] 
[INFO] --- maven-surefire-plugin:2.5:test (default-test) @ docbook-stylesheets ---
[INFO] No tests to run.
[INFO] 
[INFO] --- maven-jar-plugin:2.3.2:jar (default-jar) @ docbook-stylesheets ---
[INFO] Building jar: <https://builds.apache.org/job/cayenne-master/cayenneTestConnection=hsql,jdk=JDK%201.7%20(latest),label=Ubuntu/ws/docs/docbook/docbook-stylesheets/target/docbook-stylesheets-3.2.M2-SNAPSHOT.jar>
[INFO] 
[INFO] >>> maven-source-plugin:2.1.2:jar (bundle-source-jar) @ docbook-stylesheets
>>>
[INFO] 
[INFO] <<< maven-source-plugin:2.1.2:jar (bundle-source-jar) @ docbook-stylesheets
<<<
[INFO] 
[INFO] --- maven-source-plugin:2.1.2:jar (bundle-source-jar) @ docbook-stylesheets ---
[INFO] Building jar: <https://builds.apache.org/job/cayenne-master/cayenneTestConnection=hsql,jdk=JDK%201.7%20(latest),label=Ubuntu/ws/docs/docbook/docbook-stylesheets/target/docbook-stylesheets-3.2.M2-SNAPSHOT-sources.jar>
[INFO] 
[INFO] --- maven-install-plugin:2.3.1:install (default-install) @ docbook-stylesheets ---
[INFO] Installing <https://builds.apache.org/job/cayenne-master/cayenneTestConnection=hsql,jdk=JDK%201.7%20(latest),label=Ubuntu/ws/docs/docbook/docbook-stylesheets/target/docbook-stylesheets-3.2.M2-SNAPSHOT.jar>
to /home/jenkins/.m2/repository/org/apache/cayenne/docs/docbook-stylesheets/3.2.M2-SNAPSHOT/docbook-stylesheets-3.2.M2-SNAPSHOT.jar
[INFO] Installing <https://builds.apache.org/job/cayenne-master/cayenneTestConnection=hsql,jdk=JDK%201.7%20(latest),label=Ubuntu/ws/docs/docbook/docbook-stylesheets/pom.xml>
to /home/jenkins/.m2/repository/org/apache/cayenne/docs/docbook-stylesheets/3.2.M2-SNAPSHOT/docbook-stylesheets-3.2.M2-SNAPSHOT.pom
[INFO] Installing <https://builds.apache.org/job/cayenne-master/cayenneTestConnection=hsql,jdk=JDK%201.7%20(latest),label=Ubuntu/ws/docs/docbook/docbook-stylesheets/target/docbook-stylesheets-3.2.M2-SNAPSHOT-sources.jar>
to /home/jenkins/.m2/repository/org/apache/cayenne/docs/docbook-stylesheets/3.2.M2-SNAPSHOT/docbook-stylesheets-3.2.M2-SNAPSHOT-sources.jar
[INFO]                                                                         
[INFO] ------------------------------------------------------------------------
[INFO] Building Docbook: Cayenne Guide 3.2.M2-SNAPSHOT
[INFO] ------------------------------------------------------------------------
[INFO] 
[INFO] --- maven-clean-plugin:2.4.1:clean (default-clean) @ cayenne-guide ---
[INFO] 
[INFO] --- docbkx-maven-plugin:2.0.14:generate-pdf (build-pdf) @ cayenne-guide ---
[INFO] Processing input file: index.xml
[INFO] Applying customization parameters
[INFO] targetFileExtension pdf
[INFO] type fo
Jun 23, 2014 11:32:17 AM org.apache.fop.events.LoggingEventListener processEvent
WARNING: Font "Symbol,normal,700" not found. Substituting with "Symbol,normal,400".
Jun 23, 2014 11:32:17 AM org.apache.fop.events.LoggingEventListener processEvent
WARNING: Font "ZapfDingbats,normal,700" not found. Substituting with "ZapfDingbats,normal,400".
Jun 23, 2014 11:32:18 AM org.apache.fop.hyphenation.Hyphenator getHyphenationTree
SEVERE: Couldn't find hyphenation pattern en
Jun 23, 2014 11:32:18 AM org.apache.fop.events.LoggingEventListener processEvent
WARNING: The following feature isn't implemented by Apache FOP, yet: table-layout="auto" (on
fo:table) (See position 5:1089)
Jun 23, 2014 11:32:18 AM org.apache.fop.events.LoggingEventListener processEvent
INFO: An fo:table  (See position 5:1089) is wider than the available room in inline-progression-dimension.
Adjusting end-indent based on overconstrained geometry rules (XSL 1.1, ch. 5.3.4)
Jun 23, 2014 11:32:18 AM org.apache.fop.events.LoggingEventListener processEvent
WARNING: The following feature isn't implemented by Apache FOP, yet: table-layout="auto" (on
fo:table) (See position 137:1016)
Jun 23, 2014 11:32:18 AM org.apache.fop.events.LoggingEventListener processEvent
WARNING: The following feature isn't implemented by Apache FOP, yet: table-layout="auto" (on
fo:table) (See position 149:1016)
[INFO] ------------------------------------------------------------------------
[INFO] Reactor Summary:
[INFO] 
[INFO] Cayenne ........................................... SUCCESS [0.419s]
[INFO] Cayenne Build Tools Parent ........................ SUCCESS [0.035s]
[INFO] Cayenne License and Notice Bundle ................. SUCCESS [1.847s]
[INFO] Common Unit Test Utilities ........................ SUCCESS [1.036s]
[INFO] Cayenne Dependency Injection Container ............ SUCCESS [3.570s]
[INFO] Cayenne Server .................................... SUCCESS [5:52.054s]
[INFO] Cayenne ROP Client ................................ SUCCESS [1:19.362s]
[INFO] Cayenne Project ................................... SUCCESS [3.005s]
[INFO] Cayenne Tools ..................................... SUCCESS [4.570s]
[INFO] Cayenne Lifecycle Utilities ....................... SUCCESS [3.799s]
[INFO] Cayenne Maven Plugins ............................. SUCCESS [0.037s]
[INFO] Cayenne Maven Plugin .............................. SUCCESS [3.825s]
[INFO] Cayenne Cryptography Extensions ................... SUCCESS [3.923s]
[INFO] Cayenne Integration Tests Parent .................. SUCCESS [0.024s]
[INFO] Integration Tests - Cayenne Tools ................. SUCCESS [2.706s]
[INFO] Cayenne Modeler Parent ............................ SUCCESS [0.024s]
[INFO] Cayenne WebObjects Compatibility Library .......... SUCCESS [4.091s]
[INFO] Cayenne Modeler ................................... SUCCESS [8.911s]
[INFO] Cayenne Modeler Maven Plugin ...................... SUCCESS [0.874s]
[INFO] Cayenne Tutorial .................................. SUCCESS [1.247s]
[INFO] Cayenne ROP Server Tutorial ....................... SUCCESS [1.758s]
[INFO] Cayenne ROP Client Tutorial ....................... SUCCESS [0.658s]
[INFO] Cayenne Tutorials ................................. SUCCESS [0.033s]
[INFO] Cayenne Documenation Parent ....................... SUCCESS [0.022s]
[INFO] Cayenne Documentation ............................. SUCCESS [1:33.089s]
[INFO] Cayenne Docbook Documentation ..................... SUCCESS [0.994s]
[INFO] Docbook: Cayenne Stylesheets ...................... SUCCESS [0.108s]
[INFO] Docbook: Cayenne Guide ............................ FAILURE [6.266s]
[INFO] Docbook: Getting Started with Cayenne ............. SKIPPED
[INFO] Docbook: Getting Started with Cayenne ROP ......... SKIPPED
[INFO] Docbook: Cayenne New Features and Upgrade Guide ... SKIPPED
[INFO] ------------------------------------------------------------------------
[INFO] BUILD FAILURE
[INFO] ------------------------------------------------------------------------
[INFO] Total time: 9:39.681s
[INFO] Finished at: Mon Jun 23 11:32:18 UTC 2014
[INFO] Final Memory: 65M/438M
[INFO] ------------------------------------------------------------------------
[ERROR] Failed to execute goal com.agilejava.docbkx:docbkx-maven-plugin:2.0.14:generate-pdf
(build-pdf) on project cayenne-guide: Failed to transform to fo: org.apache.fop.fo.ValidationException:
The column-number or number of cells in the row overflows the number of fo:table-columns specified
for the table. (See position 165:54): null:165:54: The column-number or number of cells in
the row overflows the number of fo:table-columns specified for the table. (See position 165:54)
-> [Help 1]
org.apache.maven.lifecycle.LifecycleExecutionException: Failed to execute goal com.agilejava.docbkx:docbkx-maven-plugin:2.0.14:generate-pdf
(build-pdf) on project cayenne-guide: Failed to transform to fo
	at org.apache.maven.lifecycle.internal.MojoExecutor.execute(MojoExecutor.java:217)
	at org.apache.maven.lifecycle.internal.MojoExecutor.execute(MojoExecutor.java:153)
	at org.apache.maven.lifecycle.internal.MojoExecutor.execute(MojoExecutor.java:145)
	at org.apache.maven.lifecycle.internal.LifecycleModuleBuilder.buildProject(LifecycleModuleBuilder.java:84)
	at org.apache.maven.lifecycle.internal.LifecycleModuleBuilder.buildProject(LifecycleModuleBuilder.java:59)
	at org.apache.maven.lifecycle.internal.LifecycleStarter.singleThreadedBuild(LifecycleStarter.java:183)
	at org.apache.maven.lifecycle.internal.LifecycleStarter.execute(LifecycleStarter.java:161)
	at org.apache.maven.DefaultMaven.doExecute(DefaultMaven.java:320)
	at org.apache.maven.DefaultMaven.execute(DefaultMaven.java:156)
	at org.apache.maven.cli.MavenCli.execute(MavenCli.java:537)
	at org.apache.maven.cli.MavenCli.doMain(MavenCli.java:196)
	at org.apache.maven.cli.MavenCli.main(MavenCli.java:141)
	at sun.reflect.NativeMethodAccessorImpl.invoke0(Native Method)
	at sun.reflect.NativeMethodAccessorImpl.invoke(NativeMethodAccessorImpl.java:57)
	at sun.reflect.DelegatingMethodAccessorImpl.invoke(DelegatingMethodAccessorImpl.java:43)
	at java.lang.reflect.Method.invoke(Method.java:606)
	at org.codehaus.plexus.classworlds.launcher.Launcher.launchEnhanced(Launcher.java:290)
	at org.codehaus.plexus.classworlds.launcher.Launcher.launch(Launcher.java:230)
	at org.codehaus.plexus.classworlds.launcher.Launcher.mainWithExitCode(Launcher.java:409)
	at org.codehaus.plexus.classworlds.launcher.Launcher.main(Launcher.java:352)
Caused by: org.apache.maven.plugin.MojoExecutionException: Failed to transform to fo
	at com.agilejava.docbkx.maven.AbstractFoMojo.postProcessResult(AbstractFoMojo.java:161)
	at com.agilejava.docbkx.maven.AbstractTransformerMojo.execute(AbstractTransformerMojo.java:166)
	at org.apache.maven.plugin.DefaultBuildPluginManager.executeMojo(DefaultBuildPluginManager.java:101)
	at org.apache.maven.lifecycle.internal.MojoExecutor.execute(MojoExecutor.java:209)
	... 19 more
Caused by: javax.xml.transform.TransformerException: org.apache.fop.fo.ValidationException:
The column-number or number of cells in the row overflows the number of fo:table-columns specified
for the table. (See position 165:54)
	at org.apache.xalan.transformer.TransformerIdentityImpl.transform(TransformerIdentityImpl.java:501)
	at com.agilejava.docbkx.maven.AbstractFoMojo.postProcessResult(AbstractFoMojo.java:154)
	... 22 more
Caused by: org.apache.fop.fo.ValidationException: The column-number or number of cells in
the row overflows the number of fo:table-columns specified for the table. (See position 165:54)
	at org.apache.fop.events.ValidationExceptionFactory.createException(ValidationExceptionFactory.java:38)
	at org.apache.fop.events.EventExceptionManager.throwException(EventExceptionManager.java:54)
	at org.apache.fop.events.DefaultEventBroadcaster$1.invoke(DefaultEventBroadcaster.java:175)
	at com.sun.proxy.$Proxy19.tooManyCells(Unknown Source)
	at org.apache.fop.fo.flow.table.TableCellContainer.addTableCellChild(TableCellContainer.java:51)
	at org.apache.fop.fo.flow.table.TableRow.addChildNode(TableRow.java:95)
	at org.apache.fop.fo.FOTreeBuilder$MainFOHandler.startElement(FOTreeBuilder.java:315)
	at org.apache.fop.fo.FOTreeBuilder.startElement(FOTreeBuilder.java:171)
	at org.apache.xalan.transformer.TransformerIdentityImpl.startElement(TransformerIdentityImpl.java:1072)
	at org.apache.xerces.parsers.AbstractSAXParser.startElement(Unknown Source)
	at org.apache.xerces.impl.XMLNSDocumentScannerImpl.scanStartElement(Unknown Source)
	at org.apache.xerces.impl.XMLDocumentFragmentScannerImpl$FragmentContentDispatcher.dispatch(Unknown
Source)
	at org.apache.xerces.impl.XMLDocumentFragmentScannerImpl.scanDocument(Unknown Source)
	at org.apache.xerces.parsers.XML11Configuration.parse(Unknown Source)
	at org.apache.xerces.parsers.XML11Configuration.parse(Unknown Source)
	at org.apache.xerces.parsers.XMLParser.parse(Unknown Source)
	at org.apache.xerces.parsers.AbstractSAXParser.parse(Unknown Source)
	at org.apache.xalan.transformer.TransformerIdentityImpl.transform(TransformerIdentityImpl.java:484)
	... 23 more
[ERROR] 
[ERROR] Re-run Maven using the -X switch to enable full debug logging.
[ERROR] 
[ERROR] For more information about the errors and possible solutions, please read the following
articles:
[ERROR] [Help 1] http://cwiki.apache.org/confluence/display/MAVEN/MojoExecutionException
[ERROR] 
[ERROR] After correcting the problems, you can resume the build with the command
[ERROR]   mvn <goals> -rf :cayenne-guide
Build step 'Invoke top-level Maven targets' marked build as failure

Mime
View raw message