cayenne-commits mailing list archives

Site index · List index
Message view « Date » · « Thread »
Top « Date » · « Thread »
From Apache Jenkins Server <jenk...@builds.apache.org>
Subject Build failed in Jenkins: Cayenne-31 » derby,JDK 1.5 (latest),Ubuntu #105
Date Wed, 21 May 2014 08:25:30 GMT
See <https://builds.apache.org/job/Cayenne-31/cayenneTestConnection=derby,jdk=JDK%201.5%20(latest),label=Ubuntu/105/>

------------------------------------------
[...truncated 9436 lines...]
850/1292 KB   
854/1292 KB   
858/1292 KB   
862/1292 KB   
866/1292 KB   
870/1292 KB   
874/1292 KB   
878/1292 KB   
882/1292 KB   
886/1292 KB   
890/1292 KB   
894/1292 KB   
898/1292 KB   
902/1292 KB   
906/1292 KB   
910/1292 KB   
914/1292 KB   
918/1292 KB   
922/1292 KB   
926/1292 KB   
930/1292 KB   
934/1292 KB   
938/1292 KB   
942/1292 KB   
946/1292 KB   
950/1292 KB   
954/1292 KB   
958/1292 KB   
962/1292 KB   
966/1292 KB   
970/1292 KB   
974/1292 KB   
978/1292 KB   
982/1292 KB   
986/1292 KB   
990/1292 KB   
994/1292 KB   
998/1292 KB   
1001/1292 KB   
1005/1292 KB   
1009/1292 KB   
1013/1292 KB   
1017/1292 KB   
1021/1292 KB   
1025/1292 KB   
1029/1292 KB   
1033/1292 KB   
1037/1292 KB   
1041/1292 KB   
1045/1292 KB   
1049/1292 KB   
1053/1292 KB   
1057/1292 KB   
1061/1292 KB   
1065/1292 KB   
1069/1292 KB   
1073/1292 KB   
1077/1292 KB   
1081/1292 KB   
1085/1292 KB   
1089/1292 KB   
1093/1292 KB   
1097/1292 KB   
1101/1292 KB   
1105/1292 KB   
1109/1292 KB   
1113/1292 KB   
1117/1292 KB   
1121/1292 KB   
1125/1292 KB   
1129/1292 KB   
1133/1292 KB   
1137/1292 KB   
1141/1292 KB   
1145/1292 KB   
1149/1292 KB   
1153/1292 KB   
1157/1292 KB   
1161/1292 KB   
1165/1292 KB   
1169/1292 KB   
1173/1292 KB   
1177/1292 KB   
1181/1292 KB   
1185/1292 KB   
1189/1292 KB   
1192/1292 KB   
1196/1292 KB   
1200/1292 KB   
1204/1292 KB   
1208/1292 KB   
1212/1292 KB   
1216/1292 KB   
1220/1292 KB   
1224/1292 KB   
1228/1292 KB   
1232/1292 KB   
1236/1292 KB   
1240/1292 KB   
1244/1292 KB   
1248/1292 KB   
1252/1292 KB   
1256/1292 KB   
1260/1292 KB   
1264/1292 KB   
1268/1292 KB   
1272/1292 KB   
1276/1292 KB   
1278/1292 KB   
1282/1292 KB   
1285/1292 KB   
1289/1292 KB   
1292/1292 KB   
               
Downloaded: http://maven.objectstyle.org/nexus/content/groups/cayenne-deps/org/apache/ant/ant/1.7.1/ant-1.7.1.jar
(1292 KB at 732.0 KB/sec)
[INFO] Executing tasks
[INFO] Executed tasks
[INFO] 
[INFO] --- maven-resources-plugin:2.4.3:resources (default-resources) @ cayenne-jdk1.5-unpublished
---
[INFO] Using 'UTF-8' encoding to copy filtered resources.
[INFO] Copying 16 resources
[INFO] 
[INFO] --- maven-compiler-plugin:2.3.2:compile (default-compile) @ cayenne-jdk1.5-unpublished
---
[WARNING] File encoding has not been set, using platform encoding ANSI_X3.4-1968, i.e. build
is platform dependent!
[INFO] Compiling 942 source files to /home/hudson/jenkins-slave/workspace/Cayenne-31/cayenneTestConnection/derby/jdk/JDK
1.5 (latest)/label/Ubuntu/framework/cayenne-jdk1.5-unpublished/target/classes
[INFO] 
[INFO] --- maven-resources-plugin:2.4.3:testResources (default-testResources) @ cayenne-jdk1.5-unpublished
---
[INFO] Using 'UTF-8' encoding to copy filtered resources.
[INFO] Copying 96 resources
[INFO] 
[INFO] --- maven-compiler-plugin:2.3.2:testCompile (default-testCompile) @ cayenne-jdk1.5-unpublished
---
[WARNING] File encoding has not been set, using platform encoding ANSI_X3.4-1968, i.e. build
is platform dependent!
[INFO] Compiling 958 source files to /home/hudson/jenkins-slave/workspace/Cayenne-31/cayenneTestConnection/derby/jdk/JDK
1.5 (latest)/label/Ubuntu/framework/cayenne-jdk1.5-unpublished/target/test-classes
[INFO] -------------------------------------------------------------
[ERROR] COMPILATION ERROR : 
[INFO] -------------------------------------------------------------
[ERROR] /home/hudson/jenkins-slave/workspace/Cayenne-31/cayenneTestConnection/derby/jdk/JDK
1.5 (latest)/label/Ubuntu/framework/cayenne-jdk1.5-unpublished/src/test/java/org/apache/cayenne/access/DataContextPrefetchTest.java:[35,30]
cannot find symbol
symbol  : class Property
location: package org.apache.cayenne.exp
[ERROR] /home/hudson/jenkins-slave/workspace/Cayenne-31/cayenneTestConnection/derby/jdk/JDK
1.5 (latest)/label/Ubuntu/framework/cayenne-jdk1.5-unpublished/src/test/java/org/apache/cayenne/map/ObjEntityTest.java:[411,49]
getObjEntity(java.lang.String) in org.apache.cayenne.map.EntityResolver cannot be applied
to (java.lang.Class<org.apache.cayenne.testdo.testmap.Artist>)
[ERROR] /home/hudson/jenkins-slave/workspace/Cayenne-31/cayenneTestConnection/derby/jdk/JDK
1.5 (latest)/label/Ubuntu/framework/cayenne-jdk1.5-unpublished/src/test/java/org/apache/cayenne/access/DataContextPrefetchTest.java:[511,87]
cannot find symbol
symbol  : variable ARTIST_NAME
location: class org.apache.cayenne.testdo.testmap.Artist
[ERROR] /home/hudson/jenkins-slave/workspace/Cayenne-31/cayenneTestConnection/derby/jdk/JDK
1.5 (latest)/label/Ubuntu/framework/cayenne-jdk1.5-unpublished/src/test/java/org/apache/cayenne/access/DataContextPrefetchTest.java:[511,29]
cannot find symbol
symbol  : class Property
location: class org.apache.cayenne.access.DataContextPrefetchTest
[ERROR] /home/hudson/jenkins-slave/workspace/Cayenne-31/cayenneTestConnection/derby/jdk/JDK
1.5 (latest)/label/Ubuntu/framework/cayenne-jdk1.5-unpublished/src/test/java/org/apache/cayenne/access/DataContextPrefetchTest.java:[513,19]
type org.apache.cayenne.query.SelectQuery does not take parameters
[ERROR] /home/hudson/jenkins-slave/workspace/Cayenne-31/cayenneTestConnection/derby/jdk/JDK
1.5 (latest)/label/Ubuntu/framework/cayenne-jdk1.5-unpublished/src/test/java/org/apache/cayenne/access/DataContextPrefetchTest.java:[513,47]
type org.apache.cayenne.query.SelectQuery does not take parameters
[ERROR] /home/hudson/jenkins-slave/workspace/Cayenne-31/cayenneTestConnection/derby/jdk/JDK
1.5 (latest)/label/Ubuntu/framework/cayenne-jdk1.5-unpublished/src/test/java/org/apache/cayenne/access/DataContextPrefetchTest.java:[514,28]
cannot find symbol
symbol  : variable PAINTING_ARRAY
location: class org.apache.cayenne.testdo.testmap.Artist
[INFO] 7 errors 
[INFO] -------------------------------------------------------------
[INFO] ------------------------------------------------------------------------
[INFO] Reactor Summary:
[INFO] 
[INFO] Cayenne ........................................... SUCCESS [11.013s]
[INFO] Common Unit Test Utilities ........................ SUCCESS [35.923s]
[INFO] Cayenne Internal Build Plugin ..................... SUCCESS [52.442s]
[INFO] Cayenne Build Tools Parent ........................ SUCCESS [0.005s]
[INFO] Cayenne License and Notice Bundle ................. SUCCESS [7.411s]
[INFO] Cayenne Dependency Injection Container ............ SUCCESS [3.395s]
[INFO] Cayenne Java 1.5 Unpublished ...................... FAILURE [44.286s]
[INFO] Cayenne WebObjects Compatibility Library .......... SKIPPED
[INFO] Cayenne Aggregated Server Jar ..................... SKIPPED
[INFO] Cayenne Aggregated Client Jar ..................... SKIPPED
[INFO] Cayenne Project ................................... SKIPPED
[INFO] Cayenne Tools ..................................... SKIPPED
[INFO] Library: cayenne-lifecycle ........................ SKIPPED
[INFO] Cayenne Maven Plugin .............................. SKIPPED
[INFO] Cayenne Framework Aggregator Project .............. SKIPPED
[INFO] Cayenne Integration Tests Parent .................. SKIPPED
[INFO] Integration Tests - Cayenne Runtime ............... SKIPPED
[INFO] Integration Tests - Cayenne Tools ................. SKIPPED
[INFO] Cayenne Modeler ................................... SKIPPED
[INFO] Cayenne Modeler Maven Plugin ...................... SKIPPED
[INFO] Cayenne Modeler Parent ............................ SKIPPED
[INFO] Cayenne Tutorial .................................. SKIPPED
[INFO] Cayenne ROP Server Tutorial ....................... SKIPPED
[INFO] Cayenne ROP Client Tutorial ....................... SKIPPED
[INFO] Cayenne Tutorials ................................. SKIPPED
[INFO] Cayenne Documentation ............................. SKIPPED
[INFO] Cayenne Documenation Parent ....................... SKIPPED
[INFO] Cayenne Docbook Documentation ..................... SKIPPED
[INFO] Docbook: Cayenne Stylesheets ...................... SKIPPED
[INFO] Docbook: Cayenne Guide ............................ SKIPPED
[INFO] Docbook: Getting Started with Cayenne ............. SKIPPED
[INFO] Docbook: Getting Started with Cayenne ROP ......... SKIPPED
[INFO] Docbook: Cayenne New Features and Upgrade Guide ... SKIPPED
[INFO] ------------------------------------------------------------------------
[INFO] BUILD FAILURE
[INFO] ------------------------------------------------------------------------
[INFO] Total time: 2:41.405s
[INFO] Finished at: Wed May 21 08:25:25 UTC 2014
[INFO] Final Memory: 22M/109M
[INFO] ------------------------------------------------------------------------
[ERROR] Failed to execute goal org.apache.maven.plugins:maven-compiler-plugin:2.3.2:testCompile
(default-testCompile) on project cayenne-jdk1.5-unpublished: Compilation failure: Compilation
failure:
[ERROR] /home/hudson/jenkins-slave/workspace/Cayenne-31/cayenneTestConnection/derby/jdk/JDK
1.5 (latest)/label/Ubuntu/framework/cayenne-jdk1.5-unpublished/src/test/java/org/apache/cayenne/access/DataContextPrefetchTest.java:[35,30]
cannot find symbol
[ERROR] symbol  : class Property
[ERROR] location: package org.apache.cayenne.exp
[ERROR] /home/hudson/jenkins-slave/workspace/Cayenne-31/cayenneTestConnection/derby/jdk/JDK
1.5 (latest)/label/Ubuntu/framework/cayenne-jdk1.5-unpublished/src/test/java/org/apache/cayenne/map/ObjEntityTest.java:[411,49]
getObjEntity(java.lang.String) in org.apache.cayenne.map.EntityResolver cannot be applied
to (java.lang.Class<org.apache.cayenne.testdo.testmap.Artist>)
[ERROR] /home/hudson/jenkins-slave/workspace/Cayenne-31/cayenneTestConnection/derby/jdk/JDK
1.5 (latest)/label/Ubuntu/framework/cayenne-jdk1.5-unpublished/src/test/java/org/apache/cayenne/access/DataContextPrefetchTest.java:[511,87]
cannot find symbol
[ERROR] symbol  : variable ARTIST_NAME
[ERROR] location: class org.apache.cayenne.testdo.testmap.Artist
[ERROR] /home/hudson/jenkins-slave/workspace/Cayenne-31/cayenneTestConnection/derby/jdk/JDK
1.5 (latest)/label/Ubuntu/framework/cayenne-jdk1.5-unpublished/src/test/java/org/apache/cayenne/access/DataContextPrefetchTest.java:[511,29]
cannot find symbol
[ERROR] symbol  : class Property
[ERROR] location: class org.apache.cayenne.access.DataContextPrefetchTest
[ERROR] /home/hudson/jenkins-slave/workspace/Cayenne-31/cayenneTestConnection/derby/jdk/JDK
1.5 (latest)/label/Ubuntu/framework/cayenne-jdk1.5-unpublished/src/test/java/org/apache/cayenne/access/DataContextPrefetchTest.java:[513,19]
type org.apache.cayenne.query.SelectQuery does not take parameters
[ERROR] /home/hudson/jenkins-slave/workspace/Cayenne-31/cayenneTestConnection/derby/jdk/JDK
1.5 (latest)/label/Ubuntu/framework/cayenne-jdk1.5-unpublished/src/test/java/org/apache/cayenne/access/DataContextPrefetchTest.java:[513,47]
type org.apache.cayenne.query.SelectQuery does not take parameters
[ERROR] /home/hudson/jenkins-slave/workspace/Cayenne-31/cayenneTestConnection/derby/jdk/JDK
1.5 (latest)/label/Ubuntu/framework/cayenne-jdk1.5-unpublished/src/test/java/org/apache/cayenne/access/DataContextPrefetchTest.java:[514,28]
cannot find symbol
[ERROR] symbol  : variable PAINTING_ARRAY
[ERROR] location: class org.apache.cayenne.testdo.testmap.Artist
[ERROR] -> [Help 1]
org.apache.maven.lifecycle.LifecycleExecutionException: Failed to execute goal org.apache.maven.plugins:maven-compiler-plugin:2.3.2:testCompile
(default-testCompile) on project cayenne-jdk1.5-unpublished: Compilation failure
	at org.apache.maven.lifecycle.internal.MojoExecutor.execute(MojoExecutor.java:213)
	at org.apache.maven.lifecycle.internal.MojoExecutor.execute(MojoExecutor.java:153)
	at org.apache.maven.lifecycle.internal.MojoExecutor.execute(MojoExecutor.java:145)
	at org.apache.maven.lifecycle.internal.LifecycleModuleBuilder.buildProject(LifecycleModuleBuilder.java:84)
	at org.apache.maven.lifecycle.internal.LifecycleModuleBuilder.buildProject(LifecycleModuleBuilder.java:59)
	at org.apache.maven.lifecycle.internal.LifecycleStarter.singleThreadedBuild(LifecycleStarter.java:183)
	at org.apache.maven.lifecycle.internal.LifecycleStarter.execute(LifecycleStarter.java:161)
	at org.apache.maven.DefaultMaven.doExecute(DefaultMaven.java:320)
	at org.apache.maven.DefaultMaven.execute(DefaultMaven.java:156)
	at org.apache.maven.cli.MavenCli.execute(MavenCli.java:537)
	at org.apache.maven.cli.MavenCli.doMain(MavenCli.java:196)
	at org.apache.maven.cli.MavenCli.main(MavenCli.java:141)
	at sun.reflect.NativeMethodAccessorImpl.invoke0(Native Method)
	at sun.reflect.NativeMethodAccessorImpl.invoke(NativeMethodAccessorImpl.java:39)
	at sun.reflect.DelegatingMethodAccessorImpl.invoke(DelegatingMethodAccessorImpl.java:25)
	at java.lang.reflect.Method.invoke(Method.java:592)
	at org.codehaus.plexus.classworlds.launcher.Launcher.launchEnhanced(Launcher.java:290)
	at org.codehaus.plexus.classworlds.launcher.Launcher.launch(Launcher.java:230)
	at org.codehaus.plexus.classworlds.launcher.Launcher.mainWithExitCode(Launcher.java:409)
	at org.codehaus.plexus.classworlds.launcher.Launcher.main(Launcher.java:352)
Caused by: org.apache.maven.plugin.CompilationFailureException: Compilation failure
	at org.apache.maven.plugin.AbstractCompilerMojo.execute(AbstractCompilerMojo.java:656)
	at org.apache.maven.plugin.TestCompilerMojo.execute(TestCompilerMojo.java:161)
	at org.apache.maven.plugin.DefaultBuildPluginManager.executeMojo(DefaultBuildPluginManager.java:101)
	at org.apache.maven.lifecycle.internal.MojoExecutor.execute(MojoExecutor.java:209)
	... 19 more
[ERROR] 
[ERROR] Re-run Maven using the -X switch to enable full debug logging.
[ERROR] 
[ERROR] For more information about the errors and possible solutions, please read the following
articles:
[ERROR] [Help 1] http://cwiki.apache.org/confluence/display/MAVEN/MojoFailureException
[ERROR] 
[ERROR] After correcting the problems, you can resume the build with the command
[ERROR]   mvn <goals> -rf :cayenne-jdk1.5-unpublished
Build step 'Invoke top-level Maven targets' marked build as failure

Mime
View raw message