cayenne-commits mailing list archives

Site index · List index
Message view « Date » · « Thread »
Top « Date » · « Thread »
From Apache Jenkins Server <jenk...@builds.apache.org>
Subject Build failed in Jenkins: Cayenne-trunk » derby,JDK 1.6 (latest),Ubuntu #1058
Date Mon, 07 Apr 2014 08:52:58 GMT
See <https://builds.apache.org/job/Cayenne-trunk/cayenneTestConnection=derby,jdk=JDK%201.6%20(latest),label=Ubuntu/1058/changes>

Changes:

[aadamchik] CAY-1908 Refactor all SQLActions to work with DataNode

getting rid of cast to JdbcAdapter in EJBQLAction

------------------------------------------
[...truncated 67235 lines...]
INFO: Loading XML configuration resource from <https://builds.apache.org/job/Cayenne-trunk/cayenneTestConnection=derby,jdk=JDK%201.6%20(latest),label=Ubuntu/ws/trunk/cayenne-server/target/test-classes/cayenne-testmap.xml>
Apr 7, 2014 8:52:56 AM org.apache.cayenne.configuration.XMLDataChannelDescriptorLoader$DataChannelChildrenHandler
createChildTagHandler
INFO: Loading XML DataMap resource from <https://builds.apache.org/job/Cayenne-trunk/cayenneTestConnection=derby,jdk=JDK%201.6%20(latest),label=Ubuntu/ws/trunk/cayenne-server/target/test-classes/tstmap.map.xml>
Apr 7, 2014 8:52:56 AM org.apache.cayenne.map.EntityResolver applyDBLayerDefaults
INFO: added runtime complimentary DbRelationship from ARTIST to PAINTING1
Apr 7, 2014 8:52:56 AM org.apache.cayenne.test.jdbc.UtilityLogger log
INFO: delete from PAINTING_INFO
Apr 7, 2014 8:52:56 AM org.apache.cayenne.test.jdbc.UtilityLogger log
INFO: delete from PAINTING
Apr 7, 2014 8:52:56 AM org.apache.cayenne.test.jdbc.UtilityLogger log
INFO: delete from ARTIST_EXHIBIT
Apr 7, 2014 8:52:56 AM org.apache.cayenne.test.jdbc.UtilityLogger log
INFO: delete from ARTIST_GROUP
Apr 7, 2014 8:52:56 AM org.apache.cayenne.test.jdbc.UtilityLogger log
INFO: delete from ARTIST
Apr 7, 2014 8:52:56 AM org.apache.cayenne.configuration.XMLDataChannelDescriptorLoader load
INFO: Loading XML configuration resource from <https://builds.apache.org/job/Cayenne-trunk/cayenneTestConnection=derby,jdk=JDK%201.6%20(latest),label=Ubuntu/ws/trunk/cayenne-server/target/test-classes/cayenne-testmap.xml>
Apr 7, 2014 8:52:56 AM org.apache.cayenne.configuration.XMLDataChannelDescriptorLoader$DataChannelChildrenHandler
createChildTagHandler
INFO: Loading XML DataMap resource from <https://builds.apache.org/job/Cayenne-trunk/cayenneTestConnection=derby,jdk=JDK%201.6%20(latest),label=Ubuntu/ws/trunk/cayenne-server/target/test-classes/tstmap.map.xml>
Apr 7, 2014 8:52:56 AM org.apache.cayenne.map.EntityResolver applyDBLayerDefaults
INFO: added runtime complimentary DbRelationship from ARTIST to PAINTING1
Apr 7, 2014 8:52:56 AM org.apache.cayenne.test.jdbc.UtilityLogger log
INFO: delete from PAINTING_INFO
Apr 7, 2014 8:52:56 AM org.apache.cayenne.test.jdbc.UtilityLogger log
INFO: delete from PAINTING
Apr 7, 2014 8:52:56 AM org.apache.cayenne.test.jdbc.UtilityLogger log
INFO: delete from ARTIST_EXHIBIT
Apr 7, 2014 8:52:56 AM org.apache.cayenne.test.jdbc.UtilityLogger log
INFO: delete from ARTIST_GROUP
Apr 7, 2014 8:52:56 AM org.apache.cayenne.test.jdbc.UtilityLogger log
INFO: delete from ARTIST
Tests run: 4, Failures: 0, Errors: 0, Skipped: 0, Time elapsed: 0.071 sec
Running org.apache.cayenne.map.ClientObjectRelationshipTest
Tests run: 1, Failures: 0, Errors: 0, Skipped: 0, Time elapsed: 0.003 sec
Running org.apache.cayenne.access.NestedDataContextParentPeerEventsTest
Apr 7, 2014 8:52:56 AM org.apache.cayenne.configuration.XMLDataChannelDescriptorLoader load
INFO: Loading XML configuration resource from <https://builds.apache.org/job/Cayenne-trunk/cayenneTestConnection=derby,jdk=JDK%201.6%20(latest),label=Ubuntu/ws/trunk/cayenne-server/target/test-classes/cayenne-relationships.xml>
Apr 7, 2014 8:52:56 AM org.apache.cayenne.configuration.XMLDataChannelDescriptorLoader$DataChannelChildrenHandler
createChildTagHandler
INFO: Loading XML DataMap resource from <https://builds.apache.org/job/Cayenne-trunk/cayenneTestConnection=derby,jdk=JDK%201.6%20(latest),label=Ubuntu/ws/trunk/cayenne-server/target/test-classes/relationships.map.xml>
Apr 7, 2014 8:52:56 AM org.apache.cayenne.configuration.XMLDataChannelDescriptorLoader$DataChannelChildrenHandler
createChildTagHandler
INFO: Loading XML DataMap resource from <https://builds.apache.org/job/Cayenne-trunk/cayenneTestConnection=derby,jdk=JDK%201.6%20(latest),label=Ubuntu/ws/trunk/cayenne-server/target/test-classes/relationships1.map.xml>
Apr 7, 2014 8:52:56 AM org.apache.cayenne.map.EntityResolver applyDBLayerDefaults
INFO: added runtime complimentary DbRelationship from DELETE_RULE_TEST3 to DELETE_RULE_TEST1
Apr 7, 2014 8:52:56 AM org.apache.cayenne.log.CommonsJdbcEventLogger logQuery
INFO: SELECT NEXT_ID FROM AUTO_PK_SUPPORT WHERE TABLE_NAME = ? FOR UPDATE [bind: 1:'MASTER']
Apr 7, 2014 8:52:56 AM org.apache.cayenne.log.CommonsJdbcEventLogger logBeginTransaction
INFO: --- transaction started.
Apr 7, 2014 8:52:56 AM org.apache.cayenne.log.CommonsJdbcEventLogger logQuery
INFO: SELECT NEXT_ID FROM AUTO_PK_SUPPORT WHERE TABLE_NAME = ? FOR UPDATE [bind: 1:'CHILD']
Apr 7, 2014 8:52:56 AM org.apache.cayenne.log.CommonsJdbcEventLogger logQuery
INFO: INSERT INTO MASTER (ID, NAME) VALUES (?, ?)
Apr 7, 2014 8:52:56 AM org.apache.cayenne.log.CommonsJdbcEventLogger logQueryParameters
INFO: [batch bind: 1->ID:200, 2->NAME:'Y']
Apr 7, 2014 8:52:56 AM org.apache.cayenne.log.CommonsJdbcEventLogger logQueryParameters
INFO: [batch bind: 1->ID:201, 2->NAME:'X']
Apr 7, 2014 8:52:56 AM org.apache.cayenne.log.CommonsJdbcEventLogger logUpdateCount
INFO: === updated 2 rows.
Apr 7, 2014 8:52:56 AM org.apache.cayenne.log.CommonsJdbcEventLogger logQuery
INFO: INSERT INTO CHILD (ID, MASTER_ID) VALUES (?, ?)
Apr 7, 2014 8:52:56 AM org.apache.cayenne.log.CommonsJdbcEventLogger logQueryParameters
INFO: [batch bind: 1->ID:200, 2->MASTER_ID:201]
Apr 7, 2014 8:52:56 AM org.apache.cayenne.log.CommonsJdbcEventLogger logUpdateCount
INFO: === updated 1 row.
Apr 7, 2014 8:52:56 AM org.apache.cayenne.log.CommonsJdbcEventLogger logCommitTransaction
INFO: +++ transaction committed.
Apr 7, 2014 8:52:56 AM org.apache.cayenne.log.CommonsJdbcEventLogger logBeginTransaction
INFO: --- transaction started.
Apr 7, 2014 8:52:56 AM org.apache.cayenne.log.CommonsJdbcEventLogger logQuery
INFO: UPDATE CHILD SET MASTER_ID = ? WHERE ID = ?
Apr 7, 2014 8:52:56 AM org.apache.cayenne.log.CommonsJdbcEventLogger logQueryParameters
INFO: [batch bind: 1->MASTER_ID:200, 2->ID:200]
Apr 7, 2014 8:52:56 AM org.apache.cayenne.log.CommonsJdbcEventLogger logUpdateCount
INFO: === updated 1 row.
Apr 7, 2014 8:52:56 AM org.apache.cayenne.log.CommonsJdbcEventLogger logCommitTransaction
INFO: +++ transaction committed.
Apr 7, 2014 8:52:56 AM org.apache.cayenne.configuration.XMLDataChannelDescriptorLoader load
INFO: Loading XML configuration resource from <https://builds.apache.org/job/Cayenne-trunk/cayenneTestConnection=derby,jdk=JDK%201.6%20(latest),label=Ubuntu/ws/trunk/cayenne-server/target/test-classes/cayenne-relationships.xml>
Apr 7, 2014 8:52:56 AM org.apache.cayenne.configuration.XMLDataChannelDescriptorLoader$DataChannelChildrenHandler
createChildTagHandler
INFO: Loading XML DataMap resource from <https://builds.apache.org/job/Cayenne-trunk/cayenneTestConnection=derby,jdk=JDK%201.6%20(latest),label=Ubuntu/ws/trunk/cayenne-server/target/test-classes/relationships.map.xml>
Apr 7, 2014 8:52:56 AM org.apache.cayenne.configuration.XMLDataChannelDescriptorLoader$DataChannelChildrenHandler
createChildTagHandler
INFO: Loading XML DataMap resource from <https://builds.apache.org/job/Cayenne-trunk/cayenneTestConnection=derby,jdk=JDK%201.6%20(latest),label=Ubuntu/ws/trunk/cayenne-server/target/test-classes/relationships1.map.xml>
Apr 7, 2014 8:52:56 AM org.apache.cayenne.map.EntityResolver applyDBLayerDefaults
INFO: added runtime complimentary DbRelationship from DELETE_RULE_TEST3 to DELETE_RULE_TEST1
Apr 7, 2014 8:52:56 AM org.apache.cayenne.log.CommonsJdbcEventLogger logBeginTransaction
INFO: --- transaction started.
Apr 7, 2014 8:52:56 AM org.apache.cayenne.log.CommonsJdbcEventLogger logQuery
INFO: INSERT INTO MASTER (ID, NAME) VALUES (?, ?)
Apr 7, 2014 8:52:56 AM org.apache.cayenne.log.CommonsJdbcEventLogger logQueryParameters
INFO: [batch bind: 1->ID:202, 2->NAME:'X']
Apr 7, 2014 8:52:56 AM org.apache.cayenne.log.CommonsJdbcEventLogger logUpdateCount
INFO: === updated 1 row.
Apr 7, 2014 8:52:56 AM org.apache.cayenne.log.CommonsJdbcEventLogger logQuery
INFO: INSERT INTO CHILD (ID, MASTER_ID) VALUES (?, ?)
Apr 7, 2014 8:52:56 AM org.apache.cayenne.log.CommonsJdbcEventLogger logQueryParameters
INFO: [batch bind: 1->ID:201, 2->MASTER_ID:NULL]
Apr 7, 2014 8:52:56 AM org.apache.cayenne.log.CommonsJdbcEventLogger logQueryParameters
INFO: [batch bind: 1->ID:202, 2->MASTER_ID:202]
Apr 7, 2014 8:52:56 AM org.apache.cayenne.log.CommonsJdbcEventLogger logUpdateCount
INFO: === updated 2 rows.
Apr 7, 2014 8:52:56 AM org.apache.cayenne.log.CommonsJdbcEventLogger logCommitTransaction
INFO: +++ transaction committed.
Apr 7, 2014 8:52:56 AM org.apache.cayenne.log.CommonsJdbcEventLogger logBeginTransaction
INFO: --- transaction started.
Apr 7, 2014 8:52:56 AM org.apache.cayenne.log.CommonsJdbcEventLogger logQuery
INFO: UPDATE CHILD SET MASTER_ID = ? WHERE ID = ?
Apr 7, 2014 8:52:56 AM org.apache.cayenne.log.CommonsJdbcEventLogger logQueryParameters
INFO: [batch bind: 1->MASTER_ID:202, 2->ID:201]
Apr 7, 2014 8:52:56 AM org.apache.cayenne.log.CommonsJdbcEventLogger logUpdateCount
INFO: === updated 1 row.
Apr 7, 2014 8:52:56 AM org.apache.cayenne.log.CommonsJdbcEventLogger logCommitTransaction
INFO: +++ transaction committed.
Apr 7, 2014 8:52:57 AM org.apache.cayenne.log.CommonsJdbcEventLogger logBeginTransaction
INFO: --- transaction started.
Apr 7, 2014 8:52:57 AM org.apache.cayenne.log.CommonsJdbcEventLogger logQuery
INFO: SELECT t0.MASTER_ID, t0.ID FROM CHILD t0 WHERE t0.MASTER_ID = ? [bind: 1->MASTER_ID:202]
Apr 7, 2014 8:52:57 AM org.apache.cayenne.log.CommonsJdbcEventLogger logSelectCount
INFO: === returned 2 rows. - took 5 ms.
Apr 7, 2014 8:52:57 AM org.apache.cayenne.log.CommonsJdbcEventLogger logCommitTransaction
INFO: +++ transaction committed.
Apr 7, 2014 8:52:57 AM org.apache.cayenne.configuration.XMLDataChannelDescriptorLoader load
INFO: Loading XML configuration resource from <https://builds.apache.org/job/Cayenne-trunk/cayenneTestConnection=derby,jdk=JDK%201.6%20(latest),label=Ubuntu/ws/trunk/cayenne-server/target/test-classes/cayenne-relationships.xml>
Apr 7, 2014 8:52:57 AM org.apache.cayenne.configuration.XMLDataChannelDescriptorLoader$DataChannelChildrenHandler
createChildTagHandler
INFO: Loading XML DataMap resource from <https://builds.apache.org/job/Cayenne-trunk/cayenneTestConnection=derby,jdk=JDK%201.6%20(latest),label=Ubuntu/ws/trunk/cayenne-server/target/test-classes/relationships.map.xml>
Apr 7, 2014 8:52:57 AM org.apache.cayenne.configuration.XMLDataChannelDescriptorLoader$DataChannelChildrenHandler
createChildTagHandler
INFO: Loading XML DataMap resource from <https://builds.apache.org/job/Cayenne-trunk/cayenneTestConnection=derby,jdk=JDK%201.6%20(latest),label=Ubuntu/ws/trunk/cayenne-server/target/test-classes/relationships1.map.xml>
Apr 7, 2014 8:52:57 AM org.apache.cayenne.map.EntityResolver applyDBLayerDefaults
INFO: added runtime complimentary DbRelationship from DELETE_RULE_TEST3 to DELETE_RULE_TEST1
Apr 7, 2014 8:52:57 AM org.apache.cayenne.log.CommonsJdbcEventLogger logBeginTransaction
INFO: --- transaction started.
Apr 7, 2014 8:52:57 AM org.apache.cayenne.log.CommonsJdbcEventLogger logQuery
INFO: INSERT INTO MASTER (ID, NAME) VALUES (?, ?)
Apr 7, 2014 8:52:57 AM org.apache.cayenne.log.CommonsJdbcEventLogger logQueryParameters
INFO: [batch bind: 1->ID:203, 2->NAME:'X']
Apr 7, 2014 8:52:57 AM org.apache.cayenne.log.CommonsJdbcEventLogger logUpdateCount
INFO: === updated 1 row.
Apr 7, 2014 8:52:57 AM org.apache.cayenne.log.CommonsJdbcEventLogger logCommitTransaction
INFO: +++ transaction committed.
Apr 7, 2014 8:52:57 AM org.apache.cayenne.log.CommonsJdbcEventLogger logBeginTransaction
INFO: --- transaction started.
Apr 7, 2014 8:52:57 AM org.apache.cayenne.log.CommonsJdbcEventLogger logQuery
INFO: UPDATE MASTER SET NAME = ? WHERE ID = ?
Apr 7, 2014 8:52:57 AM org.apache.cayenne.log.CommonsJdbcEventLogger logQueryParameters
INFO: [batch bind: 1->NAME:'Y', 2->ID:203]
Apr 7, 2014 8:52:57 AM org.apache.cayenne.log.CommonsJdbcEventLogger logUpdateCount
INFO: === updated 1 row.
Apr 7, 2014 8:52:57 AM org.apache.cayenne.log.CommonsJdbcEventLogger logCommitTransaction
INFO: +++ transaction committed.
Tests run: 3, Failures: 0, Errors: 0, Skipped: 0, Time elapsed: 1.07 sec
Running org.apache.cayenne.DataRowTest
Tests run: 1, Failures: 0, Errors: 0, Skipped: 0, Time elapsed: 0.002 sec
Running org.apache.cayenne.access.types.EnumTypeTest
Tests run: 7, Failures: 0, Errors: 0, Skipped: 0, Time elapsed: 0.003 sec
Running org.apache.cayenne.access.jdbc.SQLTemplateProcessorChainTest
Tests run: 11, Failures: 0, Errors: 0, Skipped: 0, Time elapsed: 0.017 sec
Running org.apache.cayenne.exp.parser.ASTObjPathTest
Tests run: 2, Failures: 0, Errors: 0, Skipped: 0, Time elapsed: 0.001 sec

Results :

Failed tests: 
  testFlattenedRelationship(org.apache.cayenne.access.DataContextDisjointByIdPrefetch_ExtrasTest)
  testLongFlattenedRelationship(org.apache.cayenne.access.DataContextDisjointByIdPrefetch_ExtrasTest)

Tests run: 2042, Failures: 2, Errors: 0, Skipped: 0

[INFO] ------------------------------------------------------------------------
[INFO] Reactor Summary:
[INFO] 
[INFO] Cayenne ........................................... SUCCESS [1.508s]
[INFO] Cayenne Build Tools Parent ........................ SUCCESS [0.021s]
[INFO] Cayenne License and Notice Bundle ................. SUCCESS [3.998s]
[INFO] Common Unit Test Utilities ........................ SUCCESS [2.539s]
[INFO] Cayenne Dependency Injection Container ............ SUCCESS [7.600s]
[INFO] Cayenne Server .................................... FAILURE [2:42.939s]
[INFO] Cayenne ROP Client ................................ SKIPPED
[INFO] Cayenne Project ................................... SKIPPED
[INFO] Cayenne Tools ..................................... SKIPPED
[INFO] Cayenne Lifecycle Utilities ....................... SKIPPED
[INFO] Cayenne Maven Plugins ............................. SKIPPED
[INFO] Cayenne Maven Plugin .............................. SKIPPED
[INFO] Cayenne Cryptography Extensions ................... SKIPPED
[INFO] Cayenne Integration Tests Parent .................. SKIPPED
[INFO] Integration Tests - Cayenne Tools ................. SKIPPED
[INFO] Cayenne Modeler Parent ............................ SKIPPED
[INFO] Cayenne WebObjects Compatibility Library .......... SKIPPED
[INFO] Cayenne Modeler ................................... SKIPPED
[INFO] Cayenne Modeler Maven Plugin ...................... SKIPPED
[INFO] Cayenne Tutorial .................................. SKIPPED
[INFO] Cayenne ROP Server Tutorial ....................... SKIPPED
[INFO] Cayenne ROP Client Tutorial ....................... SKIPPED
[INFO] Cayenne Tutorials ................................. SKIPPED
[INFO] Cayenne Documenation Parent ....................... SKIPPED
[INFO] Cayenne Documentation ............................. SKIPPED
[INFO] Cayenne Docbook Documentation ..................... SKIPPED
[INFO] Docbook: Cayenne Stylesheets ...................... SKIPPED
[INFO] Docbook: Cayenne Guide ............................ SKIPPED
[INFO] Docbook: Getting Started with Cayenne ............. SKIPPED
[INFO] Docbook: Getting Started with Cayenne ROP ......... SKIPPED
[INFO] Docbook: Cayenne New Features and Upgrade Guide ... SKIPPED
[INFO] ------------------------------------------------------------------------
[INFO] BUILD FAILURE
[INFO] ------------------------------------------------------------------------
[INFO] Total time: 3:01.067s
[INFO] Finished at: Mon Apr 07 08:52:58 UTC 2014
[INFO] Final Memory: 40M/252M
[INFO] ------------------------------------------------------------------------
[ERROR] Failed to execute goal org.apache.maven.plugins:maven-surefire-plugin:2.5:test (default-test)
on project cayenne-server: There are test failures.
[ERROR] 
[ERROR] Please refer to <https://builds.apache.org/job/Cayenne-trunk/cayenneTestConnection=derby,jdk=JDK%201.6%20(latest),label=Ubuntu/ws/trunk/cayenne-server/target/surefire-reports>
for the individual test results.
[ERROR] -> [Help 1]
org.apache.maven.lifecycle.LifecycleExecutionException: Failed to execute goal org.apache.maven.plugins:maven-surefire-plugin:2.5:test
(default-test) on project cayenne-server: There are test failures.

Please refer to <https://builds.apache.org/job/Cayenne-trunk/cayenneTestConnection=derby,jdk=JDK%201.6%20(latest),label=Ubuntu/ws/trunk/cayenne-server/target/surefire-reports>
for the individual test results.
	at org.apache.maven.lifecycle.internal.MojoExecutor.execute(MojoExecutor.java:213)
	at org.apache.maven.lifecycle.internal.MojoExecutor.execute(MojoExecutor.java:153)
	at org.apache.maven.lifecycle.internal.MojoExecutor.execute(MojoExecutor.java:145)
	at org.apache.maven.lifecycle.internal.LifecycleModuleBuilder.buildProject(LifecycleModuleBuilder.java:84)
	at org.apache.maven.lifecycle.internal.LifecycleModuleBuilder.buildProject(LifecycleModuleBuilder.java:59)
	at org.apache.maven.lifecycle.internal.LifecycleStarter.singleThreadedBuild(LifecycleStarter.java:183)
	at org.apache.maven.lifecycle.internal.LifecycleStarter.execute(LifecycleStarter.java:161)
	at org.apache.maven.DefaultMaven.doExecute(DefaultMaven.java:320)
	at org.apache.maven.DefaultMaven.execute(DefaultMaven.java:156)
	at org.apache.maven.cli.MavenCli.execute(MavenCli.java:537)
	at org.apache.maven.cli.MavenCli.doMain(MavenCli.java:196)
	at org.apache.maven.cli.MavenCli.main(MavenCli.java:141)
	at sun.reflect.NativeMethodAccessorImpl.invoke0(Native Method)
	at sun.reflect.NativeMethodAccessorImpl.invoke(NativeMethodAccessorImpl.java:39)
	at sun.reflect.DelegatingMethodAccessorImpl.invoke(DelegatingMethodAccessorImpl.java:25)
	at java.lang.reflect.Method.invoke(Method.java:597)
	at org.codehaus.plexus.classworlds.launcher.Launcher.launchEnhanced(Launcher.java:290)
	at org.codehaus.plexus.classworlds.launcher.Launcher.launch(Launcher.java:230)
	at org.codehaus.plexus.classworlds.launcher.Launcher.mainWithExitCode(Launcher.java:409)
	at org.codehaus.plexus.classworlds.launcher.Launcher.main(Launcher.java:352)
Caused by: org.apache.maven.plugin.MojoFailureException: There are test failures.

Please refer to <https://builds.apache.org/job/Cayenne-trunk/cayenneTestConnection=derby,jdk=JDK%201.6%20(latest),label=Ubuntu/ws/trunk/cayenne-server/target/surefire-reports>
for the individual test results.
	at org.apache.maven.plugin.surefire.SurefirePlugin.execute(SurefirePlugin.java:629)
	at org.apache.maven.plugin.DefaultBuildPluginManager.executeMojo(DefaultBuildPluginManager.java:101)
	at org.apache.maven.lifecycle.internal.MojoExecutor.execute(MojoExecutor.java:209)
	... 19 more
[ERROR] 
[ERROR] Re-run Maven using the -X switch to enable full debug logging.
[ERROR] 
[ERROR] For more information about the errors and possible solutions, please read the following
articles:
[ERROR] [Help 1] http://cwiki.apache.org/confluence/display/MAVEN/MojoFailureException
[ERROR] 
[ERROR] After correcting the problems, you can resume the build with the command
[ERROR]   mvn <goals> -rf :cayenne-server
Build step 'Invoke top-level Maven targets' marked build as failure

Mime
View raw message