cayenne-commits mailing list archives

Site index · List index
Message view « Date » · « Thread »
Top « Date » · « Thread »
From Apache Jenkins Server <jenk...@builds.apache.org>
Subject Build failed in Jenkins: Cayenne-trunk » h2,JDK 1.6 (latest),Ubuntu #992
Date Sun, 26 Jan 2014 16:52:38 GMT
See <https://builds.apache.org/job/Cayenne-trunk/cayenneTestConnection=h2,jdk=JDK%201.6%20(latest),label=Ubuntu/992/changes>

Changes:

[aadamchik] CAY-1796 ROP: All entity's to-many relationships getting faulted from database
when using it as a parameter in qualifier expression

release notes

[aadamchik] CAY-1796

patch by Oleg Artyukevich of Jan 21, 2014

[aadamchik] CAY-1796

patch by Oleg Artyukevich of Jan 21, 2014

------------------------------------------
[...truncated 102225 lines...]
Jan 26, 2014 4:52:38 PM org.apache.cayenne.configuration.XMLDataChannelDescriptorLoader$DataChannelChildrenHandler
createChildTagHandler
INFO: Loading XML DataMap resource from jar:file:/x1/jenkins/jenkins-slave/workspace/Cayenne-trunk/cayenneTestConnection/h2/jdk/JDK%201.6%20(latest)/label/Ubuntu/trunk/cayenne-server/target/cayenne-server-3.2.M2-SNAPSHOT-tests.jar!/multi-tier.map.xml
Jan 26, 2014 4:52:38 PM org.apache.cayenne.remote.BaseConnection sendMessage
INFO: --- Message 0: Bootstrap
Jan 26, 2014 4:52:38 PM org.apache.cayenne.remote.BaseConnection sendMessage
INFO: === Message 0: Bootstrap done - took 4 ms.
Jan 26, 2014 4:52:38 PM org.apache.cayenne.remote.BaseConnection sendMessage
INFO: --- Message 1: flush-cascade-sync
Jan 26, 2014 4:52:38 PM org.apache.cayenne.log.CommonsJdbcEventLogger logBeginTransaction
INFO: --- transaction started.
Jan 26, 2014 4:52:38 PM org.apache.cayenne.log.CommonsJdbcEventLogger logQuery
INFO: INSERT INTO MT_TABLE1 (GLOBAL_ATTRIBUTE1, SERVER_ATTRIBUTE1, SUBCLASS_ATTRIBUTE1, TABLE1_ID)
VALUES (?, ?, ?, ?)
Jan 26, 2014 4:52:38 PM org.apache.cayenne.log.CommonsJdbcEventLogger logQueryParameters
INFO: [bind: 1->GLOBAL_ATTRIBUTE1:NULL, 2->SERVER_ATTRIBUTE1:NULL, 3->SUBCLASS_ATTRIBUTE1:NULL,
4->TABLE1_ID:339]
Jan 26, 2014 4:52:38 PM org.apache.cayenne.log.CommonsJdbcEventLogger logUpdateCount
INFO: === updated 1 row.
Jan 26, 2014 4:52:38 PM org.apache.cayenne.log.CommonsJdbcEventLogger logCommitTransaction
INFO: +++ transaction committed.
Jan 26, 2014 4:52:38 PM org.apache.cayenne.remote.BaseConnection sendMessage
INFO: === Message 1: flush-cascade-sync done - took 2 ms.
Jan 26, 2014 4:52:38 PM org.apache.cayenne.remote.BaseConnection sendMessage
INFO: --- Message 2: flush-cascade-sync
Jan 26, 2014 4:52:38 PM org.apache.cayenne.log.CommonsJdbcEventLogger logBeginTransaction
INFO: --- transaction started.
Jan 26, 2014 4:52:38 PM org.apache.cayenne.log.CommonsJdbcEventLogger logQuery
INFO: DELETE FROM MT_TABLE1 WHERE TABLE1_ID = ?
Jan 26, 2014 4:52:38 PM org.apache.cayenne.log.CommonsJdbcEventLogger logQueryParameters
INFO: [bind: 1->TABLE1_ID:339]
Jan 26, 2014 4:52:38 PM org.apache.cayenne.log.CommonsJdbcEventLogger logUpdateCount
INFO: === updated 1 row.
Jan 26, 2014 4:52:38 PM org.apache.cayenne.log.CommonsJdbcEventLogger logCommitTransaction
INFO: +++ transaction committed.
Jan 26, 2014 4:52:38 PM org.apache.cayenne.remote.BaseConnection sendMessage
INFO: === Message 2: flush-cascade-sync done - took 1 ms.
Jan 26, 2014 4:52:38 PM org.apache.cayenne.configuration.XMLDataChannelDescriptorLoader load
INFO: Loading XML configuration resource from jar:file:/x1/jenkins/jenkins-slave/workspace/Cayenne-trunk/cayenneTestConnection/h2/jdk/JDK%201.6%20(latest)/label/Ubuntu/trunk/cayenne-server/target/cayenne-server-3.2.M2-SNAPSHOT-tests.jar!/cayenne-multi-tier.xml
Jan 26, 2014 4:52:38 PM org.apache.cayenne.configuration.XMLDataChannelDescriptorLoader$DataChannelChildrenHandler
createChildTagHandler
INFO: Loading XML DataMap resource from jar:file:/x1/jenkins/jenkins-slave/workspace/Cayenne-trunk/cayenneTestConnection/h2/jdk/JDK%201.6%20(latest)/label/Ubuntu/trunk/cayenne-server/target/cayenne-server-3.2.M2-SNAPSHOT-tests.jar!/multi-tier.map.xml
Jan 26, 2014 4:52:38 PM org.apache.cayenne.remote.BaseConnection sendMessage
INFO: --- Message 0: Bootstrap
Jan 26, 2014 4:52:38 PM org.apache.cayenne.remote.BaseConnection sendMessage
INFO: === Message 0: Bootstrap done - took 3 ms.
Jan 26, 2014 4:52:38 PM org.apache.cayenne.remote.BaseConnection sendMessage
INFO: --- Message 1: flush-cascade-sync
Jan 26, 2014 4:52:38 PM org.apache.cayenne.log.CommonsJdbcEventLogger logBeginTransaction
INFO: --- transaction started.
Jan 26, 2014 4:52:38 PM org.apache.cayenne.log.CommonsJdbcEventLogger logQuery
INFO: SELECT NEXT VALUE FOR pk_mt_table1
Jan 26, 2014 4:52:38 PM org.apache.cayenne.log.CommonsJdbcEventLogger logQuery
INFO: INSERT INTO MT_TABLE1 (GLOBAL_ATTRIBUTE1, SERVER_ATTRIBUTE1, SUBCLASS_ATTRIBUTE1, TABLE1_ID)
VALUES (?, ?, ?, ?)
Jan 26, 2014 4:52:38 PM org.apache.cayenne.log.CommonsJdbcEventLogger logQueryParameters
INFO: [bind: 1->GLOBAL_ATTRIBUTE1:NULL, 2->SERVER_ATTRIBUTE1:NULL, 3->SUBCLASS_ATTRIBUTE1:NULL,
4->TABLE1_ID:200]
Jan 26, 2014 4:52:38 PM org.apache.cayenne.log.CommonsJdbcEventLogger logUpdateCount
INFO: === updated 1 row.
Jan 26, 2014 4:52:38 PM org.apache.cayenne.log.CommonsJdbcEventLogger logCommitTransaction
INFO: +++ transaction committed.
Jan 26, 2014 4:52:38 PM org.apache.cayenne.remote.BaseConnection sendMessage
INFO: === Message 1: flush-cascade-sync done - took 7 ms.
Jan 26, 2014 4:52:38 PM org.apache.cayenne.remote.BaseConnection sendMessage
INFO: --- Message 2: flush-cascade-sync
Jan 26, 2014 4:52:38 PM org.apache.cayenne.log.CommonsJdbcEventLogger logBeginTransaction
INFO: --- transaction started.
Jan 26, 2014 4:52:38 PM org.apache.cayenne.log.CommonsJdbcEventLogger logQuery
INFO: DELETE FROM MT_TABLE1 WHERE TABLE1_ID = ?
Jan 26, 2014 4:52:38 PM org.apache.cayenne.log.CommonsJdbcEventLogger logQueryParameters
INFO: [bind: 1->TABLE1_ID:200]
Jan 26, 2014 4:52:38 PM org.apache.cayenne.log.CommonsJdbcEventLogger logUpdateCount
INFO: === updated 1 row.
Jan 26, 2014 4:52:38 PM org.apache.cayenne.log.CommonsJdbcEventLogger logCommitTransaction
INFO: +++ transaction committed.
Jan 26, 2014 4:52:38 PM org.apache.cayenne.remote.BaseConnection sendMessage
INFO: === Message 2: flush-cascade-sync done - took 1 ms.
Jan 26, 2014 4:52:38 PM org.apache.cayenne.configuration.XMLDataChannelDescriptorLoader load
INFO: Loading XML configuration resource from jar:file:/x1/jenkins/jenkins-slave/workspace/Cayenne-trunk/cayenneTestConnection/h2/jdk/JDK%201.6%20(latest)/label/Ubuntu/trunk/cayenne-server/target/cayenne-server-3.2.M2-SNAPSHOT-tests.jar!/cayenne-multi-tier.xml
Jan 26, 2014 4:52:38 PM org.apache.cayenne.configuration.XMLDataChannelDescriptorLoader$DataChannelChildrenHandler
createChildTagHandler
INFO: Loading XML DataMap resource from jar:file:/x1/jenkins/jenkins-slave/workspace/Cayenne-trunk/cayenneTestConnection/h2/jdk/JDK%201.6%20(latest)/label/Ubuntu/trunk/cayenne-server/target/cayenne-server-3.2.M2-SNAPSHOT-tests.jar!/multi-tier.map.xml
Jan 26, 2014 4:52:38 PM org.apache.cayenne.remote.BaseConnection sendMessage
INFO: --- Message 0: Bootstrap
Jan 26, 2014 4:52:38 PM org.apache.cayenne.remote.BaseConnection sendMessage
INFO: === Message 0: Bootstrap done - took 1 ms.
Jan 26, 2014 4:52:38 PM org.apache.cayenne.remote.BaseConnection sendMessage
INFO: --- Message 1: flush-cascade-sync
Jan 26, 2014 4:52:38 PM org.apache.cayenne.log.CommonsJdbcEventLogger logBeginTransaction
INFO: --- transaction started.
Jan 26, 2014 4:52:38 PM org.apache.cayenne.log.CommonsJdbcEventLogger logQuery
INFO: INSERT INTO MT_TABLE1 (GLOBAL_ATTRIBUTE1, SERVER_ATTRIBUTE1, SUBCLASS_ATTRIBUTE1, TABLE1_ID)
VALUES (?, ?, ?, ?)
Jan 26, 2014 4:52:38 PM org.apache.cayenne.log.CommonsJdbcEventLogger logQueryParameters
INFO: [bind: 1->GLOBAL_ATTRIBUTE1:NULL, 2->SERVER_ATTRIBUTE1:NULL, 3->SUBCLASS_ATTRIBUTE1:NULL,
4->TABLE1_ID:201]
Jan 26, 2014 4:52:38 PM org.apache.cayenne.log.CommonsJdbcEventLogger logUpdateCount
INFO: === updated 1 row.
Jan 26, 2014 4:52:38 PM org.apache.cayenne.log.CommonsJdbcEventLogger logCommitTransaction
INFO: +++ transaction committed.
Jan 26, 2014 4:52:38 PM org.apache.cayenne.remote.BaseConnection sendMessage
INFO: === Message 1: flush-cascade-sync done - took 2 ms.
Jan 26, 2014 4:52:38 PM org.apache.cayenne.remote.BaseConnection sendMessage
INFO: --- Message 2: flush-cascade-sync
Jan 26, 2014 4:52:38 PM org.apache.cayenne.log.CommonsJdbcEventLogger logBeginTransaction
INFO: --- transaction started.
Jan 26, 2014 4:52:38 PM org.apache.cayenne.log.CommonsJdbcEventLogger logQuery
INFO: DELETE FROM MT_TABLE1 WHERE TABLE1_ID = ?
Jan 26, 2014 4:52:38 PM org.apache.cayenne.log.CommonsJdbcEventLogger logQueryParameters
INFO: [bind: 1->TABLE1_ID:201]
Jan 26, 2014 4:52:38 PM org.apache.cayenne.log.CommonsJdbcEventLogger logUpdateCount
INFO: === updated 1 row.
Jan 26, 2014 4:52:38 PM org.apache.cayenne.log.CommonsJdbcEventLogger logCommitTransaction
INFO: +++ transaction committed.
Jan 26, 2014 4:52:38 PM org.apache.cayenne.remote.BaseConnection sendMessage
INFO: === Message 2: flush-cascade-sync done - took 1 ms.
Tests run: 1, Failures: 0, Errors: 0, Skipped: 0, Time elapsed: 0.102 sec
Running org.apache.cayenne.DataRowTest
Tests run: 1, Failures: 0, Errors: 0, Skipped: 0, Time elapsed: 0.001 sec
Running org.apache.cayenne.configuration.rop.client.ClientLocalRuntimeTest
Tests run: 2, Failures: 0, Errors: 0, Skipped: 0, Time elapsed: 0.023 sec
Running org.apache.cayenne.remote.ClientChannelTest
Tests run: 4, Failures: 0, Errors: 0, Skipped: 0, Time elapsed: 0.013 sec
Running org.apache.cayenne.CayenneContextTest
Jan 26, 2014 4:52:38 PM org.apache.cayenne.configuration.XMLDataChannelDescriptorLoader load
INFO: Loading XML configuration resource from jar:file:/x1/jenkins/jenkins-slave/workspace/Cayenne-trunk/cayenneTestConnection/h2/jdk/JDK%201.6%20(latest)/label/Ubuntu/trunk/cayenne-server/target/cayenne-server-3.2.M2-SNAPSHOT-tests.jar!/cayenne-multi-tier.xml
Jan 26, 2014 4:52:38 PM org.apache.cayenne.configuration.XMLDataChannelDescriptorLoader$DataChannelChildrenHandler
createChildTagHandler
INFO: Loading XML DataMap resource from jar:file:/x1/jenkins/jenkins-slave/workspace/Cayenne-trunk/cayenneTestConnection/h2/jdk/JDK%201.6%20(latest)/label/Ubuntu/trunk/cayenne-server/target/cayenne-server-3.2.M2-SNAPSHOT-tests.jar!/multi-tier.map.xml
Jan 26, 2014 4:52:38 PM org.apache.cayenne.configuration.XMLDataChannelDescriptorLoader load
INFO: Loading XML configuration resource from jar:file:/x1/jenkins/jenkins-slave/workspace/Cayenne-trunk/cayenneTestConnection/h2/jdk/JDK%201.6%20(latest)/label/Ubuntu/trunk/cayenne-server/target/cayenne-server-3.2.M2-SNAPSHOT-tests.jar!/cayenne-multi-tier.xml
Jan 26, 2014 4:52:38 PM org.apache.cayenne.configuration.XMLDataChannelDescriptorLoader$DataChannelChildrenHandler
createChildTagHandler
INFO: Loading XML DataMap resource from jar:file:/x1/jenkins/jenkins-slave/workspace/Cayenne-trunk/cayenneTestConnection/h2/jdk/JDK%201.6%20(latest)/label/Ubuntu/trunk/cayenne-server/target/cayenne-server-3.2.M2-SNAPSHOT-tests.jar!/multi-tier.map.xml
Jan 26, 2014 4:52:38 PM org.apache.cayenne.configuration.XMLDataChannelDescriptorLoader load
INFO: Loading XML configuration resource from jar:file:/x1/jenkins/jenkins-slave/workspace/Cayenne-trunk/cayenneTestConnection/h2/jdk/JDK%201.6%20(latest)/label/Ubuntu/trunk/cayenne-server/target/cayenne-server-3.2.M2-SNAPSHOT-tests.jar!/cayenne-multi-tier.xml
Jan 26, 2014 4:52:38 PM org.apache.cayenne.configuration.XMLDataChannelDescriptorLoader$DataChannelChildrenHandler
createChildTagHandler
INFO: Loading XML DataMap resource from jar:file:/x1/jenkins/jenkins-slave/workspace/Cayenne-trunk/cayenneTestConnection/h2/jdk/JDK%201.6%20(latest)/label/Ubuntu/trunk/cayenne-server/target/cayenne-server-3.2.M2-SNAPSHOT-tests.jar!/multi-tier.map.xml
Jan 26, 2014 4:52:38 PM org.apache.cayenne.configuration.XMLDataChannelDescriptorLoader load
INFO: Loading XML configuration resource from jar:file:/x1/jenkins/jenkins-slave/workspace/Cayenne-trunk/cayenneTestConnection/h2/jdk/JDK%201.6%20(latest)/label/Ubuntu/trunk/cayenne-server/target/cayenne-server-3.2.M2-SNAPSHOT-tests.jar!/cayenne-multi-tier.xml
Jan 26, 2014 4:52:38 PM org.apache.cayenne.configuration.XMLDataChannelDescriptorLoader$DataChannelChildrenHandler
createChildTagHandler
INFO: Loading XML DataMap resource from jar:file:/x1/jenkins/jenkins-slave/workspace/Cayenne-trunk/cayenneTestConnection/h2/jdk/JDK%201.6%20(latest)/label/Ubuntu/trunk/cayenne-server/target/cayenne-server-3.2.M2-SNAPSHOT-tests.jar!/multi-tier.map.xml
Jan 26, 2014 4:52:38 PM org.apache.cayenne.configuration.XMLDataChannelDescriptorLoader load
INFO: Loading XML configuration resource from jar:file:/x1/jenkins/jenkins-slave/workspace/Cayenne-trunk/cayenneTestConnection/h2/jdk/JDK%201.6%20(latest)/label/Ubuntu/trunk/cayenne-server/target/cayenne-server-3.2.M2-SNAPSHOT-tests.jar!/cayenne-multi-tier.xml
Jan 26, 2014 4:52:38 PM org.apache.cayenne.configuration.XMLDataChannelDescriptorLoader$DataChannelChildrenHandler
createChildTagHandler
INFO: Loading XML DataMap resource from jar:file:/x1/jenkins/jenkins-slave/workspace/Cayenne-trunk/cayenneTestConnection/h2/jdk/JDK%201.6%20(latest)/label/Ubuntu/trunk/cayenne-server/target/cayenne-server-3.2.M2-SNAPSHOT-tests.jar!/multi-tier.map.xml
Jan 26, 2014 4:52:38 PM org.apache.cayenne.configuration.XMLDataChannelDescriptorLoader load
INFO: Loading XML configuration resource from jar:file:/x1/jenkins/jenkins-slave/workspace/Cayenne-trunk/cayenneTestConnection/h2/jdk/JDK%201.6%20(latest)/label/Ubuntu/trunk/cayenne-server/target/cayenne-server-3.2.M2-SNAPSHOT-tests.jar!/cayenne-multi-tier.xml
Jan 26, 2014 4:52:38 PM org.apache.cayenne.configuration.XMLDataChannelDescriptorLoader$DataChannelChildrenHandler
createChildTagHandler
INFO: Loading XML DataMap resource from jar:file:/x1/jenkins/jenkins-slave/workspace/Cayenne-trunk/cayenneTestConnection/h2/jdk/JDK%201.6%20(latest)/label/Ubuntu/trunk/cayenne-server/target/cayenne-server-3.2.M2-SNAPSHOT-tests.jar!/multi-tier.map.xml
Jan 26, 2014 4:52:38 PM org.apache.cayenne.configuration.XMLDataChannelDescriptorLoader load
INFO: Loading XML configuration resource from jar:file:/x1/jenkins/jenkins-slave/workspace/Cayenne-trunk/cayenneTestConnection/h2/jdk/JDK%201.6%20(latest)/label/Ubuntu/trunk/cayenne-server/target/cayenne-server-3.2.M2-SNAPSHOT-tests.jar!/cayenne-multi-tier.xml
Jan 26, 2014 4:52:38 PM org.apache.cayenne.configuration.XMLDataChannelDescriptorLoader$DataChannelChildrenHandler
createChildTagHandler
INFO: Loading XML DataMap resource from jar:file:/x1/jenkins/jenkins-slave/workspace/Cayenne-trunk/cayenneTestConnection/h2/jdk/JDK%201.6%20(latest)/label/Ubuntu/trunk/cayenne-server/target/cayenne-server-3.2.M2-SNAPSHOT-tests.jar!/multi-tier.map.xml
Jan 26, 2014 4:52:38 PM org.apache.cayenne.configuration.XMLDataChannelDescriptorLoader load
INFO: Loading XML configuration resource from jar:file:/x1/jenkins/jenkins-slave/workspace/Cayenne-trunk/cayenneTestConnection/h2/jdk/JDK%201.6%20(latest)/label/Ubuntu/trunk/cayenne-server/target/cayenne-server-3.2.M2-SNAPSHOT-tests.jar!/cayenne-multi-tier.xml
Jan 26, 2014 4:52:38 PM org.apache.cayenne.configuration.XMLDataChannelDescriptorLoader$DataChannelChildrenHandler
createChildTagHandler
INFO: Loading XML DataMap resource from jar:file:/x1/jenkins/jenkins-slave/workspace/Cayenne-trunk/cayenneTestConnection/h2/jdk/JDK%201.6%20(latest)/label/Ubuntu/trunk/cayenne-server/target/cayenne-server-3.2.M2-SNAPSHOT-tests.jar!/multi-tier.map.xml
Jan 26, 2014 4:52:38 PM org.apache.cayenne.configuration.XMLDataChannelDescriptorLoader load
INFO: Loading XML configuration resource from jar:file:/x1/jenkins/jenkins-slave/workspace/Cayenne-trunk/cayenneTestConnection/h2/jdk/JDK%201.6%20(latest)/label/Ubuntu/trunk/cayenne-server/target/cayenne-server-3.2.M2-SNAPSHOT-tests.jar!/cayenne-multi-tier.xml
Jan 26, 2014 4:52:38 PM org.apache.cayenne.configuration.XMLDataChannelDescriptorLoader$DataChannelChildrenHandler
createChildTagHandler
INFO: Loading XML DataMap resource from jar:file:/x1/jenkins/jenkins-slave/workspace/Cayenne-trunk/cayenneTestConnection/h2/jdk/JDK%201.6%20(latest)/label/Ubuntu/trunk/cayenne-server/target/cayenne-server-3.2.M2-SNAPSHOT-tests.jar!/multi-tier.map.xml
Tests run: 9, Failures: 0, Errors: 0, Skipped: 0, Time elapsed: 0.092 sec

Results :

Tests in error: 
  testExpressionFactoryMatchAll(org.apache.cayenne.query.ClientExpressionTest)
  testExpressionFactoryMatchAny(org.apache.cayenne.query.ClientExpressionTest)
  testExpressionFactoryIn(org.apache.cayenne.query.ClientExpressionTest)
  testExpressionFactoryBetween(org.apache.cayenne.query.ClientExpressionTest)
  testExpressionFactoryOperators(org.apache.cayenne.query.ClientExpressionTest)
  testExpressionWithParameters(org.apache.cayenne.query.ClientExpressionTest)

Tests run: 217, Failures: 0, Errors: 6, Skipped: 0

[INFO] ------------------------------------------------------------------------
[INFO] Reactor Summary:
[INFO] 
[INFO] Cayenne ........................................... SUCCESS [0.484s]
[INFO] Cayenne Build Tools Parent ........................ SUCCESS [0.015s]
[INFO] Cayenne License and Notice Bundle ................. SUCCESS [1.823s]
[INFO] Common Unit Test Utilities ........................ SUCCESS [1.077s]
[INFO] Cayenne Dependency Injection Container ............ SUCCESS [3.413s]
[INFO] Cayenne Server .................................... SUCCESS [1:35.595s]
[INFO] Cayenne ROP Client ................................ FAILURE [18.016s]
[INFO] Cayenne Project ................................... SKIPPED
[INFO] Cayenne Tools ..................................... SKIPPED
[INFO] Cayenne Lifecycle Utilities ....................... SKIPPED
[INFO] Cayenne Integration Tests Parent .................. SKIPPED
[INFO] Cayenne Maven Plugins ............................. SKIPPED
[INFO] Cayenne Maven Plugin .............................. SKIPPED
[INFO] Integration Tests - Cayenne Tools ................. SKIPPED
[INFO] Cayenne Modeler Parent ............................ SKIPPED
[INFO] Cayenne WebObjects Compatibility Library .......... SKIPPED
[INFO] Cayenne Modeler ................................... SKIPPED
[INFO] Cayenne Modeler Maven Plugin ...................... SKIPPED
[INFO] Cayenne Tutorial .................................. SKIPPED
[INFO] Cayenne ROP Server Tutorial ....................... SKIPPED
[INFO] Cayenne ROP Client Tutorial ....................... SKIPPED
[INFO] Cayenne Tutorials ................................. SKIPPED
[INFO] Cayenne Documenation Parent ....................... SKIPPED
[INFO] Cayenne Documentation ............................. SKIPPED
[INFO] Cayenne Docbook Documentation ..................... SKIPPED
[INFO] Docbook: Cayenne Stylesheets ...................... SKIPPED
[INFO] Docbook: Cayenne Guide ............................ SKIPPED
[INFO] Docbook: Getting Started with Cayenne ............. SKIPPED
[INFO] Docbook: Getting Started with Cayenne ROP ......... SKIPPED
[INFO] Docbook: Cayenne New Features and Upgrade Guide ... SKIPPED
[INFO] ------------------------------------------------------------------------
[INFO] BUILD FAILURE
[INFO] ------------------------------------------------------------------------
[INFO] Total time: 2:01.608s
[INFO] Finished at: Sun Jan 26 16:52:38 UTC 2014
[INFO] Final Memory: 45M/235M
[INFO] ------------------------------------------------------------------------
[ERROR] Failed to execute goal org.apache.maven.plugins:maven-surefire-plugin:2.5:test (default-test)
on project cayenne-client: There are test failures.
[ERROR] 
[ERROR] Please refer to /x1/jenkins/jenkins-slave/workspace/Cayenne-trunk/cayenneTestConnection/h2/jdk/JDK
1.6 (latest)/label/Ubuntu/trunk/cayenne-client/target/surefire-reports for the individual
test results.
[ERROR] -> [Help 1]
org.apache.maven.lifecycle.LifecycleExecutionException: Failed to execute goal org.apache.maven.plugins:maven-surefire-plugin:2.5:test
(default-test) on project cayenne-client: There are test failures.

Please refer to /x1/jenkins/jenkins-slave/workspace/Cayenne-trunk/cayenneTestConnection/h2/jdk/JDK
1.6 (latest)/label/Ubuntu/trunk/cayenne-client/target/surefire-reports for the individual
test results.
	at org.apache.maven.lifecycle.internal.MojoExecutor.execute(MojoExecutor.java:213)
	at org.apache.maven.lifecycle.internal.MojoExecutor.execute(MojoExecutor.java:153)
	at org.apache.maven.lifecycle.internal.MojoExecutor.execute(MojoExecutor.java:145)
	at org.apache.maven.lifecycle.internal.LifecycleModuleBuilder.buildProject(LifecycleModuleBuilder.java:84)
	at org.apache.maven.lifecycle.internal.LifecycleModuleBuilder.buildProject(LifecycleModuleBuilder.java:59)
	at org.apache.maven.lifecycle.internal.LifecycleStarter.singleThreadedBuild(LifecycleStarter.java:183)
	at org.apache.maven.lifecycle.internal.LifecycleStarter.execute(LifecycleStarter.java:161)
	at org.apache.maven.DefaultMaven.doExecute(DefaultMaven.java:320)
	at org.apache.maven.DefaultMaven.execute(DefaultMaven.java:156)
	at org.apache.maven.cli.MavenCli.execute(MavenCli.java:537)
	at org.apache.maven.cli.MavenCli.doMain(MavenCli.java:196)
	at org.apache.maven.cli.MavenCli.main(MavenCli.java:141)
	at sun.reflect.NativeMethodAccessorImpl.invoke0(Native Method)
	at sun.reflect.NativeMethodAccessorImpl.invoke(NativeMethodAccessorImpl.java:39)
	at sun.reflect.DelegatingMethodAccessorImpl.invoke(DelegatingMethodAccessorImpl.java:25)
	at java.lang.reflect.Method.invoke(Method.java:597)
	at org.codehaus.plexus.classworlds.launcher.Launcher.launchEnhanced(Launcher.java:290)
	at org.codehaus.plexus.classworlds.launcher.Launcher.launch(Launcher.java:230)
	at org.codehaus.plexus.classworlds.launcher.Launcher.mainWithExitCode(Launcher.java:409)
	at org.codehaus.plexus.classworlds.launcher.Launcher.main(Launcher.java:352)
Caused by: org.apache.maven.plugin.MojoFailureException: There are test failures.

Please refer to /x1/jenkins/jenkins-slave/workspace/Cayenne-trunk/cayenneTestConnection/h2/jdk/JDK
1.6 (latest)/label/Ubuntu/trunk/cayenne-client/target/surefire-reports for the individual
test results.
	at org.apache.maven.plugin.surefire.SurefirePlugin.execute(SurefirePlugin.java:629)
	at org.apache.maven.plugin.DefaultBuildPluginManager.executeMojo(DefaultBuildPluginManager.java:101)
	at org.apache.maven.lifecycle.internal.MojoExecutor.execute(MojoExecutor.java:209)
	... 19 more
[ERROR] 
[ERROR] Re-run Maven using the -X switch to enable full debug logging.
[ERROR] 
[ERROR] For more information about the errors and possible solutions, please read the following
articles:
[ERROR] [Help 1] http://cwiki.apache.org/confluence/display/MAVEN/MojoFailureException
[ERROR] 
[ERROR] After correcting the problems, you can resume the build with the command
[ERROR]   mvn <goals> -rf :cayenne-client
Build step 'Invoke top-level Maven targets' marked build as failure

Mime
View raw message