cayenne-commits mailing list archives

Site index · List index
Message view « Date » · « Thread »
Top « Date » · « Thread »
From Apache Jenkins Server <jenk...@builds.apache.org>
Subject Build failed in Jenkins: Cayenne-trunk » h2,JDK 1.6 (latest),Ubuntu #990
Date Sun, 05 Jan 2014 16:53:11 GMT
See <https://builds.apache.org/job/Cayenne-trunk/cayenneTestConnection=h2,jdk=JDK%201.6%20(latest),label=Ubuntu/990/changes>

Changes:

[aadamchik] transferring old ROP docs

[aadamchik] renaming rop chapters to start with rop-

[aadamchik] renaming

[aadamchik] replacing confluence-style waring blocks with 'note' docbook sections

[aadamchik] updating copyright year

[aadamchik] Using only major version in docs metadata

otherwise Google is confused how to find docs for a given v. of Cayenne

------------------------------------------
[...truncated 108292 lines...]
[INFO] Executing tasks
     [copy] Copying 2 files to /x1/jenkins/jenkins-slave/workspace/Cayenne-trunk/cayenneTestConnection/h2/jdk/JDK
1.6 (latest)/label/Ubuntu/trunk/docs/docbook/getting-started/target/site/index/css
     [copy] Copying 13 files to /x1/jenkins/jenkins-slave/workspace/Cayenne-trunk/cayenneTestConnection/h2/jdk/JDK
1.6 (latest)/label/Ubuntu/trunk/docs/docbook/getting-started/target/site/index/images
[INFO] Executed tasks
[INFO] 
[INFO] --- maven-resources-plugin:2.4.3:resources (default-resources) @ getting-started ---
[INFO] Using 'UTF-8' encoding to copy filtered resources.
[INFO] Copying 30 resources
[INFO] 
[INFO] --- maven-compiler-plugin:2.3.2:compile (default-compile) @ getting-started ---
[INFO] No sources to compile
[INFO] 
[INFO] --- maven-resources-plugin:2.4.3:testResources (default-testResources) @ getting-started
---
[INFO] Using 'UTF-8' encoding to copy filtered resources.
[INFO] skip non existing resourceDirectory /x1/jenkins/jenkins-slave/workspace/Cayenne-trunk/cayenneTestConnection/h2/jdk/JDK
1.6 (latest)/label/Ubuntu/trunk/docs/docbook/getting-started/src/test/resources
[INFO] 
[INFO] --- maven-compiler-plugin:2.3.2:testCompile (default-testCompile) @ getting-started
---
[INFO] No sources to compile
[INFO] 
[INFO] --- maven-surefire-plugin:2.5:test (default-test) @ getting-started ---
[INFO] No tests to run.
[INFO] 
[INFO] --- maven-jar-plugin:2.3.2:jar (default-jar) @ getting-started ---
[INFO] Building jar: /x1/jenkins/jenkins-slave/workspace/Cayenne-trunk/cayenneTestConnection/h2/jdk/JDK
1.6 (latest)/label/Ubuntu/trunk/docs/docbook/getting-started/target/getting-started-3.2.M2-SNAPSHOT.jar
[INFO] 
[INFO] >>> maven-source-plugin:2.1.2:jar (bundle-source-jar) @ getting-started >>>
[INFO] 
[INFO] <<< maven-source-plugin:2.1.2:jar (bundle-source-jar) @ getting-started <<<
[INFO] 
[INFO] --- maven-source-plugin:2.1.2:jar (bundle-source-jar) @ getting-started ---
[INFO] Building jar: /x1/jenkins/jenkins-slave/workspace/Cayenne-trunk/cayenneTestConnection/h2/jdk/JDK
1.6 (latest)/label/Ubuntu/trunk/docs/docbook/getting-started/target/getting-started-3.2.M2-SNAPSHOT-sources.jar
[INFO] 
[INFO] --- maven-install-plugin:2.3.1:install (default-install) @ getting-started ---
[INFO] Installing /x1/jenkins/jenkins-slave/workspace/Cayenne-trunk/cayenneTestConnection/h2/jdk/JDK
1.6 (latest)/label/Ubuntu/trunk/docs/docbook/getting-started/target/getting-started-3.2.M2-SNAPSHOT.jar
to <https://builds.apache.org/job/Cayenne-trunk/cayenneTestConnection=h2,jdk=JDK%201.6%20(latest),label=Ubuntu/ws/.repository/org/apache/cayenne/docs/getting-started/3.2.M2-SNAPSHOT/getting-started-3.2.M2-SNAPSHOT.jar>
[INFO] Installing /x1/jenkins/jenkins-slave/workspace/Cayenne-trunk/cayenneTestConnection/h2/jdk/JDK
1.6 (latest)/label/Ubuntu/trunk/docs/docbook/getting-started/pom.xml to <https://builds.apache.org/job/Cayenne-trunk/cayenneTestConnection=h2,jdk=JDK%201.6%20(latest),label=Ubuntu/ws/.repository/org/apache/cayenne/docs/getting-started/3.2.M2-SNAPSHOT/getting-started-3.2.M2-SNAPSHOT.pom>
[INFO] Installing /x1/jenkins/jenkins-slave/workspace/Cayenne-trunk/cayenneTestConnection/h2/jdk/JDK
1.6 (latest)/label/Ubuntu/trunk/docs/docbook/getting-started/target/getting-started-3.2.M2-SNAPSHOT-sources.jar
to <https://builds.apache.org/job/Cayenne-trunk/cayenneTestConnection=h2,jdk=JDK%201.6%20(latest),label=Ubuntu/ws/.repository/org/apache/cayenne/docs/getting-started/3.2.M2-SNAPSHOT/getting-started-3.2.M2-SNAPSHOT-sources.jar>
[INFO]                                                                         
[INFO] ------------------------------------------------------------------------
[INFO] Building Docbook: Getting Started with Cayenne ROP 3.2.M2-SNAPSHOT
[INFO] ------------------------------------------------------------------------
[INFO] 
[INFO] --- maven-clean-plugin:2.4.1:clean (default-clean) @ getting-started-rop ---
[INFO] 
[INFO] --- docbkx-maven-plugin:2.0.14:generate-pdf (build-pdf) @ getting-started-rop ---
[INFO] Processing input file: index.xml
[INFO] Applying customization parameters
[INFO] targetFileExtension pdf
[INFO] type fo
Jan 5, 2014 4:53:00 PM org.apache.fop.events.LoggingEventListener processEvent
WARNING: Font "Symbol,normal,700" not found. Substituting with "Symbol,normal,400".
Jan 5, 2014 4:53:00 PM org.apache.fop.events.LoggingEventListener processEvent
WARNING: Font "ZapfDingbats,normal,700" not found. Substituting with "ZapfDingbats,normal,400".
Jan 5, 2014 4:53:01 PM org.apache.fop.events.LoggingEventListener processEvent
WARNING: Line 1 of a paragraph overflows the available area by 22171 millipoints. (See position
39:661)
Jan 5, 2014 4:53:01 PM org.apache.fop.events.LoggingEventListener processEvent
WARNING: Line 1 of a paragraph overflows the available area by 26971 millipoints. (See position
39:661)
Jan 5, 2014 4:53:06 PM org.apache.fop.events.LoggingEventListener processEvent
WARNING: Line 1 of a paragraph overflows the available area by 22171 millipoints. (See position
81:702)
Jan 5, 2014 4:53:06 PM org.apache.fop.events.LoggingEventListener processEvent
WARNING: Line 1 of a paragraph overflows the available area by 2971 millipoints. (See position
81:702)
Jan 5, 2014 4:53:06 PM org.apache.fop.events.LoggingEventListener processEvent
WARNING: Line 1 of a paragraph overflows the available area by 2971 millipoints. (See position
120:708)
Jan 5, 2014 4:53:06 PM org.apache.fop.events.LoggingEventListener processEvent
WARNING: Line 1 of a paragraph overflows the available area by 12571 millipoints. (See position
174:668)
Jan 5, 2014 4:53:06 PM org.apache.fop.events.LoggingEventListener processEvent
WARNING: Line 1 of a paragraph overflows the available area by more than 50 points. (See position
223:632)
Jan 5, 2014 4:53:06 PM org.apache.fop.events.LoggingEventListener processEvent
WARNING: Line 1 of a paragraph overflows the available area by 7771 millipoints. (See position
246:655)
Jan 5, 2014 4:53:06 PM org.apache.fop.events.LoggingEventListener processEvent
WARNING: Line 1 of a paragraph overflows the available area by more than 50 points. (See position
246:655)
Jan 5, 2014 4:53:06 PM org.apache.fop.events.LoggingEventListener processEvent
WARNING: Content overflows the viewport of the fo:region-before on page 11 in block-progression
direction by 4904 millipoints. (See position 161:1510)
Jan 5, 2014 4:53:06 PM org.apache.fop.events.LoggingEventListener processEvent
WARNING: Content overflows the viewport of the fo:region-before on page 12 in block-progression
direction by 4904 millipoints. (See position 161:1510)
Jan 5, 2014 4:53:06 PM org.apache.fop.events.LoggingEventListener processEvent
WARNING: Content overflows the viewport of the fo:region-before on page 13 in block-progression
direction by 4904 millipoints. (See position 161:1510)
Jan 5, 2014 4:53:06 PM org.apache.fop.events.LoggingEventListener processEvent
WARNING: Line 1 of a paragraph overflows the available area by 36571 millipoints. (See position
330:1747)
Jan 5, 2014 4:53:06 PM org.apache.fop.events.LoggingEventListener processEvent
WARNING: Line 1 of a paragraph overflows the available area by 12571 millipoints. (See position
330:1747)
Jan 5, 2014 4:53:06 PM org.apache.fop.events.LoggingEventListener processEvent
WARNING: Line 1 of a paragraph overflows the available area by 36571 millipoints. (See position
330:1747)
Jan 5, 2014 4:53:06 PM org.apache.fop.events.LoggingEventListener processEvent
WARNING: Line 1 of a paragraph overflows the available area by 2971 millipoints. (See position
330:1747)
[INFO] /x1/jenkins/jenkins-slave/workspace/Cayenne-trunk/cayenneTestConnection/h2/jdk/JDK
1.6 (latest)/label/Ubuntu/trunk/docs/docbook/getting-started-rop/target/site/index.pdf has
been generated.
[INFO] /x1/jenkins/jenkins-slave/workspace/Cayenne-trunk/cayenneTestConnection/h2/jdk/JDK
1.6 (latest)/label/Ubuntu/trunk/docs/docbook/getting-started-rop/target/site/index.fo has
been generated.
[INFO] Executing tasks
   [delete] Deleting 1 files from /x1/jenkins/jenkins-slave/workspace/Cayenne-trunk/cayenneTestConnection/h2/jdk/JDK
1.6 (latest)/label/Ubuntu/trunk/docs/docbook/getting-started-rop/target/site
     [move] Moving 1 file to /x1/jenkins/jenkins-slave/workspace/Cayenne-trunk/cayenneTestConnection/h2/jdk/JDK
1.6 (latest)/label/Ubuntu/trunk/docs/docbook/getting-started-rop/target/site
[INFO] Executed tasks
[INFO] 
[INFO] --- docbkx-maven-plugin:2.0.14:generate-html (build-html) @ getting-started-rop ---
[INFO] Processing input file: index.xml
[INFO] Applying customization parameters
[INFO] Chunking output.
[INFO] See /x1/jenkins/jenkins-slave/workspace/Cayenne-trunk/cayenneTestConnection/h2/jdk/JDK
1.6 (latest)/label/Ubuntu/trunk/docs/docbook/getting-started-rop/target/site/index for generated
file(s)
[INFO] Executing tasks
     [copy] Copying 2 files to /x1/jenkins/jenkins-slave/workspace/Cayenne-trunk/cayenneTestConnection/h2/jdk/JDK
1.6 (latest)/label/Ubuntu/trunk/docs/docbook/getting-started-rop/target/site/index/css
     [copy] Copying 1 file to /x1/jenkins/jenkins-slave/workspace/Cayenne-trunk/cayenneTestConnection/h2/jdk/JDK
1.6 (latest)/label/Ubuntu/trunk/docs/docbook/getting-started-rop/target/site/index/images
[INFO] Executed tasks
[INFO] 
[INFO] --- maven-resources-plugin:2.4.3:resources (default-resources) @ getting-started-rop
---
[INFO] Using 'UTF-8' encoding to copy filtered resources.
[INFO] Copying 12 resources
[INFO] 
[INFO] --- maven-compiler-plugin:2.3.2:compile (default-compile) @ getting-started-rop ---
[INFO] No sources to compile
[INFO] 
[INFO] --- maven-resources-plugin:2.4.3:testResources (default-testResources) @ getting-started-rop
---
[INFO] Using 'UTF-8' encoding to copy filtered resources.
[INFO] skip non existing resourceDirectory /x1/jenkins/jenkins-slave/workspace/Cayenne-trunk/cayenneTestConnection/h2/jdk/JDK
1.6 (latest)/label/Ubuntu/trunk/docs/docbook/getting-started-rop/src/test/resources
[INFO] 
[INFO] --- maven-compiler-plugin:2.3.2:testCompile (default-testCompile) @ getting-started-rop
---
[INFO] No sources to compile
[INFO] 
[INFO] --- maven-surefire-plugin:2.5:test (default-test) @ getting-started-rop ---
[INFO] No tests to run.
[INFO] 
[INFO] --- maven-jar-plugin:2.3.2:jar (default-jar) @ getting-started-rop ---
[INFO] Building jar: /x1/jenkins/jenkins-slave/workspace/Cayenne-trunk/cayenneTestConnection/h2/jdk/JDK
1.6 (latest)/label/Ubuntu/trunk/docs/docbook/getting-started-rop/target/getting-started-rop-3.2.M2-SNAPSHOT.jar
[INFO] 
[INFO] >>> maven-source-plugin:2.1.2:jar (bundle-source-jar) @ getting-started-rop
>>>
[INFO] 
[INFO] <<< maven-source-plugin:2.1.2:jar (bundle-source-jar) @ getting-started-rop
<<<
[INFO] 
[INFO] --- maven-source-plugin:2.1.2:jar (bundle-source-jar) @ getting-started-rop ---
[INFO] Building jar: /x1/jenkins/jenkins-slave/workspace/Cayenne-trunk/cayenneTestConnection/h2/jdk/JDK
1.6 (latest)/label/Ubuntu/trunk/docs/docbook/getting-started-rop/target/getting-started-rop-3.2.M2-SNAPSHOT-sources.jar
[INFO] 
[INFO] --- maven-install-plugin:2.3.1:install (default-install) @ getting-started-rop ---
[INFO] Installing /x1/jenkins/jenkins-slave/workspace/Cayenne-trunk/cayenneTestConnection/h2/jdk/JDK
1.6 (latest)/label/Ubuntu/trunk/docs/docbook/getting-started-rop/target/getting-started-rop-3.2.M2-SNAPSHOT.jar
to <https://builds.apache.org/job/Cayenne-trunk/cayenneTestConnection=h2,jdk=JDK%201.6%20(latest),label=Ubuntu/ws/.repository/org/apache/cayenne/docs/getting-started-rop/3.2.M2-SNAPSHOT/getting-started-rop-3.2.M2-SNAPSHOT.jar>
[INFO] Installing /x1/jenkins/jenkins-slave/workspace/Cayenne-trunk/cayenneTestConnection/h2/jdk/JDK
1.6 (latest)/label/Ubuntu/trunk/docs/docbook/getting-started-rop/pom.xml to <https://builds.apache.org/job/Cayenne-trunk/cayenneTestConnection=h2,jdk=JDK%201.6%20(latest),label=Ubuntu/ws/.repository/org/apache/cayenne/docs/getting-started-rop/3.2.M2-SNAPSHOT/getting-started-rop-3.2.M2-SNAPSHOT.pom>
[INFO] Installing /x1/jenkins/jenkins-slave/workspace/Cayenne-trunk/cayenneTestConnection/h2/jdk/JDK
1.6 (latest)/label/Ubuntu/trunk/docs/docbook/getting-started-rop/target/getting-started-rop-3.2.M2-SNAPSHOT-sources.jar
to <https://builds.apache.org/job/Cayenne-trunk/cayenneTestConnection=h2,jdk=JDK%201.6%20(latest),label=Ubuntu/ws/.repository/org/apache/cayenne/docs/getting-started-rop/3.2.M2-SNAPSHOT/getting-started-rop-3.2.M2-SNAPSHOT-sources.jar>
[INFO]                                                                         
[INFO] ------------------------------------------------------------------------
[INFO] Building Docbook: Cayenne New Features and Upgrade Guide 3.2.M2-SNAPSHOT
[INFO] ------------------------------------------------------------------------
[INFO] 
[INFO] --- maven-clean-plugin:2.4.1:clean (default-clean) @ upgrade-guide ---
[INFO] 
[INFO] --- docbkx-maven-plugin:2.0.14:generate-pdf (build-pdf) @ upgrade-guide ---
[INFO] Processing input file: index.xml
[INFO] Applying customization parameters
[INFO] targetFileExtension pdf
[INFO] type fo
Jan 5, 2014 4:53:09 PM org.apache.fop.events.LoggingEventListener processEvent
WARNING: Font "Symbol,normal,700" not found. Substituting with "Symbol,normal,400".
Jan 5, 2014 4:53:09 PM org.apache.fop.events.LoggingEventListener processEvent
WARNING: Font "ZapfDingbats,normal,700" not found. Substituting with "ZapfDingbats,normal,400".
[INFO] /x1/jenkins/jenkins-slave/workspace/Cayenne-trunk/cayenneTestConnection/h2/jdk/JDK
1.6 (latest)/label/Ubuntu/trunk/docs/docbook/upgrade-guide/target/site/index.pdf has been
generated.
[INFO] /x1/jenkins/jenkins-slave/workspace/Cayenne-trunk/cayenneTestConnection/h2/jdk/JDK
1.6 (latest)/label/Ubuntu/trunk/docs/docbook/upgrade-guide/target/site/index.fo has been generated.
[INFO] Executing tasks
   [delete] Deleting 1 files from /x1/jenkins/jenkins-slave/workspace/Cayenne-trunk/cayenneTestConnection/h2/jdk/JDK
1.6 (latest)/label/Ubuntu/trunk/docs/docbook/upgrade-guide/target/site
     [move] Moving 1 file to /x1/jenkins/jenkins-slave/workspace/Cayenne-trunk/cayenneTestConnection/h2/jdk/JDK
1.6 (latest)/label/Ubuntu/trunk/docs/docbook/upgrade-guide/target/site
[INFO] Executed tasks
[INFO] 
[INFO] --- docbkx-maven-plugin:2.0.14:generate-html (build-html) @ upgrade-guide ---
[INFO] Processing input file: index.xml
[INFO] Applying customization parameters
[INFO] Chunking output.
[INFO] See /x1/jenkins/jenkins-slave/workspace/Cayenne-trunk/cayenneTestConnection/h2/jdk/JDK
1.6 (latest)/label/Ubuntu/trunk/docs/docbook/upgrade-guide/target/site/index for generated
file(s)
[INFO] Executing tasks
     [copy] Copying 2 files to /x1/jenkins/jenkins-slave/workspace/Cayenne-trunk/cayenneTestConnection/h2/jdk/JDK
1.6 (latest)/label/Ubuntu/trunk/docs/docbook/upgrade-guide/target/site/index/css
[INFO] ------------------------------------------------------------------------
[INFO] Reactor Summary:
[INFO] 
[INFO] Cayenne ........................................... SUCCESS [0.403s]
[INFO] Cayenne Build Tools Parent ........................ SUCCESS [0.010s]
[INFO] Cayenne License and Notice Bundle ................. SUCCESS [1.072s]
[INFO] Common Unit Test Utilities ........................ SUCCESS [0.957s]
[INFO] Cayenne Dependency Injection Container ............ SUCCESS [2.702s]
[INFO] Cayenne Server .................................... SUCCESS [1:07.671s]
[INFO] Cayenne ROP Client ................................ SUCCESS [14.196s]
[INFO] Cayenne Project ................................... SUCCESS [2.578s]
[INFO] Cayenne Tools ..................................... SUCCESS [3.995s]
[INFO] Cayenne Lifecycle Utilities ....................... SUCCESS [3.385s]
[INFO] Cayenne Integration Tests Parent .................. SUCCESS [0.010s]
[INFO] Cayenne Maven Plugins ............................. SUCCESS [0.021s]
[INFO] Cayenne Maven Plugin .............................. SUCCESS [4.148s]
[INFO] Integration Tests - Cayenne Tools ................. SUCCESS [1.840s]
[INFO] Cayenne Modeler Parent ............................ SUCCESS [0.020s]
[INFO] Cayenne WebObjects Compatibility Library .......... SUCCESS [2.180s]
[INFO] Cayenne Modeler ................................... SUCCESS [8.289s]
[INFO] Cayenne Modeler Maven Plugin ...................... SUCCESS [0.944s]
[INFO] Cayenne Tutorial .................................. SUCCESS [1.174s]
[INFO] Cayenne ROP Server Tutorial ....................... SUCCESS [1.519s]
[INFO] Cayenne ROP Client Tutorial ....................... SUCCESS [0.678s]
[INFO] Cayenne Tutorials ................................. SUCCESS [0.010s]
[INFO] Cayenne Documenation Parent ....................... SUCCESS [0.008s]
[INFO] Cayenne Documentation ............................. SUCCESS [1:35.835s]
[INFO] Cayenne Docbook Documentation ..................... SUCCESS [0.390s]
[INFO] Docbook: Cayenne Stylesheets ...................... SUCCESS [0.221s]
[INFO] Docbook: Cayenne Guide ............................ SUCCESS [11.082s]
[INFO] Docbook: Getting Started with Cayenne ............. SUCCESS [51.993s]
[INFO] Docbook: Getting Started with Cayenne ROP ......... SUCCESS [8.496s]
[INFO] Docbook: Cayenne New Features and Upgrade Guide ... FAILURE [2.212s]
[INFO] ------------------------------------------------------------------------
[INFO] BUILD FAILURE
[INFO] ------------------------------------------------------------------------
[INFO] Total time: 4:49.084s
[INFO] Finished at: Sun Jan 05 16:53:10 UTC 2014
[INFO] Final Memory: 108M/336M
[INFO] ------------------------------------------------------------------------
[ERROR] Failed to execute goal com.agilejava.docbkx:docbkx-maven-plugin:2.0.14:generate-html
(build-html) on project upgrade-guide: Error executing ant tasks: /x1/jenkins/jenkins-slave/workspace/Cayenne-trunk/cayenneTestConnection/h2/jdk/JDK
1.6 (latest)/label/Ubuntu/trunk/docs/docbook/upgrade-guide/src/images not found. -> [Help
1]
org.apache.maven.lifecycle.LifecycleExecutionException: Failed to execute goal com.agilejava.docbkx:docbkx-maven-plugin:2.0.14:generate-html
(build-html) on project upgrade-guide: Error executing ant tasks
	at org.apache.maven.lifecycle.internal.MojoExecutor.execute(MojoExecutor.java:217)
	at org.apache.maven.lifecycle.internal.MojoExecutor.execute(MojoExecutor.java:153)
	at org.apache.maven.lifecycle.internal.MojoExecutor.execute(MojoExecutor.java:145)
	at org.apache.maven.lifecycle.internal.LifecycleModuleBuilder.buildProject(LifecycleModuleBuilder.java:84)
	at org.apache.maven.lifecycle.internal.LifecycleModuleBuilder.buildProject(LifecycleModuleBuilder.java:59)
	at org.apache.maven.lifecycle.internal.LifecycleStarter.singleThreadedBuild(LifecycleStarter.java:183)
	at org.apache.maven.lifecycle.internal.LifecycleStarter.execute(LifecycleStarter.java:161)
	at org.apache.maven.DefaultMaven.doExecute(DefaultMaven.java:320)
	at org.apache.maven.DefaultMaven.execute(DefaultMaven.java:156)
	at org.apache.maven.cli.MavenCli.execute(MavenCli.java:537)
	at org.apache.maven.cli.MavenCli.doMain(MavenCli.java:196)
	at org.apache.maven.cli.MavenCli.main(MavenCli.java:141)
	at sun.reflect.NativeMethodAccessorImpl.invoke0(Native Method)
	at sun.reflect.NativeMethodAccessorImpl.invoke(NativeMethodAccessorImpl.java:39)
	at sun.reflect.DelegatingMethodAccessorImpl.invoke(DelegatingMethodAccessorImpl.java:25)
	at java.lang.reflect.Method.invoke(Method.java:597)
	at org.codehaus.plexus.classworlds.launcher.Launcher.launchEnhanced(Launcher.java:290)
	at org.codehaus.plexus.classworlds.launcher.Launcher.launch(Launcher.java:230)
	at org.codehaus.plexus.classworlds.launcher.Launcher.mainWithExitCode(Launcher.java:409)
	at org.codehaus.plexus.classworlds.launcher.Launcher.main(Launcher.java:352)
Caused by: org.apache.maven.plugin.MojoExecutionException: Error executing ant tasks
	at com.agilejava.docbkx.maven.AbstractTransformerMojo.executeTasks(AbstractTransformerMojo.java:604)
	at com.agilejava.docbkx.maven.AbstractTransformerMojo.postProcess(AbstractTransformerMojo.java:441)
	at com.agilejava.docbkx.maven.AbstractTransformerMojo.execute(AbstractTransformerMojo.java:185)
	at com.agilejava.docbkx.maven.AbstractHtmlMojo.execute(AbstractHtmlMojo.java:58)
	at org.apache.maven.plugin.DefaultBuildPluginManager.executeMojo(DefaultBuildPluginManager.java:101)
	at org.apache.maven.lifecycle.internal.MojoExecutor.execute(MojoExecutor.java:209)
	... 19 more
Caused by: /x1/jenkins/jenkins-slave/workspace/Cayenne-trunk/cayenneTestConnection/h2/jdk/JDK
1.6 (latest)/label/Ubuntu/trunk/docs/docbook/upgrade-guide/src/images not found.
	at org.apache.tools.ant.types.AbstractFileSet.getDirectoryScanner(AbstractFileSet.java:349)
	at org.apache.tools.ant.taskdefs.Copy.execute(Copy.java:404)
	at org.apache.tools.ant.UnknownElement.execute(UnknownElement.java:275)
	at org.apache.tools.ant.Task.perform(Task.java:364)
	at org.apache.tools.ant.Target.execute(Target.java:341)
	at com.agilejava.docbkx.maven.AbstractTransformerMojo.executeTasks(AbstractTransformerMojo.java:601)
	... 24 more
[ERROR] 
[ERROR] Re-run Maven using the -X switch to enable full debug logging.
[ERROR] 
[ERROR] For more information about the errors and possible solutions, please read the following
articles:
[ERROR] [Help 1] http://cwiki.apache.org/confluence/display/MAVEN/MojoExecutionException
[ERROR] 
[ERROR] After correcting the problems, you can resume the build with the command
[ERROR]   mvn <goals> -rf :upgrade-guide
Build step 'Invoke top-level Maven targets' marked build as failure

Mime
View raw message