cayenne-commits mailing list archives

Site index · List index
Message view « Date » · « Thread »
Top « Date » · « Thread »
From Apache Jenkins Server <jenk...@builds.apache.org>
Subject Build failed in Jenkins: Cayenne-trunk » derby,JDK 1.7 (latest),Ubuntu #980
Date Fri, 20 Dec 2013 01:04:06 GMT
See <https://builds.apache.org/job/Cayenne-trunk/cayenneTestConnection=derby,jdk=JDK%201.7%20(latest),label=Ubuntu/980/changes>

Changes:

[johnthuss] Fix overriding starting values for several PkGenerators; fix JdbcPkGeneratorTest

------------------------------------------
[...truncated 81395 lines...]
Dec 20, 2013 1:04:03 AM org.apache.cayenne.map.EntityResolver applyDBLayerDefaults
INFO: added runtime complimentary DbRelationship from ARTIST to PAINTING1
Dec 20, 2013 1:04:03 AM org.apache.cayenne.test.jdbc.UtilityLogger log
INFO: delete from PAINTING_INFO
Dec 20, 2013 1:04:03 AM org.apache.cayenne.test.jdbc.UtilityLogger log
INFO: delete from PAINTING
Dec 20, 2013 1:04:03 AM org.apache.cayenne.test.jdbc.UtilityLogger log
INFO: delete from ARTIST_EXHIBIT
Dec 20, 2013 1:04:03 AM org.apache.cayenne.test.jdbc.UtilityLogger log
INFO: delete from ARTIST_GROUP
Dec 20, 2013 1:04:03 AM org.apache.cayenne.test.jdbc.UtilityLogger log
INFO: delete from ARTIST
Dec 20, 2013 1:04:03 AM org.apache.cayenne.configuration.XMLDataChannelDescriptorLoader load
INFO: Loading XML configuration resource from file:/x1/jenkins/jenkins-slave/workspace/Cayenne-trunk/cayenneTestConnection/derby/jdk/JDK%201.7%20(latest)/label/Ubuntu/trunk/cayenne-server/target/test-classes/cayenne-testmap.xml
Dec 20, 2013 1:04:03 AM org.apache.cayenne.configuration.XMLDataChannelDescriptorLoader$DataChannelChildrenHandler
createChildTagHandler
INFO: Loading XML DataMap resource from file:/x1/jenkins/jenkins-slave/workspace/Cayenne-trunk/cayenneTestConnection/derby/jdk/JDK%201.7%20(latest)/label/Ubuntu/trunk/cayenne-server/target/test-classes/testmap.map.xml
Dec 20, 2013 1:04:03 AM org.apache.cayenne.map.EntityResolver applyDBLayerDefaults
INFO: added runtime complimentary DbRelationship from ARTIST to PAINTING1
Dec 20, 2013 1:04:03 AM org.apache.cayenne.test.jdbc.UtilityLogger log
INFO: delete from PAINTING_INFO
Dec 20, 2013 1:04:03 AM org.apache.cayenne.test.jdbc.UtilityLogger log
INFO: delete from PAINTING
Dec 20, 2013 1:04:03 AM org.apache.cayenne.test.jdbc.UtilityLogger log
INFO: delete from ARTIST_EXHIBIT
Dec 20, 2013 1:04:03 AM org.apache.cayenne.test.jdbc.UtilityLogger log
INFO: delete from ARTIST_GROUP
Dec 20, 2013 1:04:03 AM org.apache.cayenne.test.jdbc.UtilityLogger log
INFO: delete from ARTIST
Dec 20, 2013 1:04:03 AM org.apache.cayenne.test.jdbc.UtilityLogger log
INFO: INSERT INTO ARTIST (ARTIST_ID, ARTIST_NAME) VALUES (?, ?)
Dec 20, 2013 1:04:03 AM org.apache.cayenne.test.jdbc.UtilityLogger log
INFO: INSERT INTO PAINTING (PAINTING_ID, PAINTING_TITLE, ARTIST_ID, ESTIMATED_PRICE) VALUES
(?, ?, ?, ?)
Dec 20, 2013 1:04:03 AM org.apache.cayenne.log.CommonsJdbcEventLogger logBeginTransaction
INFO: --- transaction started.
Dec 20, 2013 1:04:03 AM org.apache.cayenne.log.CommonsJdbcEventLogger logQuery
INFO: SELECT t0.ARTIST_NAME, t0.DATE_OF_BIRTH, t0.ARTIST_ID FROM ARTIST t0
Dec 20, 2013 1:04:03 AM org.apache.cayenne.log.CommonsJdbcEventLogger logSelectCount
INFO: === returned 1 row. - took 0 ms.
Dec 20, 2013 1:04:03 AM org.apache.cayenne.log.CommonsJdbcEventLogger logCommitTransaction
INFO: +++ transaction committed.
Dec 20, 2013 1:04:03 AM org.apache.cayenne.test.jdbc.UtilityLogger log
INFO: update ARTIST set ARTIST_NAME = ? where ARTIST_ID = ?
Dec 20, 2013 1:04:03 AM org.apache.cayenne.log.CommonsJdbcEventLogger logBeginTransaction
INFO: --- transaction started.
Dec 20, 2013 1:04:03 AM org.apache.cayenne.log.CommonsJdbcEventLogger logQuery
INFO: SELECT t0.ARTIST_NAME, t0.DATE_OF_BIRTH, t0.ARTIST_ID FROM ARTIST t0
Dec 20, 2013 1:04:03 AM org.apache.cayenne.log.CommonsJdbcEventLogger logSelectCount
INFO: === returned 1 row. - took 0 ms.
Dec 20, 2013 1:04:03 AM org.apache.cayenne.log.CommonsJdbcEventLogger logCommitTransaction
INFO: +++ transaction committed.
Tests run: 4, Failures: 0, Errors: 0, Skipped: 0, Time elapsed: 0.035 sec
Running org.apache.cayenne.map.ClientObjectRelationshipTest
Tests run: 1, Failures: 0, Errors: 0, Skipped: 0, Time elapsed: 0.002 sec
Running org.apache.cayenne.access.NestedDataContextParentPeerEventsTest
Dec 20, 2013 1:04:03 AM org.apache.cayenne.configuration.XMLDataChannelDescriptorLoader load
INFO: Loading XML configuration resource from file:/x1/jenkins/jenkins-slave/workspace/Cayenne-trunk/cayenneTestConnection/derby/jdk/JDK%201.7%20(latest)/label/Ubuntu/trunk/cayenne-server/target/test-classes/cayenne-relationships.xml
Dec 20, 2013 1:04:03 AM org.apache.cayenne.configuration.XMLDataChannelDescriptorLoader$DataChannelChildrenHandler
createChildTagHandler
INFO: Loading XML DataMap resource from file:/x1/jenkins/jenkins-slave/workspace/Cayenne-trunk/cayenneTestConnection/derby/jdk/JDK%201.7%20(latest)/label/Ubuntu/trunk/cayenne-server/target/test-classes/relationships.map.xml
Dec 20, 2013 1:04:03 AM org.apache.cayenne.configuration.XMLDataChannelDescriptorLoader$DataChannelChildrenHandler
createChildTagHandler
INFO: Loading XML DataMap resource from file:/x1/jenkins/jenkins-slave/workspace/Cayenne-trunk/cayenneTestConnection/derby/jdk/JDK%201.7%20(latest)/label/Ubuntu/trunk/cayenne-server/target/test-classes/relationships1.map.xml
Dec 20, 2013 1:04:03 AM org.apache.cayenne.map.EntityResolver applyDBLayerDefaults
INFO: added runtime complimentary DbRelationship from DELETE_RULE_TEST3 to DELETE_RULE_TEST1
Dec 20, 2013 1:04:03 AM org.apache.cayenne.log.CommonsJdbcEventLogger logQuery
INFO: SELECT NEXT_ID FROM AUTO_PK_SUPPORT WHERE TABLE_NAME = ? FOR UPDATE [bind: 1:'MASTER']
Dec 20, 2013 1:04:03 AM org.apache.cayenne.log.CommonsJdbcEventLogger logBeginTransaction
INFO: --- transaction started.
Dec 20, 2013 1:04:03 AM org.apache.cayenne.configuration.XMLDataChannelDescriptorLoader load
INFO: Loading XML configuration resource from file:/x1/jenkins/jenkins-slave/workspace/Cayenne-trunk/cayenneTestConnection/derby/jdk/JDK%201.7%20(latest)/label/Ubuntu/trunk/cayenne-server/target/test-classes/cayenne-relationships.xml
Dec 20, 2013 1:04:03 AM org.apache.cayenne.configuration.XMLDataChannelDescriptorLoader$DataChannelChildrenHandler
createChildTagHandler
INFO: Loading XML DataMap resource from file:/x1/jenkins/jenkins-slave/workspace/Cayenne-trunk/cayenneTestConnection/derby/jdk/JDK%201.7%20(latest)/label/Ubuntu/trunk/cayenne-server/target/test-classes/relationships.map.xml
Dec 20, 2013 1:04:03 AM org.apache.cayenne.configuration.XMLDataChannelDescriptorLoader$DataChannelChildrenHandler
createChildTagHandler
INFO: Loading XML DataMap resource from file:/x1/jenkins/jenkins-slave/workspace/Cayenne-trunk/cayenneTestConnection/derby/jdk/JDK%201.7%20(latest)/label/Ubuntu/trunk/cayenne-server/target/test-classes/relationships1.map.xml
Dec 20, 2013 1:04:03 AM org.apache.cayenne.map.EntityResolver applyDBLayerDefaults
INFO: added runtime complimentary DbRelationship from DELETE_RULE_TEST3 to DELETE_RULE_TEST1
Dec 20, 2013 1:04:03 AM org.apache.cayenne.log.CommonsJdbcEventLogger logQuery
INFO: SELECT NEXT_ID FROM AUTO_PK_SUPPORT WHERE TABLE_NAME = ? FOR UPDATE [bind: 1:'MASTER']
Dec 20, 2013 1:04:03 AM org.apache.cayenne.log.CommonsJdbcEventLogger logBeginTransaction
INFO: --- transaction started.
Dec 20, 2013 1:04:03 AM org.apache.cayenne.configuration.XMLDataChannelDescriptorLoader load
INFO: Loading XML configuration resource from file:/x1/jenkins/jenkins-slave/workspace/Cayenne-trunk/cayenneTestConnection/derby/jdk/JDK%201.7%20(latest)/label/Ubuntu/trunk/cayenne-server/target/test-classes/cayenne-relationships.xml
Dec 20, 2013 1:04:03 AM org.apache.cayenne.configuration.XMLDataChannelDescriptorLoader$DataChannelChildrenHandler
createChildTagHandler
INFO: Loading XML DataMap resource from file:/x1/jenkins/jenkins-slave/workspace/Cayenne-trunk/cayenneTestConnection/derby/jdk/JDK%201.7%20(latest)/label/Ubuntu/trunk/cayenne-server/target/test-classes/relationships.map.xml
Dec 20, 2013 1:04:03 AM org.apache.cayenne.configuration.XMLDataChannelDescriptorLoader$DataChannelChildrenHandler
createChildTagHandler
INFO: Loading XML DataMap resource from file:/x1/jenkins/jenkins-slave/workspace/Cayenne-trunk/cayenneTestConnection/derby/jdk/JDK%201.7%20(latest)/label/Ubuntu/trunk/cayenne-server/target/test-classes/relationships1.map.xml
Dec 20, 2013 1:04:03 AM org.apache.cayenne.map.EntityResolver applyDBLayerDefaults
INFO: added runtime complimentary DbRelationship from DELETE_RULE_TEST3 to DELETE_RULE_TEST1
Dec 20, 2013 1:04:03 AM org.apache.cayenne.log.CommonsJdbcEventLogger logQuery
INFO: SELECT NEXT_ID FROM AUTO_PK_SUPPORT WHERE TABLE_NAME = ? FOR UPDATE [bind: 1:'MASTER']
Dec 20, 2013 1:04:03 AM org.apache.cayenne.log.CommonsJdbcEventLogger logBeginTransaction
INFO: --- transaction started.
Tests run: 3, Failures: 0, Errors: 3, Skipped: 0, Time elapsed: 0.021 sec <<< FAILURE!
Running org.apache.cayenne.DataRowTest
Tests run: 1, Failures: 0, Errors: 0, Skipped: 0, Time elapsed: 0.001 sec
Running org.apache.cayenne.access.types.EnumTypeTest
Tests run: 7, Failures: 0, Errors: 0, Skipped: 0, Time elapsed: 0.002 sec
Running org.apache.cayenne.access.jdbc.SQLTemplateProcessorChainTest
Tests run: 11, Failures: 0, Errors: 0, Skipped: 0, Time elapsed: 0.005 sec
Running org.apache.cayenne.exp.parser.ASTObjPathTest
Tests run: 2, Failures: 0, Errors: 0, Skipped: 0, Time elapsed: 0.001 sec

Results :

Failed tests: 
  testCommitChangesRO4(org.apache.cayenne.access.DataContextTest)
  testConcurrentInserts(org.apache.cayenne.dba.ConcurrentPkGeneratorTest)

Tests in error: 
  testSelectWithToManyDBQualifier(org.apache.cayenne.CDOOne2ManyTest)
  testSelectWithToManyQualifier(org.apache.cayenne.CDOOne2ManyTest)
  testNewAdd(org.apache.cayenne.CDOOne2ManyTest)
  testSavedUnresolvedMerge(org.apache.cayenne.access.ToManyListTest)
  testThrowOutDeleted(org.apache.cayenne.access.ToManyListTest)
  testRealRelationship(org.apache.cayenne.access.ToManyListTest)
  testRealRelationshipRollback(org.apache.cayenne.access.ToManyListTest)
  testIsToOneTargetModified(org.apache.cayenne.access.DataRowUtilsTest)
  testToOne_TwoNew(org.apache.cayenne.OneWayRelationshipsTest)
  testToMany_TwoNew(org.apache.cayenne.OneWayRelationshipsTest)
  testToMany_AddNew(org.apache.cayenne.OneWayRelationshipsTest)
  testGeneratedJoinInFlattenedRelationship(org.apache.cayenne.access.IdentityColumnsTest)
  testCompoundPKWithGeneratedColumn(org.apache.cayenne.access.IdentityColumnsTest)
  testFailLockingOnToOne(org.apache.cayenne.access.OptimisticLockingTest)
  testCharTrimming(org.apache.cayenne.access.DataContextCharTypeTest)
  testSave(org.apache.cayenne.access.SingleTableInheritanceTest)
  testMultiDBUpdate(org.apache.cayenne.access.DataContextCrossDBTest)
  testStoreExtendedType(org.apache.cayenne.access.DataContextExtendedTypeOperationsTest)
  testInExpressionExtendedTypeList(org.apache.cayenne.access.DataContextExtendedTypeOperationsTest)
  testInExpressionExtendedTypeArray(org.apache.cayenne.access.DataContextExtendedTypeOperationsTest)
  testInsert(org.apache.cayenne.access.DataContextCompoundRelTest)
  testFetchQualifyingToOne(org.apache.cayenne.access.DataContextCompoundRelTest)
  testFetchQualifyingToMany(org.apache.cayenne.access.DataContextCompoundRelTest)
  testUUID(org.apache.cayenne.access.UUIDTest)
  testQualifyOnToOne(org.apache.cayenne.unit.jira.CAY_194Test)
  testQualifyOnToMany(org.apache.cayenne.unit.jira.CAY_194Test)
  testCommit(org.apache.cayenne.access.PrimitiveAttributesTest)
  testLong(org.apache.cayenne.access.NumericTypesTest)
  testBigInteger(org.apache.cayenne.access.NumericTypesTest)
  testBigDecimal(org.apache.cayenne.access.NumericTypesTest)
  testShortInInsert(org.apache.cayenne.access.NumericTypesTest)
  testTinyintInInsert(org.apache.cayenne.access.NumericTypesTest)
  testBooleanBit(org.apache.cayenne.access.NumericTypesTest)
  testBooleanBoolean(org.apache.cayenne.access.NumericTypesTest)
  testSerializable(org.apache.cayenne.access.MiscTypesTest)
  testByteArray(org.apache.cayenne.access.MiscTypesTest)
  testCharArray(org.apache.cayenne.access.MiscTypesTest)
  testCharacterArray(org.apache.cayenne.access.MiscTypesTest)
  testCharacter(org.apache.cayenne.access.MiscTypesTest)
  testByteWrapperArray(org.apache.cayenne.access.MiscTypesTest)
  testUpdateNoQualifierBoolean(org.apache.cayenne.access.DataContextEJBQLUpdateTest)
  testAddToMany(org.apache.cayenne.CDOCollectionRelationshipTest)
  testAddToManyViaReverse(org.apache.cayenne.CDOCollectionRelationshipTest)
  testDeepMergeExistingSubclass(org.apache.cayenne.util.DeepMergeOperationInheritanceTest)
  testDeepMergeNonExistentSubclass(org.apache.cayenne.util.DeepMergeOperationInheritanceTest)
  testReadRelationship(org.apache.cayenne.CDOOneToManyFKTest)
  testGeneratedKey(org.apache.cayenne.access.DataContextEntityWithMeaningfulPKTest)
  testToManyRelationshipWithMeaningfulPK2(org.apache.cayenne.access.DataContextEntityWithMeaningfulPKTest)
  testInsert(org.apache.cayenne.access.EmbeddingTest)
  testDelete(org.apache.cayenne.access.DataContextFlattenedAttributesTest)
  testInsert(org.apache.cayenne.access.DataContextFlattenedAttributesTest)
  testUpdate(org.apache.cayenne.access.DataContextFlattenedAttributesTest)
  testFetchLimit_DistinctResultIterator(org.apache.cayenne.access.jdbc.SelectActionTest)
  testPeerObjectUpdatedSimpleProperty(org.apache.cayenne.access.NestedDataContextParentPeerEventsTest)
  testPeerObjectUpdatedToOneRelationship(org.apache.cayenne.access.NestedDataContextParentPeerEventsTest)
  testPeerObjectUpdatedToManyRelationship(org.apache.cayenne.access.NestedDataContextParentPeerEventsTest)

Tests run: 2022, Failures: 2, Errors: 56, Skipped: 0

[INFO] ------------------------------------------------------------------------
[INFO] Reactor Summary:
[INFO] 
[INFO] Cayenne ........................................... SUCCESS [0.811s]
[INFO] Cayenne Build Tools Parent ........................ SUCCESS [0.023s]
[INFO] Cayenne License and Notice Bundle ................. SUCCESS [1.821s]
[INFO] Common Unit Test Utilities ........................ SUCCESS [1.304s]
[INFO] Cayenne Dependency Injection Container ............ SUCCESS [3.568s]
[INFO] Cayenne Server .................................... FAILURE [1:33.473s]
[INFO] Cayenne ROP Client ................................ SKIPPED
[INFO] Cayenne Project ................................... SKIPPED
[INFO] Cayenne Tools ..................................... SKIPPED
[INFO] Cayenne Lifecycle Utilities ....................... SKIPPED
[INFO] Cayenne Integration Tests Parent .................. SKIPPED
[INFO] Cayenne Maven Plugins ............................. SKIPPED
[INFO] Cayenne Maven Plugin .............................. SKIPPED
[INFO] Integration Tests - Cayenne Tools ................. SKIPPED
[INFO] Cayenne Modeler Parent ............................ SKIPPED
[INFO] Cayenne WebObjects Compatibility Library .......... SKIPPED
[INFO] Cayenne Modeler ................................... SKIPPED
[INFO] Cayenne Modeler Maven Plugin ...................... SKIPPED
[INFO] Cayenne Tutorial .................................. SKIPPED
[INFO] Cayenne ROP Server Tutorial ....................... SKIPPED
[INFO] Cayenne ROP Client Tutorial ....................... SKIPPED
[INFO] Cayenne Tutorials ................................. SKIPPED
[INFO] Cayenne Documenation Parent ....................... SKIPPED
[INFO] Cayenne Documentation ............................. SKIPPED
[INFO] Cayenne Docbook Documentation ..................... SKIPPED
[INFO] Docbook: Cayenne Stylesheets ...................... SKIPPED
[INFO] Docbook: Cayenne Guide ............................ SKIPPED
[INFO] Docbook: Getting Started with Cayenne ............. SKIPPED
[INFO] Docbook: Getting Started with Cayenne ROP ......... SKIPPED
[INFO] Docbook: Cayenne New Features and Upgrade Guide ... SKIPPED
[INFO] ------------------------------------------------------------------------
[INFO] BUILD FAILURE
[INFO] ------------------------------------------------------------------------
[INFO] Total time: 1:42.075s
[INFO] Finished at: Fri Dec 20 01:04:03 UTC 2013
[INFO] Final Memory: 39M/250M
[INFO] ------------------------------------------------------------------------
[ERROR] Failed to execute goal org.apache.maven.plugins:maven-surefire-plugin:2.5:test (default-test)
on project cayenne-server: There are test failures.
[ERROR] 
[ERROR] Please refer to /x1/jenkins/jenkins-slave/workspace/Cayenne-trunk/cayenneTestConnection/derby/jdk/JDK
1.7 (latest)/label/Ubuntu/trunk/cayenne-server/target/surefire-reports for the individual
test results.
[ERROR] -> [Help 1]
org.apache.maven.lifecycle.LifecycleExecutionException: Failed to execute goal org.apache.maven.plugins:maven-surefire-plugin:2.5:test
(default-test) on project cayenne-server: There are test failures.

Please refer to /x1/jenkins/jenkins-slave/workspace/Cayenne-trunk/cayenneTestConnection/derby/jdk/JDK
1.7 (latest)/label/Ubuntu/trunk/cayenne-server/target/surefire-reports for the individual
test results.
	at org.apache.maven.lifecycle.internal.MojoExecutor.execute(MojoExecutor.java:213)
	at org.apache.maven.lifecycle.internal.MojoExecutor.execute(MojoExecutor.java:153)
	at org.apache.maven.lifecycle.internal.MojoExecutor.execute(MojoExecutor.java:145)
	at org.apache.maven.lifecycle.internal.LifecycleModuleBuilder.buildProject(LifecycleModuleBuilder.java:84)
	at org.apache.maven.lifecycle.internal.LifecycleModuleBuilder.buildProject(LifecycleModuleBuilder.java:59)
	at org.apache.maven.lifecycle.internal.LifecycleStarter.singleThreadedBuild(LifecycleStarter.java:183)
	at org.apache.maven.lifecycle.internal.LifecycleStarter.execute(LifecycleStarter.java:161)
	at org.apache.maven.DefaultMaven.doExecute(DefaultMaven.java:320)
	at org.apache.maven.DefaultMaven.execute(DefaultMaven.java:156)
	at org.apache.maven.cli.MavenCli.execute(MavenCli.java:537)
	at org.apache.maven.cli.MavenCli.doMain(MavenCli.java:196)
	at org.apache.maven.cli.MavenCli.main(MavenCli.java:141)
	at sun.reflect.NativeMethodAccessorImpl.invoke0(Native Method)
	at sun.reflect.NativeMethodAccessorImpl.invoke(NativeMethodAccessorImpl.java:57)
	at sun.reflect.DelegatingMethodAccessorImpl.invoke(DelegatingMethodAccessorImpl.java:43)
	at java.lang.reflect.Method.invoke(Method.java:606)
	at org.codehaus.plexus.classworlds.launcher.Launcher.launchEnhanced(Launcher.java:290)
	at org.codehaus.plexus.classworlds.launcher.Launcher.launch(Launcher.java:230)
	at org.codehaus.plexus.classworlds.launcher.Launcher.mainWithExitCode(Launcher.java:409)
	at org.codehaus.plexus.classworlds.launcher.Launcher.main(Launcher.java:352)
Caused by: org.apache.maven.plugin.MojoFailureException: There are test failures.

Please refer to /x1/jenkins/jenkins-slave/workspace/Cayenne-trunk/cayenneTestConnection/derby/jdk/JDK
1.7 (latest)/label/Ubuntu/trunk/cayenne-server/target/surefire-reports for the individual
test results.
	at org.apache.maven.plugin.surefire.SurefirePlugin.execute(SurefirePlugin.java:629)
	at org.apache.maven.plugin.DefaultBuildPluginManager.executeMojo(DefaultBuildPluginManager.java:101)
	at org.apache.maven.lifecycle.internal.MojoExecutor.execute(MojoExecutor.java:209)
	... 19 more
[ERROR] 
[ERROR] Re-run Maven using the -X switch to enable full debug logging.
[ERROR] 
[ERROR] For more information about the errors and possible solutions, please read the following
articles:
[ERROR] [Help 1] http://cwiki.apache.org/confluence/display/MAVEN/MojoFailureException
[ERROR] 
[ERROR] After correcting the problems, you can resume the build with the command
[ERROR]   mvn <goals> -rf :cayenne-server
Build step 'Invoke top-level Maven targets' marked build as failure

Mime
View raw message