cayenne-commits mailing list archives

Site index · List index
Message view « Date » · « Thread »
Top « Date » · « Thread »
From Apache Jenkins Server <jenk...@builds.apache.org>
Subject Build failed in Jenkins: Cayenne-trunk » h2,JDK 1.7 (latest),Ubuntu #984
Date Sun, 29 Dec 2013 16:51:52 GMT
See <https://builds.apache.org/job/Cayenne-trunk/cayenneTestConnection=h2,jdk=JDK%201.7%20(latest),label=Ubuntu/984/changes>

Changes:

[dkazimirchyk] CAY-1799 ROP: Server can't deserialize LIKE expression with pattern already
compiled

fix misplaced release notes record

[dkazimirchyk] CAY-1799 ROP: Server can't deserialize LIKE expression with pattern already
compiled

release notes

[dkazimirchyk] CAY-1799 ROP: Server can't deserialize LIKE expression with pattern already
compiled

fix code formatting

[dkazimirchyk] CAY-1799 ROP: Server can't deserialize LIKE expression with pattern already
compiled

patch by Oleg Artyukevich

------------------------------------------
[...truncated 88940 lines...]
INFO: delete from PAINTING
Dec 29, 2013 4:51:50 PM org.apache.cayenne.test.jdbc.UtilityLogger log
INFO: delete from ARTIST_EXHIBIT
Dec 29, 2013 4:51:50 PM org.apache.cayenne.test.jdbc.UtilityLogger log
INFO: delete from ARTIST_GROUP
Dec 29, 2013 4:51:50 PM org.apache.cayenne.test.jdbc.UtilityLogger log
INFO: delete from ARTIST
Dec 29, 2013 4:51:50 PM org.apache.cayenne.test.jdbc.UtilityLogger log
INFO: INSERT INTO ARTIST (ARTIST_ID, ARTIST_NAME) VALUES (?, ?)
Dec 29, 2013 4:51:50 PM org.apache.cayenne.test.jdbc.UtilityLogger log
INFO: INSERT INTO PAINTING (PAINTING_ID, PAINTING_TITLE, ARTIST_ID, ESTIMATED_PRICE) VALUES
(?, ?, ?, ?)
Dec 29, 2013 4:51:50 PM org.apache.cayenne.log.CommonsJdbcEventLogger logBeginTransaction
INFO: --- transaction started.
Dec 29, 2013 4:51:50 PM org.apache.cayenne.log.CommonsJdbcEventLogger logQuery
INFO: SELECT t0.ARTIST_NAME, t0.DATE_OF_BIRTH, t0.ARTIST_ID FROM ARTIST t0
Dec 29, 2013 4:51:50 PM org.apache.cayenne.log.CommonsJdbcEventLogger logSelectCount
INFO: === returned 1 row. - took 0 ms.
Dec 29, 2013 4:51:50 PM org.apache.cayenne.log.CommonsJdbcEventLogger logCommitTransaction
INFO: +++ transaction committed.
Dec 29, 2013 4:51:50 PM org.apache.cayenne.test.jdbc.UtilityLogger log
INFO: update ARTIST set ARTIST_NAME = ? where ARTIST_ID = ?
Dec 29, 2013 4:51:50 PM org.apache.cayenne.log.CommonsJdbcEventLogger logBeginTransaction
INFO: --- transaction started.
Dec 29, 2013 4:51:50 PM org.apache.cayenne.log.CommonsJdbcEventLogger logQuery
INFO: SELECT t0.ARTIST_NAME, t0.DATE_OF_BIRTH, t0.ARTIST_ID FROM ARTIST t0
Dec 29, 2013 4:51:50 PM org.apache.cayenne.log.CommonsJdbcEventLogger logSelectCount
INFO: === returned 1 row. - took 0 ms.
Dec 29, 2013 4:51:50 PM org.apache.cayenne.log.CommonsJdbcEventLogger logCommitTransaction
INFO: +++ transaction committed.
Tests run: 4, Failures: 0, Errors: 0, Skipped: 0, Time elapsed: 0.028 sec
Running org.apache.cayenne.map.ClientObjectRelationshipTest
Tests run: 1, Failures: 0, Errors: 0, Skipped: 0, Time elapsed: 0.002 sec
Running org.apache.cayenne.access.NestedDataContextParentPeerEventsTest
Dec 29, 2013 4:51:50 PM org.apache.cayenne.configuration.XMLDataChannelDescriptorLoader load
INFO: Loading XML configuration resource from file:/x1/jenkins/jenkins-slave/workspace/Cayenne-trunk/cayenneTestConnection/h2/jdk/JDK%201.7%20(latest)/label/Ubuntu/trunk/cayenne-server/target/test-classes/cayenne-relationships.xml
Dec 29, 2013 4:51:50 PM org.apache.cayenne.configuration.XMLDataChannelDescriptorLoader$DataChannelChildrenHandler
createChildTagHandler
INFO: Loading XML DataMap resource from file:/x1/jenkins/jenkins-slave/workspace/Cayenne-trunk/cayenneTestConnection/h2/jdk/JDK%201.7%20(latest)/label/Ubuntu/trunk/cayenne-server/target/test-classes/relationships.map.xml
Dec 29, 2013 4:51:50 PM org.apache.cayenne.configuration.XMLDataChannelDescriptorLoader$DataChannelChildrenHandler
createChildTagHandler
INFO: Loading XML DataMap resource from file:/x1/jenkins/jenkins-slave/workspace/Cayenne-trunk/cayenneTestConnection/h2/jdk/JDK%201.7%20(latest)/label/Ubuntu/trunk/cayenne-server/target/test-classes/relationships1.map.xml
Dec 29, 2013 4:51:50 PM org.apache.cayenne.map.EntityResolver applyDBLayerDefaults
INFO: added runtime complimentary DbRelationship from DELETE_RULE_TEST3 to DELETE_RULE_TEST1
Dec 29, 2013 4:51:50 PM org.apache.cayenne.log.CommonsJdbcEventLogger logBeginTransaction
INFO: --- transaction started.
Dec 29, 2013 4:51:50 PM org.apache.cayenne.log.CommonsJdbcEventLogger logQuery
INFO: SELECT NEXT VALUE FOR pk_master
Dec 29, 2013 4:51:50 PM org.apache.cayenne.log.CommonsJdbcEventLogger logQuery
INFO: INSERT INTO MASTER (ID, NAME) VALUES (?, ?)
Dec 29, 2013 4:51:50 PM org.apache.cayenne.log.CommonsJdbcEventLogger logQueryParameters
INFO: [bind: 1->ID:200, 2->NAME:'X']
Dec 29, 2013 4:51:50 PM org.apache.cayenne.log.CommonsJdbcEventLogger logUpdateCount
INFO: === updated 1 row.
Dec 29, 2013 4:51:50 PM org.apache.cayenne.log.CommonsJdbcEventLogger logCommitTransaction
INFO: +++ transaction committed.
Dec 29, 2013 4:51:50 PM org.apache.cayenne.log.CommonsJdbcEventLogger logBeginTransaction
INFO: --- transaction started.
Dec 29, 2013 4:51:50 PM org.apache.cayenne.log.CommonsJdbcEventLogger logQuery
INFO: UPDATE MASTER SET NAME = ? WHERE ID = ?
Dec 29, 2013 4:51:50 PM org.apache.cayenne.log.CommonsJdbcEventLogger logQueryParameters
INFO: [bind: 1->NAME:'Y', 2->ID:200]
Dec 29, 2013 4:51:50 PM org.apache.cayenne.log.CommonsJdbcEventLogger logUpdateCount
INFO: === updated 1 row.
Dec 29, 2013 4:51:50 PM org.apache.cayenne.log.CommonsJdbcEventLogger logCommitTransaction
INFO: +++ transaction committed.
Dec 29, 2013 4:51:50 PM org.apache.cayenne.configuration.XMLDataChannelDescriptorLoader load
INFO: Loading XML configuration resource from file:/x1/jenkins/jenkins-slave/workspace/Cayenne-trunk/cayenneTestConnection/h2/jdk/JDK%201.7%20(latest)/label/Ubuntu/trunk/cayenne-server/target/test-classes/cayenne-relationships.xml
Dec 29, 2013 4:51:50 PM org.apache.cayenne.configuration.XMLDataChannelDescriptorLoader$DataChannelChildrenHandler
createChildTagHandler
INFO: Loading XML DataMap resource from file:/x1/jenkins/jenkins-slave/workspace/Cayenne-trunk/cayenneTestConnection/h2/jdk/JDK%201.7%20(latest)/label/Ubuntu/trunk/cayenne-server/target/test-classes/relationships.map.xml
Dec 29, 2013 4:51:50 PM org.apache.cayenne.configuration.XMLDataChannelDescriptorLoader$DataChannelChildrenHandler
createChildTagHandler
INFO: Loading XML DataMap resource from file:/x1/jenkins/jenkins-slave/workspace/Cayenne-trunk/cayenneTestConnection/h2/jdk/JDK%201.7%20(latest)/label/Ubuntu/trunk/cayenne-server/target/test-classes/relationships1.map.xml
Dec 29, 2013 4:51:50 PM org.apache.cayenne.map.EntityResolver applyDBLayerDefaults
INFO: added runtime complimentary DbRelationship from DELETE_RULE_TEST3 to DELETE_RULE_TEST1
Dec 29, 2013 4:51:50 PM org.apache.cayenne.log.CommonsJdbcEventLogger logBeginTransaction
INFO: --- transaction started.
Dec 29, 2013 4:51:50 PM org.apache.cayenne.log.CommonsJdbcEventLogger logQuery
INFO: SELECT NEXT VALUE FOR pk_child
Dec 29, 2013 4:51:50 PM org.apache.cayenne.log.CommonsJdbcEventLogger logQuery
INFO: INSERT INTO MASTER (ID, NAME) VALUES (?, ?)
Dec 29, 2013 4:51:50 PM org.apache.cayenne.log.CommonsJdbcEventLogger logQueryParameters
INFO: [bind: 1->ID:201, 2->NAME:'X']
Dec 29, 2013 4:51:50 PM org.apache.cayenne.log.CommonsJdbcEventLogger logUpdateCount
INFO: === updated 1 row.
Dec 29, 2013 4:51:50 PM org.apache.cayenne.log.CommonsJdbcEventLogger logQueryParameters
INFO: [bind: 1->ID:202, 2->NAME:'Y']
Dec 29, 2013 4:51:50 PM org.apache.cayenne.log.CommonsJdbcEventLogger logUpdateCount
INFO: === updated 1 row.
Dec 29, 2013 4:51:50 PM org.apache.cayenne.log.CommonsJdbcEventLogger logQuery
INFO: INSERT INTO CHILD (ID, MASTER_ID) VALUES (?, ?)
Dec 29, 2013 4:51:50 PM org.apache.cayenne.log.CommonsJdbcEventLogger logQueryParameters
INFO: [bind: 1->ID:200, 2->MASTER_ID:201]
Dec 29, 2013 4:51:50 PM org.apache.cayenne.log.CommonsJdbcEventLogger logUpdateCount
INFO: === updated 1 row.
Dec 29, 2013 4:51:50 PM org.apache.cayenne.log.CommonsJdbcEventLogger logCommitTransaction
INFO: +++ transaction committed.
Dec 29, 2013 4:51:50 PM org.apache.cayenne.log.CommonsJdbcEventLogger logBeginTransaction
INFO: --- transaction started.
Dec 29, 2013 4:51:50 PM org.apache.cayenne.log.CommonsJdbcEventLogger logQuery
INFO: UPDATE CHILD SET MASTER_ID = ? WHERE ID = ?
Dec 29, 2013 4:51:50 PM org.apache.cayenne.log.CommonsJdbcEventLogger logQueryParameters
INFO: [bind: 1->MASTER_ID:202, 2->ID:200]
Dec 29, 2013 4:51:50 PM org.apache.cayenne.log.CommonsJdbcEventLogger logUpdateCount
INFO: === updated 1 row.
Dec 29, 2013 4:51:50 PM org.apache.cayenne.log.CommonsJdbcEventLogger logCommitTransaction
INFO: +++ transaction committed.
Dec 29, 2013 4:51:51 PM org.apache.cayenne.configuration.XMLDataChannelDescriptorLoader load
INFO: Loading XML configuration resource from file:/x1/jenkins/jenkins-slave/workspace/Cayenne-trunk/cayenneTestConnection/h2/jdk/JDK%201.7%20(latest)/label/Ubuntu/trunk/cayenne-server/target/test-classes/cayenne-relationships.xml
Dec 29, 2013 4:51:51 PM org.apache.cayenne.configuration.XMLDataChannelDescriptorLoader$DataChannelChildrenHandler
createChildTagHandler
INFO: Loading XML DataMap resource from file:/x1/jenkins/jenkins-slave/workspace/Cayenne-trunk/cayenneTestConnection/h2/jdk/JDK%201.7%20(latest)/label/Ubuntu/trunk/cayenne-server/target/test-classes/relationships.map.xml
Dec 29, 2013 4:51:51 PM org.apache.cayenne.configuration.XMLDataChannelDescriptorLoader$DataChannelChildrenHandler
createChildTagHandler
INFO: Loading XML DataMap resource from file:/x1/jenkins/jenkins-slave/workspace/Cayenne-trunk/cayenneTestConnection/h2/jdk/JDK%201.7%20(latest)/label/Ubuntu/trunk/cayenne-server/target/test-classes/relationships1.map.xml
Dec 29, 2013 4:51:51 PM org.apache.cayenne.map.EntityResolver applyDBLayerDefaults
INFO: added runtime complimentary DbRelationship from DELETE_RULE_TEST3 to DELETE_RULE_TEST1
Dec 29, 2013 4:51:51 PM org.apache.cayenne.log.CommonsJdbcEventLogger logBeginTransaction
INFO: --- transaction started.
Dec 29, 2013 4:51:51 PM org.apache.cayenne.log.CommonsJdbcEventLogger logQuery
INFO: INSERT INTO MASTER (ID, NAME) VALUES (?, ?)
Dec 29, 2013 4:51:51 PM org.apache.cayenne.log.CommonsJdbcEventLogger logQueryParameters
INFO: [bind: 1->ID:203, 2->NAME:'X']
Dec 29, 2013 4:51:51 PM org.apache.cayenne.log.CommonsJdbcEventLogger logUpdateCount
INFO: === updated 1 row.
Dec 29, 2013 4:51:51 PM org.apache.cayenne.log.CommonsJdbcEventLogger logQuery
INFO: INSERT INTO CHILD (ID, MASTER_ID) VALUES (?, ?)
Dec 29, 2013 4:51:51 PM org.apache.cayenne.log.CommonsJdbcEventLogger logQueryParameters
INFO: [bind: 1->ID:201, 2->MASTER_ID:203]
Dec 29, 2013 4:51:51 PM org.apache.cayenne.log.CommonsJdbcEventLogger logUpdateCount
INFO: === updated 1 row.
Dec 29, 2013 4:51:51 PM org.apache.cayenne.log.CommonsJdbcEventLogger logQueryParameters
INFO: [bind: 1->ID:202, 2->MASTER_ID:NULL]
Dec 29, 2013 4:51:51 PM org.apache.cayenne.log.CommonsJdbcEventLogger logUpdateCount
INFO: === updated 1 row.
Dec 29, 2013 4:51:51 PM org.apache.cayenne.log.CommonsJdbcEventLogger logCommitTransaction
INFO: +++ transaction committed.
Dec 29, 2013 4:51:51 PM org.apache.cayenne.log.CommonsJdbcEventLogger logBeginTransaction
INFO: --- transaction started.
Dec 29, 2013 4:51:51 PM org.apache.cayenne.log.CommonsJdbcEventLogger logQuery
INFO: UPDATE CHILD SET MASTER_ID = ? WHERE ID = ?
Dec 29, 2013 4:51:51 PM org.apache.cayenne.log.CommonsJdbcEventLogger logQueryParameters
INFO: [bind: 1->MASTER_ID:203, 2->ID:202]
Dec 29, 2013 4:51:51 PM org.apache.cayenne.log.CommonsJdbcEventLogger logUpdateCount
INFO: === updated 1 row.
Dec 29, 2013 4:51:51 PM org.apache.cayenne.log.CommonsJdbcEventLogger logCommitTransaction
INFO: +++ transaction committed.
Dec 29, 2013 4:51:51 PM org.apache.cayenne.log.CommonsJdbcEventLogger logBeginTransaction
INFO: --- transaction started.
Dec 29, 2013 4:51:51 PM org.apache.cayenne.log.CommonsJdbcEventLogger logQuery
INFO: SELECT t0.MASTER_ID, t0.ID FROM CHILD t0 WHERE t0.MASTER_ID = ? [bind: 1->MASTER_ID:203]
Dec 29, 2013 4:51:51 PM org.apache.cayenne.log.CommonsJdbcEventLogger logSelectCount
INFO: === returned 2 rows. - took 1 ms.
Dec 29, 2013 4:51:51 PM org.apache.cayenne.log.CommonsJdbcEventLogger logCommitTransaction
INFO: +++ transaction committed.
Tests run: 3, Failures: 0, Errors: 0, Skipped: 0, Time elapsed: 0.938 sec
Running org.apache.cayenne.DataRowTest
Tests run: 1, Failures: 0, Errors: 0, Skipped: 0, Time elapsed: 0.001 sec
Running org.apache.cayenne.access.types.EnumTypeTest
Tests run: 7, Failures: 0, Errors: 0, Skipped: 0, Time elapsed: 0.001 sec
Running org.apache.cayenne.access.jdbc.SQLTemplateProcessorChainTest
Tests run: 11, Failures: 0, Errors: 0, Skipped: 0, Time elapsed: 0.006 sec
Running org.apache.cayenne.exp.parser.ASTObjPathTest
Tests run: 2, Failures: 0, Errors: 0, Skipped: 0, Time elapsed: 0.001 sec

Results :

Tests in error: 
  testSelectWithToManyDBQualifier(org.apache.cayenne.CDOOne2ManyTest)

Tests run: 2022, Failures: 0, Errors: 1, Skipped: 0

[INFO] ------------------------------------------------------------------------
[INFO] Reactor Summary:
[INFO] 
[INFO] Cayenne ........................................... SUCCESS [0.548s]
[INFO] Cayenne Build Tools Parent ........................ SUCCESS [0.020s]
[INFO] Cayenne License and Notice Bundle ................. SUCCESS [2.216s]
[INFO] Common Unit Test Utilities ........................ SUCCESS [1.254s]
[INFO] Cayenne Dependency Injection Container ............ SUCCESS [3.802s]
[INFO] Cayenne Server .................................... FAILURE [1:13.392s]
[INFO] Cayenne ROP Client ................................ SKIPPED
[INFO] Cayenne Project ................................... SKIPPED
[INFO] Cayenne Tools ..................................... SKIPPED
[INFO] Cayenne Lifecycle Utilities ....................... SKIPPED
[INFO] Cayenne Integration Tests Parent .................. SKIPPED
[INFO] Cayenne Maven Plugins ............................. SKIPPED
[INFO] Cayenne Maven Plugin .............................. SKIPPED
[INFO] Integration Tests - Cayenne Tools ................. SKIPPED
[INFO] Cayenne Modeler Parent ............................ SKIPPED
[INFO] Cayenne WebObjects Compatibility Library .......... SKIPPED
[INFO] Cayenne Modeler ................................... SKIPPED
[INFO] Cayenne Modeler Maven Plugin ...................... SKIPPED
[INFO] Cayenne Tutorial .................................. SKIPPED
[INFO] Cayenne ROP Server Tutorial ....................... SKIPPED
[INFO] Cayenne ROP Client Tutorial ....................... SKIPPED
[INFO] Cayenne Tutorials ................................. SKIPPED
[INFO] Cayenne Documenation Parent ....................... SKIPPED
[INFO] Cayenne Documentation ............................. SKIPPED
[INFO] Cayenne Docbook Documentation ..................... SKIPPED
[INFO] Docbook: Cayenne Stylesheets ...................... SKIPPED
[INFO] Docbook: Cayenne Guide ............................ SKIPPED
[INFO] Docbook: Getting Started with Cayenne ............. SKIPPED
[INFO] Docbook: Getting Started with Cayenne ROP ......... SKIPPED
[INFO] Docbook: Cayenne New Features and Upgrade Guide ... SKIPPED
[INFO] ------------------------------------------------------------------------
[INFO] BUILD FAILURE
[INFO] ------------------------------------------------------------------------
[INFO] Total time: 1:23.526s
[INFO] Finished at: Sun Dec 29 16:51:51 UTC 2013
[INFO] Final Memory: 37M/218M
[INFO] ------------------------------------------------------------------------
[ERROR] Failed to execute goal org.apache.maven.plugins:maven-surefire-plugin:2.5:test (default-test)
on project cayenne-server: There are test failures.
[ERROR] 
[ERROR] Please refer to /x1/jenkins/jenkins-slave/workspace/Cayenne-trunk/cayenneTestConnection/h2/jdk/JDK
1.7 (latest)/label/Ubuntu/trunk/cayenne-server/target/surefire-reports for the individual
test results.
[ERROR] -> [Help 1]
org.apache.maven.lifecycle.LifecycleExecutionException: Failed to execute goal org.apache.maven.plugins:maven-surefire-plugin:2.5:test
(default-test) on project cayenne-server: There are test failures.

Please refer to /x1/jenkins/jenkins-slave/workspace/Cayenne-trunk/cayenneTestConnection/h2/jdk/JDK
1.7 (latest)/label/Ubuntu/trunk/cayenne-server/target/surefire-reports for the individual
test results.
	at org.apache.maven.lifecycle.internal.MojoExecutor.execute(MojoExecutor.java:213)
	at org.apache.maven.lifecycle.internal.MojoExecutor.execute(MojoExecutor.java:153)
	at org.apache.maven.lifecycle.internal.MojoExecutor.execute(MojoExecutor.java:145)
	at org.apache.maven.lifecycle.internal.LifecycleModuleBuilder.buildProject(LifecycleModuleBuilder.java:84)
	at org.apache.maven.lifecycle.internal.LifecycleModuleBuilder.buildProject(LifecycleModuleBuilder.java:59)
	at org.apache.maven.lifecycle.internal.LifecycleStarter.singleThreadedBuild(LifecycleStarter.java:183)
	at org.apache.maven.lifecycle.internal.LifecycleStarter.execute(LifecycleStarter.java:161)
	at org.apache.maven.DefaultMaven.doExecute(DefaultMaven.java:320)
	at org.apache.maven.DefaultMaven.execute(DefaultMaven.java:156)
	at org.apache.maven.cli.MavenCli.execute(MavenCli.java:537)
	at org.apache.maven.cli.MavenCli.doMain(MavenCli.java:196)
	at org.apache.maven.cli.MavenCli.main(MavenCli.java:141)
	at sun.reflect.NativeMethodAccessorImpl.invoke0(Native Method)
	at sun.reflect.NativeMethodAccessorImpl.invoke(NativeMethodAccessorImpl.java:57)
	at sun.reflect.DelegatingMethodAccessorImpl.invoke(DelegatingMethodAccessorImpl.java:43)
	at java.lang.reflect.Method.invoke(Method.java:606)
	at org.codehaus.plexus.classworlds.launcher.Launcher.launchEnhanced(Launcher.java:290)
	at org.codehaus.plexus.classworlds.launcher.Launcher.launch(Launcher.java:230)
	at org.codehaus.plexus.classworlds.launcher.Launcher.mainWithExitCode(Launcher.java:409)
	at org.codehaus.plexus.classworlds.launcher.Launcher.main(Launcher.java:352)
Caused by: org.apache.maven.plugin.MojoFailureException: There are test failures.

Please refer to /x1/jenkins/jenkins-slave/workspace/Cayenne-trunk/cayenneTestConnection/h2/jdk/JDK
1.7 (latest)/label/Ubuntu/trunk/cayenne-server/target/surefire-reports for the individual
test results.
	at org.apache.maven.plugin.surefire.SurefirePlugin.execute(SurefirePlugin.java:629)
	at org.apache.maven.plugin.DefaultBuildPluginManager.executeMojo(DefaultBuildPluginManager.java:101)
	at org.apache.maven.lifecycle.internal.MojoExecutor.execute(MojoExecutor.java:209)
	... 19 more
[ERROR] 
[ERROR] Re-run Maven using the -X switch to enable full debug logging.
[ERROR] 
[ERROR] For more information about the errors and possible solutions, please read the following
articles:
[ERROR] [Help 1] http://cwiki.apache.org/confluence/display/MAVEN/MojoFailureException
[ERROR] 
[ERROR] After correcting the problems, you can resume the build with the command
[ERROR]   mvn <goals> -rf :cayenne-server
Build step 'Invoke top-level Maven targets' marked build as failure

Mime
View raw message