cayenne-commits mailing list archives

Site index · List index
Message view « Date » · « Thread »
Top « Date » · « Thread »
From Apache Jenkins Server <jenk...@builds.apache.org>
Subject Build failed in Jenkins: Cayenne-trunk » hsql,JDK 1.6 (latest),Ubuntu #973
Date Sun, 24 Nov 2013 15:51:12 GMT
See <https://builds.apache.org/job/Cayenne-trunk/cayenneTestConnection=hsql,jdk=JDK%201.6%20(latest),label=Ubuntu/973/changes>

Changes:

[aadamchik] CAY-1882 Porting to OSGi environment

release notes

[aadamchik] CAY-1887 Move class loading under Di, differentiate between Cayenne and application
classes

deprecating 'getJavaClass' 9n embeddable

[aadamchik] CAY-1882 Porting to OSGi environment

making sure overdidden AOF is still injected everywhere

[aadamchik] CAY-1882 Porting to OSGi environment

* OsgiModuleBuilder
* adding a way to register JDBC driver

[aadamchik] CAY-1882 Porting to OSGi environment

fixing JDBC driver classloading

------------------------------------------
[...truncated 103429 lines...]
Nov 24, 2013 3:51:03 PM org.apache.cayenne.log.CommonsJdbcEventLogger logQuery
INFO: INSERT INTO MT_TABLE1 (GLOBAL_ATTRIBUTE1, SERVER_ATTRIBUTE1, SUBCLASS_ATTRIBUTE1, TABLE1_ID)
VALUES (?, ?, ?, ?)
Nov 24, 2013 3:51:03 PM org.apache.cayenne.log.CommonsJdbcEventLogger logQueryParameters
INFO: [bind: 1->GLOBAL_ATTRIBUTE1:NULL, 2->SERVER_ATTRIBUTE1:NULL, 3->SUBCLASS_ATTRIBUTE1:NULL,
4->TABLE1_ID:334]
Nov 24, 2013 3:51:03 PM org.apache.cayenne.log.CommonsJdbcEventLogger logUpdateCount
INFO: === updated 1 row.
Nov 24, 2013 3:51:03 PM org.apache.cayenne.log.CommonsJdbcEventLogger logCommitTransaction
INFO: +++ transaction committed.
Nov 24, 2013 3:51:03 PM org.apache.cayenne.remote.BaseConnection sendMessage
INFO: === Message 1: flush-cascade-sync done - took 2 ms.
Nov 24, 2013 3:51:03 PM org.apache.cayenne.remote.BaseConnection sendMessage
INFO: --- Message 2: flush-cascade-sync
Nov 24, 2013 3:51:03 PM org.apache.cayenne.log.CommonsJdbcEventLogger logBeginTransaction
INFO: --- transaction started.
Nov 24, 2013 3:51:03 PM org.apache.cayenne.log.CommonsJdbcEventLogger logQuery
INFO: DELETE FROM MT_TABLE1 WHERE TABLE1_ID = ?
Nov 24, 2013 3:51:03 PM org.apache.cayenne.log.CommonsJdbcEventLogger logQueryParameters
INFO: [bind: 1->TABLE1_ID:334]
Nov 24, 2013 3:51:03 PM org.apache.cayenne.log.CommonsJdbcEventLogger logUpdateCount
INFO: === updated 1 row.
Nov 24, 2013 3:51:03 PM org.apache.cayenne.log.CommonsJdbcEventLogger logCommitTransaction
INFO: +++ transaction committed.
Nov 24, 2013 3:51:03 PM org.apache.cayenne.remote.BaseConnection sendMessage
INFO: === Message 2: flush-cascade-sync done - took 1 ms.
Tests run: 1, Failures: 0, Errors: 0, Skipped: 0, Time elapsed: 0.041 sec
Running org.apache.cayenne.access.types.EnumTest
Tests run: 5, Failures: 0, Errors: 0, Skipped: 0, Time elapsed: 0.004 sec
Running org.apache.cayenne.DataRowTest
Tests run: 1, Failures: 0, Errors: 0, Skipped: 0, Time elapsed: 0.002 sec
Running org.apache.cayenne.configuration.rop.client.ClientLocalRuntimeTest
Tests run: 2, Failures: 0, Errors: 0, Skipped: 0, Time elapsed: 0.033 sec
Running org.apache.cayenne.remote.ClientChannelTest
Tests run: 4, Failures: 0, Errors: 0, Skipped: 0, Time elapsed: 0.016 sec
Running org.apache.cayenne.CayenneContextTest
Nov 24, 2013 3:51:03 PM org.apache.cayenne.configuration.XMLDataChannelDescriptorLoader load
INFO: Loading XML configuration resource from jar:file:/home/hudson/jenkins-slave/workspace/Cayenne-trunk/cayenneTestConnection/hsql/jdk/JDK%201.6%20(latest)/label/Ubuntu/trunk/cayenne-server/target/cayenne-server-3.2.M2-SNAPSHOT-tests.jar!/cayenne-multi-tier.xml
Nov 24, 2013 3:51:03 PM org.apache.cayenne.configuration.XMLDataChannelDescriptorLoader$DataChannelChildrenHandler
createChildTagHandler
INFO: Loading XML DataMap resource from jar:file:/home/hudson/jenkins-slave/workspace/Cayenne-trunk/cayenneTestConnection/hsql/jdk/JDK%201.6%20(latest)/label/Ubuntu/trunk/cayenne-server/target/cayenne-server-3.2.M2-SNAPSHOT-tests.jar!/multi-tier.map.xml
Nov 24, 2013 3:51:03 PM org.apache.cayenne.configuration.XMLDataChannelDescriptorLoader load
INFO: Loading XML configuration resource from jar:file:/home/hudson/jenkins-slave/workspace/Cayenne-trunk/cayenneTestConnection/hsql/jdk/JDK%201.6%20(latest)/label/Ubuntu/trunk/cayenne-server/target/cayenne-server-3.2.M2-SNAPSHOT-tests.jar!/cayenne-multi-tier.xml
Nov 24, 2013 3:51:03 PM org.apache.cayenne.configuration.XMLDataChannelDescriptorLoader$DataChannelChildrenHandler
createChildTagHandler
INFO: Loading XML DataMap resource from jar:file:/home/hudson/jenkins-slave/workspace/Cayenne-trunk/cayenneTestConnection/hsql/jdk/JDK%201.6%20(latest)/label/Ubuntu/trunk/cayenne-server/target/cayenne-server-3.2.M2-SNAPSHOT-tests.jar!/multi-tier.map.xml
Nov 24, 2013 3:51:03 PM org.apache.cayenne.configuration.XMLDataChannelDescriptorLoader load
INFO: Loading XML configuration resource from jar:file:/home/hudson/jenkins-slave/workspace/Cayenne-trunk/cayenneTestConnection/hsql/jdk/JDK%201.6%20(latest)/label/Ubuntu/trunk/cayenne-server/target/cayenne-server-3.2.M2-SNAPSHOT-tests.jar!/cayenne-multi-tier.xml
Nov 24, 2013 3:51:03 PM org.apache.cayenne.configuration.XMLDataChannelDescriptorLoader$DataChannelChildrenHandler
createChildTagHandler
INFO: Loading XML DataMap resource from jar:file:/home/hudson/jenkins-slave/workspace/Cayenne-trunk/cayenneTestConnection/hsql/jdk/JDK%201.6%20(latest)/label/Ubuntu/trunk/cayenne-server/target/cayenne-server-3.2.M2-SNAPSHOT-tests.jar!/multi-tier.map.xml
Nov 24, 2013 3:51:03 PM org.apache.cayenne.configuration.XMLDataChannelDescriptorLoader load
INFO: Loading XML configuration resource from jar:file:/home/hudson/jenkins-slave/workspace/Cayenne-trunk/cayenneTestConnection/hsql/jdk/JDK%201.6%20(latest)/label/Ubuntu/trunk/cayenne-server/target/cayenne-server-3.2.M2-SNAPSHOT-tests.jar!/cayenne-multi-tier.xml
Nov 24, 2013 3:51:03 PM org.apache.cayenne.configuration.XMLDataChannelDescriptorLoader$DataChannelChildrenHandler
createChildTagHandler
INFO: Loading XML DataMap resource from jar:file:/home/hudson/jenkins-slave/workspace/Cayenne-trunk/cayenneTestConnection/hsql/jdk/JDK%201.6%20(latest)/label/Ubuntu/trunk/cayenne-server/target/cayenne-server-3.2.M2-SNAPSHOT-tests.jar!/multi-tier.map.xml
Nov 24, 2013 3:51:03 PM org.apache.cayenne.configuration.XMLDataChannelDescriptorLoader load
INFO: Loading XML configuration resource from jar:file:/home/hudson/jenkins-slave/workspace/Cayenne-trunk/cayenneTestConnection/hsql/jdk/JDK%201.6%20(latest)/label/Ubuntu/trunk/cayenne-server/target/cayenne-server-3.2.M2-SNAPSHOT-tests.jar!/cayenne-multi-tier.xml
Nov 24, 2013 3:51:03 PM org.apache.cayenne.configuration.XMLDataChannelDescriptorLoader$DataChannelChildrenHandler
createChildTagHandler
INFO: Loading XML DataMap resource from jar:file:/home/hudson/jenkins-slave/workspace/Cayenne-trunk/cayenneTestConnection/hsql/jdk/JDK%201.6%20(latest)/label/Ubuntu/trunk/cayenne-server/target/cayenne-server-3.2.M2-SNAPSHOT-tests.jar!/multi-tier.map.xml
Nov 24, 2013 3:51:03 PM org.apache.cayenne.configuration.XMLDataChannelDescriptorLoader load
INFO: Loading XML configuration resource from jar:file:/home/hudson/jenkins-slave/workspace/Cayenne-trunk/cayenneTestConnection/hsql/jdk/JDK%201.6%20(latest)/label/Ubuntu/trunk/cayenne-server/target/cayenne-server-3.2.M2-SNAPSHOT-tests.jar!/cayenne-multi-tier.xml
Nov 24, 2013 3:51:03 PM org.apache.cayenne.configuration.XMLDataChannelDescriptorLoader$DataChannelChildrenHandler
createChildTagHandler
INFO: Loading XML DataMap resource from jar:file:/home/hudson/jenkins-slave/workspace/Cayenne-trunk/cayenneTestConnection/hsql/jdk/JDK%201.6%20(latest)/label/Ubuntu/trunk/cayenne-server/target/cayenne-server-3.2.M2-SNAPSHOT-tests.jar!/multi-tier.map.xml
Nov 24, 2013 3:51:03 PM org.apache.cayenne.configuration.XMLDataChannelDescriptorLoader load
INFO: Loading XML configuration resource from jar:file:/home/hudson/jenkins-slave/workspace/Cayenne-trunk/cayenneTestConnection/hsql/jdk/JDK%201.6%20(latest)/label/Ubuntu/trunk/cayenne-server/target/cayenne-server-3.2.M2-SNAPSHOT-tests.jar!/cayenne-multi-tier.xml
Nov 24, 2013 3:51:03 PM org.apache.cayenne.configuration.XMLDataChannelDescriptorLoader$DataChannelChildrenHandler
createChildTagHandler
INFO: Loading XML DataMap resource from jar:file:/home/hudson/jenkins-slave/workspace/Cayenne-trunk/cayenneTestConnection/hsql/jdk/JDK%201.6%20(latest)/label/Ubuntu/trunk/cayenne-server/target/cayenne-server-3.2.M2-SNAPSHOT-tests.jar!/multi-tier.map.xml
Nov 24, 2013 3:51:03 PM org.apache.cayenne.configuration.XMLDataChannelDescriptorLoader load
INFO: Loading XML configuration resource from jar:file:/home/hudson/jenkins-slave/workspace/Cayenne-trunk/cayenneTestConnection/hsql/jdk/JDK%201.6%20(latest)/label/Ubuntu/trunk/cayenne-server/target/cayenne-server-3.2.M2-SNAPSHOT-tests.jar!/cayenne-multi-tier.xml
Nov 24, 2013 3:51:03 PM org.apache.cayenne.configuration.XMLDataChannelDescriptorLoader$DataChannelChildrenHandler
createChildTagHandler
INFO: Loading XML DataMap resource from jar:file:/home/hudson/jenkins-slave/workspace/Cayenne-trunk/cayenneTestConnection/hsql/jdk/JDK%201.6%20(latest)/label/Ubuntu/trunk/cayenne-server/target/cayenne-server-3.2.M2-SNAPSHOT-tests.jar!/multi-tier.map.xml
Nov 24, 2013 3:51:03 PM org.apache.cayenne.configuration.XMLDataChannelDescriptorLoader load
INFO: Loading XML configuration resource from jar:file:/home/hudson/jenkins-slave/workspace/Cayenne-trunk/cayenneTestConnection/hsql/jdk/JDK%201.6%20(latest)/label/Ubuntu/trunk/cayenne-server/target/cayenne-server-3.2.M2-SNAPSHOT-tests.jar!/cayenne-multi-tier.xml
Nov 24, 2013 3:51:03 PM org.apache.cayenne.configuration.XMLDataChannelDescriptorLoader$DataChannelChildrenHandler
createChildTagHandler
INFO: Loading XML DataMap resource from jar:file:/home/hudson/jenkins-slave/workspace/Cayenne-trunk/cayenneTestConnection/hsql/jdk/JDK%201.6%20(latest)/label/Ubuntu/trunk/cayenne-server/target/cayenne-server-3.2.M2-SNAPSHOT-tests.jar!/multi-tier.map.xml
Tests run: 9, Failures: 0, Errors: 0, Skipped: 0, Time elapsed: 0.065 sec

Results :

Tests run: 203, Failures: 0, Errors: 0, Skipped: 0

[INFO] 
[INFO] --- maven-jar-plugin:2.3.2:jar (default-jar) @ cayenne-client ---
[INFO] Building jar: /home/hudson/jenkins-slave/workspace/Cayenne-trunk/cayenneTestConnection/hsql/jdk/JDK
1.6 (latest)/label/Ubuntu/trunk/cayenne-client/target/cayenne-client-3.2.M2-SNAPSHOT.jar
[INFO] 
[INFO] >>> maven-source-plugin:2.1.2:jar (bundle-source-jar) @ cayenne-client >>>
[INFO] 
[INFO] <<< maven-source-plugin:2.1.2:jar (bundle-source-jar) @ cayenne-client <<<
[INFO] 
[INFO] --- maven-source-plugin:2.1.2:jar (bundle-source-jar) @ cayenne-client ---
[INFO] org already added, skipping
[INFO] org/apache already added, skipping
[INFO] org/apache/cayenne already added, skipping
[INFO] org/apache/cayenne/configuration already added, skipping
[INFO] org/apache/cayenne/configuration/rop already added, skipping
[INFO] org/apache/cayenne/configuration/rop/client already added, skipping
[INFO] org/apache/cayenne/remote already added, skipping
[INFO] org/apache/cayenne/remote/hessian already added, skipping
[INFO] org/apache/cayenne/remote/hessian/service already added, skipping
[INFO] org/apache/cayenne/remote/service already added, skipping
[INFO] Building jar: /home/hudson/jenkins-slave/workspace/Cayenne-trunk/cayenneTestConnection/hsql/jdk/JDK
1.6 (latest)/label/Ubuntu/trunk/cayenne-client/target/cayenne-client-3.2.M2-SNAPSHOT-sources.jar
[INFO] org already added, skipping
[INFO] org/apache already added, skipping
[INFO] org/apache/cayenne already added, skipping
[INFO] org/apache/cayenne/configuration already added, skipping
[INFO] org/apache/cayenne/configuration/rop already added, skipping
[INFO] org/apache/cayenne/configuration/rop/client already added, skipping
[INFO] org/apache/cayenne/remote already added, skipping
[INFO] org/apache/cayenne/remote/hessian already added, skipping
[INFO] org/apache/cayenne/remote/hessian/service already added, skipping
[INFO] org/apache/cayenne/remote/service already added, skipping
[INFO] 
[INFO] --- maven-install-plugin:2.3.1:install (default-install) @ cayenne-client ---
[INFO] Installing /home/hudson/jenkins-slave/workspace/Cayenne-trunk/cayenneTestConnection/hsql/jdk/JDK
1.6 (latest)/label/Ubuntu/trunk/cayenne-client/target/cayenne-client-3.2.M2-SNAPSHOT.jar to
<https://builds.apache.org/job/Cayenne-trunk/cayenneTestConnection=hsql,jdk=JDK%201.6%20(latest),label=Ubuntu/ws/.repository/org/apache/cayenne/cayenne-client/3.2.M2-SNAPSHOT/cayenne-client-3.2.M2-SNAPSHOT.jar>
[INFO] Installing /home/hudson/jenkins-slave/workspace/Cayenne-trunk/cayenneTestConnection/hsql/jdk/JDK
1.6 (latest)/label/Ubuntu/trunk/cayenne-client/pom.xml to <https://builds.apache.org/job/Cayenne-trunk/cayenneTestConnection=hsql,jdk=JDK%201.6%20(latest),label=Ubuntu/ws/.repository/org/apache/cayenne/cayenne-client/3.2.M2-SNAPSHOT/cayenne-client-3.2.M2-SNAPSHOT.pom>
[INFO] Installing /home/hudson/jenkins-slave/workspace/Cayenne-trunk/cayenneTestConnection/hsql/jdk/JDK
1.6 (latest)/label/Ubuntu/trunk/cayenne-client/target/cayenne-client-3.2.M2-SNAPSHOT-sources.jar
to <https://builds.apache.org/job/Cayenne-trunk/cayenneTestConnection=hsql,jdk=JDK%201.6%20(latest),label=Ubuntu/ws/.repository/org/apache/cayenne/cayenne-client/3.2.M2-SNAPSHOT/cayenne-client-3.2.M2-SNAPSHOT-sources.jar>
[INFO]                                                                         
[INFO] ------------------------------------------------------------------------
[INFO] Building Cayenne Project 3.2.M2-SNAPSHOT
[INFO] ------------------------------------------------------------------------
[INFO] 
[INFO] --- maven-clean-plugin:2.4.1:clean (default-clean) @ cayenne-project ---
[INFO] 
[INFO] --- maven-remote-resources-plugin:1.5:process (default) @ cayenne-project ---
[INFO] 
[INFO] --- maven-resources-plugin:2.4.3:resources (default-resources) @ cayenne-project ---
[INFO] Using 'UTF-8' encoding to copy filtered resources.
[INFO] skip non existing resourceDirectory /home/hudson/jenkins-slave/workspace/Cayenne-trunk/cayenneTestConnection/hsql/jdk/JDK
1.6 (latest)/label/Ubuntu/trunk/cayenne-project/src/main/resources
[INFO] Copying 2 resources
[INFO] 
[INFO] --- maven-compiler-plugin:2.3.2:compile (default-compile) @ cayenne-project ---
[INFO] Compiling 47 source files to /home/hudson/jenkins-slave/workspace/Cayenne-trunk/cayenneTestConnection/hsql/jdk/JDK
1.6 (latest)/label/Ubuntu/trunk/cayenne-project/target/classes
[INFO] 
[INFO] --- maven-resources-plugin:2.4.3:testResources (default-testResources) @ cayenne-project
---
[INFO] Using 'UTF-8' encoding to copy filtered resources.
[INFO] Copying 29 resources
[INFO] Copying 63 resources
[INFO] 
[INFO] --- maven-compiler-plugin:2.3.2:testCompile (default-testCompile) @ cayenne-project
---
[INFO] Compiling 6 source files to /home/hudson/jenkins-slave/workspace/Cayenne-trunk/cayenneTestConnection/hsql/jdk/JDK
1.6 (latest)/label/Ubuntu/trunk/cayenne-project/target/test-classes
[INFO] 
[INFO] --- maven-surefire-plugin:2.5:test (default-test) @ cayenne-project ---
[INFO] Surefire report directory: /home/hudson/jenkins-slave/workspace/Cayenne-trunk/cayenneTestConnection/hsql/jdk/JDK
1.6 (latest)/label/Ubuntu/trunk/cayenne-project/target/surefire-reports

-------------------------------------------------------
 T E S T S
-------------------------------------------------------
Running org.apache.cayenne.project.ProjectTest
Tests run: 1, Failures: 0, Errors: 0, Skipped: 0, Time elapsed: 0.044 sec
Running org.apache.cayenne.project.DataChannelProjectLoaderTest
Tests run: 1, Failures: 0, Errors: 1, Skipped: 0, Time elapsed: 0.068 sec <<< FAILURE!
Running org.apache.cayenne.project.upgrade.v7.ProjectUpgrader_V7Test
TEST3
org/apache/cayenne/project/upgrade/v7/6a/
Tests run: 6, Failures: 0, Errors: 2, Skipped: 0, Time elapsed: 0.168 sec <<< FAILURE!
Running org.apache.cayenne.project.DataChannelProjectSaverTest
Tests run: 2, Failures: 0, Errors: 2, Skipped: 0, Time elapsed: 0.014 sec <<< FAILURE!
Running org.apache.cayenne.project.FileProjectSaverTest
Tests run: 2, Failures: 0, Errors: 0, Skipped: 0, Time elapsed: 2.477 sec

Results :

Tests in error: 
  testLoad(org.apache.cayenne.project.DataChannelProjectLoaderTest)
  testPerformUpgradeFrom3(org.apache.cayenne.project.upgrade.v7.ProjectUpgrader_V7Test)
  testPerformUpgradeFrom6(org.apache.cayenne.project.upgrade.v7.ProjectUpgrader_V7Test)
  testSaveAs(org.apache.cayenne.project.DataChannelProjectSaverTest)
  testSaveAs_RecoverFromSaveError(org.apache.cayenne.project.DataChannelProjectSaverTest)

Tests run: 12, Failures: 0, Errors: 5, Skipped: 0

[INFO] ------------------------------------------------------------------------
[INFO] Reactor Summary:
[INFO] 
[INFO] Cayenne ........................................... SUCCESS [0.871s]
[INFO] Cayenne Build Tools Parent ........................ SUCCESS [0.012s]
[INFO] Cayenne License and Notice Bundle ................. SUCCESS [2.005s]
[INFO] Common Unit Test Utilities ........................ SUCCESS [1.113s]
[INFO] Cayenne Dependency Injection Container ............ SUCCESS [5.321s]
[INFO] Cayenne Server .................................... SUCCESS [1:31.049s]
[INFO] Cayenne ROP Client ................................ SUCCESS [19.207s]
[INFO] Cayenne Project ................................... FAILURE [7.510s]
[INFO] Cayenne Tools ..................................... SKIPPED
[INFO] Cayenne Lifecycle Utilities ....................... SKIPPED
[INFO] Cayenne Integration Tests Parent .................. SKIPPED
[INFO] Cayenne Maven Plugins ............................. SKIPPED
[INFO] Cayenne Maven Plugin .............................. SKIPPED
[INFO] Integration Tests - Cayenne Tools ................. SKIPPED
[INFO] Cayenne Modeler Parent ............................ SKIPPED
[INFO] Cayenne WebObjects Compatibility Library .......... SKIPPED
[INFO] Cayenne Modeler ................................... SKIPPED
[INFO] Cayenne Modeler Maven Plugin ...................... SKIPPED
[INFO] Cayenne Tutorial .................................. SKIPPED
[INFO] Cayenne ROP Server Tutorial ....................... SKIPPED
[INFO] Cayenne ROP Client Tutorial ....................... SKIPPED
[INFO] Cayenne Tutorials ................................. SKIPPED
[INFO] Cayenne Documenation Parent ....................... SKIPPED
[INFO] Cayenne Documentation ............................. SKIPPED
[INFO] Cayenne Docbook Documentation ..................... SKIPPED
[INFO] Docbook: Cayenne Stylesheets ...................... SKIPPED
[INFO] Docbook: Cayenne Guide ............................ SKIPPED
[INFO] Docbook: Getting Started with Cayenne ............. SKIPPED
[INFO] Docbook: Getting Started with Cayenne ROP ......... SKIPPED
[INFO] Docbook: Cayenne New Features and Upgrade Guide ... SKIPPED
[INFO] ------------------------------------------------------------------------
[INFO] BUILD FAILURE
[INFO] ------------------------------------------------------------------------
[INFO] Total time: 2:08.897s
[INFO] Finished at: Sun Nov 24 15:51:11 UTC 2013
[INFO] Final Memory: 49M/252M
[INFO] ------------------------------------------------------------------------
[ERROR] Failed to execute goal org.apache.maven.plugins:maven-surefire-plugin:2.5:test (default-test)
on project cayenne-project: There are test failures.
[ERROR] 
[ERROR] Please refer to /home/hudson/jenkins-slave/workspace/Cayenne-trunk/cayenneTestConnection/hsql/jdk/JDK
1.6 (latest)/label/Ubuntu/trunk/cayenne-project/target/surefire-reports for the individual
test results.
[ERROR] -> [Help 1]
org.apache.maven.lifecycle.LifecycleExecutionException: Failed to execute goal org.apache.maven.plugins:maven-surefire-plugin:2.5:test
(default-test) on project cayenne-project: There are test failures.

Please refer to /home/hudson/jenkins-slave/workspace/Cayenne-trunk/cayenneTestConnection/hsql/jdk/JDK
1.6 (latest)/label/Ubuntu/trunk/cayenne-project/target/surefire-reports for the individual
test results.
	at org.apache.maven.lifecycle.internal.MojoExecutor.execute(MojoExecutor.java:213)
	at org.apache.maven.lifecycle.internal.MojoExecutor.execute(MojoExecutor.java:153)
	at org.apache.maven.lifecycle.internal.MojoExecutor.execute(MojoExecutor.java:145)
	at org.apache.maven.lifecycle.internal.LifecycleModuleBuilder.buildProject(LifecycleModuleBuilder.java:84)
	at org.apache.maven.lifecycle.internal.LifecycleModuleBuilder.buildProject(LifecycleModuleBuilder.java:59)
	at org.apache.maven.lifecycle.internal.LifecycleStarter.singleThreadedBuild(LifecycleStarter.java:183)
	at org.apache.maven.lifecycle.internal.LifecycleStarter.execute(LifecycleStarter.java:161)
	at org.apache.maven.DefaultMaven.doExecute(DefaultMaven.java:320)
	at org.apache.maven.DefaultMaven.execute(DefaultMaven.java:156)
	at org.apache.maven.cli.MavenCli.execute(MavenCli.java:537)
	at org.apache.maven.cli.MavenCli.doMain(MavenCli.java:196)
	at org.apache.maven.cli.MavenCli.main(MavenCli.java:141)
	at sun.reflect.NativeMethodAccessorImpl.invoke0(Native Method)
	at sun.reflect.NativeMethodAccessorImpl.invoke(NativeMethodAccessorImpl.java:39)
	at sun.reflect.DelegatingMethodAccessorImpl.invoke(DelegatingMethodAccessorImpl.java:25)
	at java.lang.reflect.Method.invoke(Method.java:597)
	at org.codehaus.plexus.classworlds.launcher.Launcher.launchEnhanced(Launcher.java:290)
	at org.codehaus.plexus.classworlds.launcher.Launcher.launch(Launcher.java:230)
	at org.codehaus.plexus.classworlds.launcher.Launcher.mainWithExitCode(Launcher.java:409)
	at org.codehaus.plexus.classworlds.launcher.Launcher.main(Launcher.java:352)
Caused by: org.apache.maven.plugin.MojoFailureException: There are test failures.

Please refer to /home/hudson/jenkins-slave/workspace/Cayenne-trunk/cayenneTestConnection/hsql/jdk/JDK
1.6 (latest)/label/Ubuntu/trunk/cayenne-project/target/surefire-reports for the individual
test results.
	at org.apache.maven.plugin.surefire.SurefirePlugin.execute(SurefirePlugin.java:629)
	at org.apache.maven.plugin.DefaultBuildPluginManager.executeMojo(DefaultBuildPluginManager.java:101)
	at org.apache.maven.lifecycle.internal.MojoExecutor.execute(MojoExecutor.java:209)
	... 19 more
[ERROR] 
[ERROR] Re-run Maven using the -X switch to enable full debug logging.
[ERROR] 
[ERROR] For more information about the errors and possible solutions, please read the following
articles:
[ERROR] [Help 1] http://cwiki.apache.org/confluence/display/MAVEN/MojoFailureException
[ERROR] 
[ERROR] After correcting the problems, you can resume the build with the command
[ERROR]   mvn <goals> -rf :cayenne-project
Build step 'Invoke top-level Maven targets' marked build as failure

Mime
View raw message