cayenne-commits mailing list archives

Site index · List index
Message view « Date » · « Thread »
Top « Date » · « Thread »
From Apache Jenkins Server <jenk...@builds.apache.org>
Subject Build failed in Jenkins: Cayenne-trunk » derby,JDK 1.7 (latest),Ubuntu #962
Date Sun, 17 Nov 2013 14:56:22 GMT
See <https://builds.apache.org/job/Cayenne-trunk/cayenneTestConnection=derby,jdk=JDK%201.7%20(latest),label=Ubuntu/962/changes>

Changes:

[aadamchik] CAY-1883 - Clean up Cayenne maven structure - get rid of aggregate modules

have to explicitly declare license inclusion in each distributed module...

[aadamchik] CAY-1883 - Clean up Cayenne maven structure - get rid of aggregate modules

removing cayenne-build-maven-plugin... we'll be initializing date via Maven

[aadamchik] formatting license

[aadamchik] CAY-1883 - Clean up Cayenne maven structure - get rid of aggregate modules

renaming buildtools back to build-tools to fix buoldbot path

------------------------------------------
[...truncated 11524 lines...]
985/1292 KB   
989/1292 KB   
993/1292 KB   
997/1292 KB   
1001/1292 KB   
1005/1292 KB   
1009/1292 KB   
1013/1292 KB   
1017/1292 KB   
1021/1292 KB   
1025/1292 KB   
1028/1292 KB   
1032/1292 KB   
1036/1292 KB   
1040/1292 KB   
1044/1292 KB   
1048/1292 KB   
1052/1292 KB   
1056/1292 KB   
1060/1292 KB   
1064/1292 KB   
1068/1292 KB   
1072/1292 KB   
1076/1292 KB   
1080/1292 KB   
1084/1292 KB   
1088/1292 KB   
1092/1292 KB   
1096/1292 KB   
1100/1292 KB   
1104/1292 KB   
1105/1292 KB   
1109/1292 KB   
1113/1292 KB   
1117/1292 KB   
1121/1292 KB   
1125/1292 KB   
1129/1292 KB   
1133/1292 KB   
1137/1292 KB   
1141/1292 KB   
1145/1292 KB   
1149/1292 KB   
1153/1292 KB   
1157/1292 KB   
1161/1292 KB   
1165/1292 KB   
1169/1292 KB   
1173/1292 KB   
1177/1292 KB   
1181/1292 KB   
1185/1292 KB   
1189/1292 KB   
1193/1292 KB   
1197/1292 KB   
1201/1292 KB   
1205/1292 KB   
1209/1292 KB   
1213/1292 KB   
1217/1292 KB   
1219/1292 KB   
1222/1292 KB   
1226/1292 KB   
1230/1292 KB   
1234/1292 KB   
1238/1292 KB   
1242/1292 KB   
1246/1292 KB   
1250/1292 KB   
1254/1292 KB   
1258/1292 KB   
1262/1292 KB   
1266/1292 KB   
1270/1292 KB   
1274/1292 KB   
1278/1292 KB   
1282/1292 KB   
1286/1292 KB   
1290/1292 KB   
1292/1292 KB   
               
Downloaded: http://maven.objectstyle.org/nexus/content/groups/cayenne-deps/org/apache/ant/ant/1.7.1/ant-1.7.1.jar
(1292 KB at 879.5 KB/sec)
[INFO] Executing tasks
[INFO] Executed tasks
[INFO] 
[INFO] --- maven-remote-resources-plugin:1.5:process (default) @ cayenne-server ---
[INFO] 
[INFO] --- maven-resources-plugin:2.4.3:resources (default-resources) @ cayenne-server ---
[INFO] Using 'UTF-8' encoding to copy filtered resources.
[INFO] Copying 17 resources
[INFO] Copying 19 resources
[INFO] 
[INFO] --- maven-compiler-plugin:2.3.2:compile (default-compile) @ cayenne-server ---
[INFO] Compiling 929 source files to <https://builds.apache.org/job/Cayenne-trunk/cayenneTestConnection=derby,jdk=JDK%201.7%20(latest),label=Ubuntu/ws/trunk/cayenne-server/target/classes>
[INFO] 
[INFO] --- maven-resources-plugin:2.4.3:testResources (default-testResources) @ cayenne-server
---
[INFO] Using 'UTF-8' encoding to copy filtered resources.
[INFO] Copying 81 resources
[INFO] Copying 1345 resources
[INFO] 
[INFO] --- maven-compiler-plugin:2.3.2:testCompile (default-testCompile) @ cayenne-server
---
[INFO] Compiling 912 source files to <https://builds.apache.org/job/Cayenne-trunk/cayenneTestConnection=derby,jdk=JDK%201.7%20(latest),label=Ubuntu/ws/trunk/cayenne-server/target/test-classes>
[INFO] 
[INFO] --- maven-surefire-plugin:2.5:test (default-test) @ cayenne-server ---
[INFO] Surefire report directory: <https://builds.apache.org/job/Cayenne-trunk/cayenneTestConnection=derby,jdk=JDK%201.7%20(latest),label=Ubuntu/ws/trunk/cayenne-server/target/surefire-reports>

-------------------------------------------------------
 T E S T S
-------------------------------------------------------
Running org.apache.cayenne.util.EntityMergeSupportTest
Nov 17, 2013 2:56:21 PM org.apache.cayenne.unit.di.server.ConnectionProperties loadDefaultProperties
INFO: Found connection properties at /home/jenkins/.cayenne/connection.properties
Nov 17, 2013 2:56:21 PM org.apache.cayenne.unit.di.server.ServerCaseDataSourceInfoProvider
get
INFO: Invalid connection key 'derby', trying default: internal_embedded_datasource
Nov 17, 2013 2:56:21 PM org.apache.cayenne.unit.di.server.ServerCaseDataSourceInfoProvider
get
INFO: loaded connection info: [org.apache.cayenne.conn.DataSourceInfo:
   user name: sa
   password: **********
   driver: org.hsqldb.jdbcDriver
   db adapter class: org.apache.cayenne.dba.hsqldb.HSQLDBAdapter
   url: jdbc:hsqldb:mem:aname
   min. connections: 1
   max. connections: 1
]
org.apache.maven.surefire.booter.SurefireExecutionException: org.apache.cayenne.util.EntityMergeSupportTest;
nested exception is java.lang.ExceptionInInitializerError: null; nested exception is org.apache.maven.surefire.testset.TestSetFailedException:
org.apache.cayenne.util.EntityMergeSupportTest; nested exception is java.lang.ExceptionInInitializerError:
null
org.apache.maven.surefire.testset.TestSetFailedException: org.apache.cayenne.util.EntityMergeSupportTest;
nested exception is java.lang.ExceptionInInitializerError: null
java.lang.ExceptionInInitializerError
	at sun.reflect.NativeConstructorAccessorImpl.newInstance0(Native Method)
	at sun.reflect.NativeConstructorAccessorImpl.newInstance(NativeConstructorAccessorImpl.java:57)
	at sun.reflect.DelegatingConstructorAccessorImpl.newInstance(DelegatingConstructorAccessorImpl.java:45)
	at java.lang.reflect.Constructor.newInstance(Constructor.java:526)
	at junit.framework.TestSuite.createTest(TestSuite.java:131)
	at junit.framework.TestSuite.addTestMethod(TestSuite.java:114)
	at junit.framework.TestSuite.<init>(TestSuite.java:75)
	at sun.reflect.NativeConstructorAccessorImpl.newInstance0(Native Method)
	at sun.reflect.NativeConstructorAccessorImpl.newInstance(NativeConstructorAccessorImpl.java:57)
	at sun.reflect.DelegatingConstructorAccessorImpl.newInstance(DelegatingConstructorAccessorImpl.java:45)
	at java.lang.reflect.Constructor.newInstance(Constructor.java:526)
	at org.apache.maven.surefire.junit.JUnitTestSet.constructTestObject(JUnitTestSet.java:151)
	at org.apache.maven.surefire.junit.JUnitTestSet.execute(JUnitTestSet.java:197)
	at org.apache.maven.surefire.suite.AbstractDirectoryTestSuite.executeTestSet(AbstractDirectoryTestSuite.java:115)
	at org.apache.maven.surefire.suite.AbstractDirectoryTestSuite.execute(AbstractDirectoryTestSuite.java:102)
	at org.apache.maven.surefire.Surefire.run(Surefire.java:180)
	at sun.reflect.NativeMethodAccessorImpl.invoke0(Native Method)
	at sun.reflect.NativeMethodAccessorImpl.invoke(NativeMethodAccessorImpl.java:57)
	at sun.reflect.DelegatingMethodAccessorImpl.invoke(DelegatingMethodAccessorImpl.java:43)
	at java.lang.reflect.Method.invoke(Method.java:606)
	at org.apache.maven.surefire.booter.SurefireBooter.runSuitesInProcess(SurefireBooter.java:350)
	at org.apache.maven.surefire.booter.SurefireBooter.main(SurefireBooter.java:1021)
Caused by: java.lang.RuntimeException: Error rebuilding schema
	at org.apache.cayenne.unit.di.server.SchemaBuilder.rebuildSchema(SchemaBuilder.java:132)
	at org.apache.cayenne.unit.di.server.ServerCase.<clinit>(ServerCase.java:48)
	... 22 more
Caused by: java.sql.SQLException: Can not load JDBC driver named 'org.hsqldb.jdbcDriver':
org.hsqldb.jdbcDriver
	at org.apache.cayenne.conn.DriverDataSource.loadDriver(DriverDataSource.java:63)
	at org.apache.cayenne.conn.DriverDataSource.getDriver(DriverDataSource.java:267)
	at org.apache.cayenne.conn.DriverDataSource.getConnection(DriverDataSource.java:147)
	at org.apache.cayenne.conn.PooledConnectionImpl.reconnect(PooledConnectionImpl.java:83)
	at org.apache.cayenne.conn.PooledConnectionImpl.getConnection(PooledConnectionImpl.java:120)
	at org.apache.cayenne.conn.PoolManager.uncheckConnection(PoolManager.java:417)
	at org.apache.cayenne.conn.PoolManager.getConnection(PoolManager.java:401)
	at org.apache.cayenne.conn.PoolManager.getConnection(PoolManager.java:374)
	at org.apache.cayenne.unit.di.server.SchemaBuilder.dropSchema(SchemaBuilder.java:258)
	at org.apache.cayenne.unit.di.server.SchemaBuilder.dropSchema(SchemaBuilder.java:160)
	at org.apache.cayenne.unit.di.server.SchemaBuilder.rebuildSchema(SchemaBuilder.java:127)
	... 23 more
[INFO] ------------------------------------------------------------------------
[INFO] Reactor Summary:
[INFO] 
[INFO] Cayenne ........................................... SUCCESS [18.002s]
[INFO] Cayenne Build Tools Parent ........................ SUCCESS [0.015s]
[INFO] Cayenne License and Notice Bundle ................. SUCCESS [53.749s]
[INFO] Common Unit Test Utilities ........................ SUCCESS [2.260s]
[INFO] Cayenne Dependency Injection Container ............ SUCCESS [3.419s]
[INFO] Cayenne Server .................................... FAILURE [49.223s]
[INFO] Cayenne ROP Client ................................ SKIPPED
[INFO] Cayenne Project ................................... SKIPPED
[INFO] Cayenne Tools ..................................... SKIPPED
[INFO] Cayenne Lifecycle Utilities ....................... SKIPPED
[INFO] Cayenne Integration Tests Parent .................. SKIPPED
[INFO] Cayenne Maven Plugins ............................. SKIPPED
[INFO] Cayenne Maven Plugin .............................. SKIPPED
[INFO] Integration Tests - Cayenne Tools ................. SKIPPED
[INFO] Cayenne Modeler Parent ............................ SKIPPED
[INFO] Cayenne WebObjects Compatibility Library .......... SKIPPED
[INFO] Cayenne Modeler ................................... SKIPPED
[INFO] Cayenne Modeler Maven Plugin ...................... SKIPPED
[INFO] Cayenne Tutorial .................................. SKIPPED
[INFO] Cayenne ROP Server Tutorial ....................... SKIPPED
[INFO] Cayenne ROP Client Tutorial ....................... SKIPPED
[INFO] Cayenne Tutorials ................................. SKIPPED
[INFO] Cayenne Documenation Parent ....................... SKIPPED
[INFO] Cayenne Documentation ............................. SKIPPED
[INFO] Cayenne Docbook Documentation ..................... SKIPPED
[INFO] Docbook: Cayenne Stylesheets ...................... SKIPPED
[INFO] Docbook: Cayenne Guide ............................ SKIPPED
[INFO] Docbook: Getting Started with Cayenne ............. SKIPPED
[INFO] Docbook: Getting Started with Cayenne ROP ......... SKIPPED
[INFO] Docbook: Cayenne New Features and Upgrade Guide ... SKIPPED
[INFO] ------------------------------------------------------------------------
[INFO] BUILD FAILURE
[INFO] ------------------------------------------------------------------------
[INFO] Total time: 2:13.998s
[INFO] Finished at: Sun Nov 17 14:56:22 UTC 2013
[INFO] Final Memory: 38M/238M
[INFO] ------------------------------------------------------------------------
[ERROR] Failed to execute goal org.apache.maven.plugins:maven-surefire-plugin:2.5:test (default-test)
on project cayenne-server: There are test failures.
[ERROR] 
[ERROR] Please refer to <https://builds.apache.org/job/Cayenne-trunk/cayenneTestConnection=derby,jdk=JDK%201.7%20(latest),label=Ubuntu/ws/trunk/cayenne-server/target/surefire-reports>
for the individual test results.
[ERROR] -> [Help 1]
org.apache.maven.lifecycle.LifecycleExecutionException: Failed to execute goal org.apache.maven.plugins:maven-surefire-plugin:2.5:test
(default-test) on project cayenne-server: There are test failures.

Please refer to <https://builds.apache.org/job/Cayenne-trunk/cayenneTestConnection=derby,jdk=JDK%201.7%20(latest),label=Ubuntu/ws/trunk/cayenne-server/target/surefire-reports>
for the individual test results.
	at org.apache.maven.lifecycle.internal.MojoExecutor.execute(MojoExecutor.java:213)
	at org.apache.maven.lifecycle.internal.MojoExecutor.execute(MojoExecutor.java:153)
	at org.apache.maven.lifecycle.internal.MojoExecutor.execute(MojoExecutor.java:145)
	at org.apache.maven.lifecycle.internal.LifecycleModuleBuilder.buildProject(LifecycleModuleBuilder.java:84)
	at org.apache.maven.lifecycle.internal.LifecycleModuleBuilder.buildProject(LifecycleModuleBuilder.java:59)
	at org.apache.maven.lifecycle.internal.LifecycleStarter.singleThreadedBuild(LifecycleStarter.java:183)
	at org.apache.maven.lifecycle.internal.LifecycleStarter.execute(LifecycleStarter.java:161)
	at org.apache.maven.DefaultMaven.doExecute(DefaultMaven.java:320)
	at org.apache.maven.DefaultMaven.execute(DefaultMaven.java:156)
	at org.apache.maven.cli.MavenCli.execute(MavenCli.java:537)
	at org.apache.maven.cli.MavenCli.doMain(MavenCli.java:196)
	at org.apache.maven.cli.MavenCli.main(MavenCli.java:141)
	at sun.reflect.NativeMethodAccessorImpl.invoke0(Native Method)
	at sun.reflect.NativeMethodAccessorImpl.invoke(NativeMethodAccessorImpl.java:57)
	at sun.reflect.DelegatingMethodAccessorImpl.invoke(DelegatingMethodAccessorImpl.java:43)
	at java.lang.reflect.Method.invoke(Method.java:606)
	at org.codehaus.plexus.classworlds.launcher.Launcher.launchEnhanced(Launcher.java:290)
	at org.codehaus.plexus.classworlds.launcher.Launcher.launch(Launcher.java:230)
	at org.codehaus.plexus.classworlds.launcher.Launcher.mainWithExitCode(Launcher.java:409)
	at org.codehaus.plexus.classworlds.launcher.Launcher.main(Launcher.java:352)
Caused by: org.apache.maven.plugin.MojoFailureException: There are test failures.

Please refer to <https://builds.apache.org/job/Cayenne-trunk/cayenneTestConnection=derby,jdk=JDK%201.7%20(latest),label=Ubuntu/ws/trunk/cayenne-server/target/surefire-reports>
for the individual test results.
	at org.apache.maven.plugin.surefire.SurefirePlugin.execute(SurefirePlugin.java:629)
	at org.apache.maven.plugin.DefaultBuildPluginManager.executeMojo(DefaultBuildPluginManager.java:101)
	at org.apache.maven.lifecycle.internal.MojoExecutor.execute(MojoExecutor.java:209)
	... 19 more
[ERROR] 
[ERROR] Re-run Maven using the -X switch to enable full debug logging.
[ERROR] 
[ERROR] For more information about the errors and possible solutions, please read the following
articles:
[ERROR] [Help 1] http://cwiki.apache.org/confluence/display/MAVEN/MojoFailureException
[ERROR] 
[ERROR] After correcting the problems, you can resume the build with the command
[ERROR]   mvn <goals> -rf :cayenne-server
Build step 'Invoke top-level Maven targets' marked build as failure

Mime
View raw message