cayenne-commits mailing list archives

Site index · List index
Message view « Date » · « Thread »
Top « Date » · « Thread »
From Apache Jenkins Server <jenk...@builds.apache.org>
Subject Build failed in Jenkins: Cayenne-trunk » h2,JDK 1.6 (latest),Ubuntu #961
Date Sun, 17 Nov 2013 12:08:27 GMT
See <https://builds.apache.org/job/Cayenne-trunk/cayenneTestConnection=h2,jdk=JDK%201.6%20(latest),label=Ubuntu/961/changes>

Changes:

[aadamchik] CAY-1883 - Clean up Cayenne maven structure - get rid of aggregate modules

pom cleanup

[aadamchik] CAY-1883 - Clean up Cayenne maven structure - get rid of aggregate modules

release notes

[aadamchik] CAY-1883 - Clean up Cayenne maven structure - get rid of aggregate modules

configuring cayenne-server

[aadamchik] CAY-1883 - Clean up Cayenne maven structure - get rid of aggregate modules

configuring cayenne-server

[aadamchik] CAY-1883 - Clean up Cayenne maven structure - get rid of aggregate modules

renaming core to server

[aadamchik] CAY-1883 - Clean up Cayenne maven structure - get rid of aggregate modules

removing cayenne-server, will rename cayenne-core to server shortly

[aadamchik] cleaning up pom

[aadamchik] cleaning up cross-layer dependencies

[aadamchik] refactoring garbage test bootstrap code, fixing pom arguments formatting

------------------------------------------
[...truncated 5641 lines...]
270/412 KB   464/506 KB   38/64 KB   79/256 KB   
270/412 KB   468/506 KB   38/64 KB   79/256 KB   
270/412 KB   472/506 KB   38/64 KB   79/256 KB   
270/412 KB   476/506 KB   38/64 KB   79/256 KB   
270/412 KB   478/506 KB   38/64 KB   79/256 KB   
272/412 KB   478/506 KB   38/64 KB   79/256 KB   
276/412 KB   478/506 KB   38/64 KB   79/256 KB   
280/412 KB   478/506 KB   38/64 KB   79/256 KB   
281/412 KB   478/506 KB   38/64 KB   79/256 KB   
281/412 KB   478/506 KB   42/64 KB   79/256 KB   
281/412 KB   478/506 KB   45/64 KB   79/256 KB   
281/412 KB   478/506 KB   48/64 KB   79/256 KB   
281/412 KB   478/506 KB   50/64 KB   79/256 KB   
281/412 KB   478/506 KB   54/64 KB   79/256 KB   
281/412 KB   478/506 KB   57/64 KB   79/256 KB   
285/412 KB   478/506 KB   57/64 KB   79/256 KB   
287/412 KB   478/506 KB   57/64 KB   79/256 KB   
287/412 KB   479/506 KB   57/64 KB   79/256 KB   
287/412 KB   483/506 KB   57/64 KB   79/256 KB   
287/412 KB   483/506 KB   57/64 KB   83/256 KB   
287/412 KB   483/506 KB   57/64 KB   87/256 KB   
287/412 KB   483/506 KB   57/64 KB   91/256 KB   
287/412 KB   483/506 KB   57/64 KB   95/256 KB   
287/412 KB   483/506 KB   57/64 KB   99/256 KB   
287/412 KB   483/506 KB   57/64 KB   103/256 KB   
287/412 KB   483/506 KB   57/64 KB   107/256 KB   
287/412 KB   483/506 KB   57/64 KB   110/256 KB   
287/412 KB   487/506 KB   57/64 KB   110/256 KB   
287/412 KB   491/506 KB   57/64 KB   110/256 KB   
287/412 KB   495/506 KB   57/64 KB   110/256 KB   
287/412 KB   499/506 KB   57/64 KB   110/256 KB   
287/412 KB   499/506 KB   59/64 KB   110/256 KB   
287/412 KB   503/506 KB   59/64 KB   110/256 KB   
287/412 KB   506/506 KB   59/64 KB   110/256 KB   
291/412 KB   506/506 KB   59/64 KB   110/256 KB   
294/412 KB   506/506 KB   59/64 KB   110/256 KB   
298/412 KB   506/506 KB   59/64 KB   110/256 KB   
302/412 KB   506/506 KB   59/64 KB   110/256 KB   
306/412 KB   506/506 KB   59/64 KB   110/256 KB   
310/412 KB   506/506 KB   59/64 KB   110/256 KB   
314/412 KB   506/506 KB   59/64 KB   110/256 KB   
318/412 KB   506/506 KB   59/64 KB   110/256 KB   
322/412 KB   506/506 KB   59/64 KB   110/256 KB   
324/412 KB   506/506 KB   59/64 KB   110/256 KB   
324/412 KB   506/506 KB   63/64 KB   110/256 KB   
324/412 KB   506/506 KB   64/64 KB   110/256 KB   
328/412 KB   506/506 KB   64/64 KB   110/256 KB   
332/412 KB   506/506 KB   64/64 KB   110/256 KB   
336/412 KB   506/506 KB   64/64 KB   110/256 KB   
340/412 KB   506/506 KB   64/64 KB   110/256 KB   
344/412 KB   506/506 KB   64/64 KB   110/256 KB   
348/412 KB   506/506 KB   64/64 KB   110/256 KB   
352/412 KB   506/506 KB   64/64 KB   110/256 KB   
355/412 KB   506/506 KB   64/64 KB   110/256 KB   
355/412 KB   506/506 KB   64/64 KB   114/256 KB   
355/412 KB   506/506 KB   64/64 KB   118/256 KB   
355/412 KB   506/506 KB   64/64 KB   122/256 KB   
358/412 KB   506/506 KB   64/64 KB   122/256 KB   
358/412 KB   506/506 KB   64/64 KB   126/256 KB   
362/412 KB   506/506 KB   64/64 KB   126/256 KB   
362/412 KB   506/506 KB   64/64 KB   130/256 KB   
366/412 KB   506/506 KB   64/64 KB   130/256 KB   
366/412 KB   506/506 KB   64/64 KB   134/256 KB   
368/412 KB   506/506 KB   64/64 KB   134/256 KB   
368/412 KB   506/506 KB   64/64 KB   138/256 KB   
368/412 KB   506/506 KB   64/64 KB   142/256 KB   
368/412 KB   506/506 KB   64/64 KB   146/256 KB   
368/412 KB   506/506 KB   64/64 KB   149/256 KB   
369/412 KB   506/506 KB   64/64 KB   149/256 KB   
373/412 KB   506/506 KB   64/64 KB   149/256 KB   
376/412 KB   506/506 KB   64/64 KB   149/256 KB   
378/412 KB   506/506 KB   64/64 KB   149/256 KB   
382/412 KB   506/506 KB   64/64 KB   149/256 KB   
386/412 KB   506/506 KB   64/64 KB   149/256 KB   
390/412 KB   506/506 KB   64/64 KB   149/256 KB   
393/412 KB   506/506 KB   64/64 KB   149/256 KB   
396/412 KB   506/506 KB   64/64 KB   149/256 KB   
400/412 KB   506/506 KB   64/64 KB   149/256 KB   
404/412 KB   506/506 KB   64/64 KB   149/256 KB   
408/412 KB   506/506 KB   64/64 KB   149/256 KB   
412/412 KB   506/506 KB   64/64 KB   149/256 KB   
412/412 KB   506/506 KB   64/64 KB   151/256 KB   
412/412 KB   506/506 KB   64/64 KB   155/256 KB   
412/412 KB   506/506 KB   64/64 KB   159/256 KB   
412/412 KB   506/506 KB   64/64 KB   163/256 KB   
412/412 KB   506/506 KB   64/64 KB   167/256 KB   
412/412 KB   506/506 KB   64/64 KB   171/256 KB   
412/412 KB   506/506 KB   64/64 KB   175/256 KB   
412/412 KB   506/506 KB   64/64 KB   179/256 KB   
412/412 KB   506/506 KB   64/64 KB   183/256 KB   
412/412 KB   506/506 KB   64/64 KB   187/256 KB   
412/412 KB   506/506 KB   64/64 KB   191/256 KB   
412/412 KB   506/506 KB   64/64 KB   194/256 KB   
                                                  
Downloaded: http://maven.objectstyle.org/nexus/content/groups/cayenne-deps/velocity/velocity-dep/1.4/velocity-dep-1.4.jar
(506 KB at 490.4 KB/sec)
412/412 KB   64/64 KB   198/256 KB                
412/412 KB   64/64 KB   202/256 KB   
412/412 KB   64/64 KB   206/256 KB   
412/412 KB   64/64 KB   210/256 KB   
412/412 KB   64/64 KB   214/256 KB   
412/412 KB   64/64 KB   218/256 KB   
412/412 KB   64/64 KB   222/256 KB   
412/412 KB   64/64 KB   226/256 KB   
412/412 KB   64/64 KB   230/256 KB   
412/412 KB   64/64 KB   234/256 KB   
412/412 KB   64/64 KB   238/256 KB   
412/412 KB   64/64 KB   242/256 KB   
412/412 KB   64/64 KB   246/256 KB   
412/412 KB   64/64 KB   250/256 KB   
412/412 KB   64/64 KB   252/256 KB   
                                     
Downloaded: http://maven.objectstyle.org/nexus/content/groups/cayenne-deps/oro/oro/2.0.8/oro-2.0.8.jar
(64 KB at 112.6 KB/sec)
412/412 KB   253/256 KB              
412/412 KB   256/256 KB   
                          
Downloaded: http://maven.objectstyle.org/nexus/content/groups/cayenne-deps/org/apache/velocity/velocity/1.6.4/velocity-1.6.4.jar
(412 KB at 385.3 KB/sec)
                          
Downloaded: http://maven.objectstyle.org/nexus/content/groups/cayenne-deps/commons-lang/commons-lang/2.4/commons-lang-2.4.jar
(256 KB at 306.2 KB/sec)
[INFO] Setting property: classpath.resource.loader.class => 'org.codehaus.plexus.velocity.ContextClassLoaderResourceLoader'.
[INFO] Setting property: velocimacro.messages.on => 'false'.
[INFO] Setting property: resource.loader => 'classpath'.
[INFO] Setting property: resource.manager.logwhenfound => 'false'.
[INFO] ------------------------------------------------------------------------
[INFO] Reactor Summary:
[INFO] 
[INFO] Cayenne ........................................... FAILURE [38.205s]
[INFO] Cayenne Build Tools Parent ........................ SKIPPED
[INFO] Cayenne Internal Build Plugin ..................... SKIPPED
[INFO] Cayenne License and Notice Bundle ................. SKIPPED
[INFO] Common Unit Test Utilities ........................ SKIPPED
[INFO] Cayenne Dependency Injection Container ............ SKIPPED
[INFO] Cayenne Server .................................... SKIPPED
[INFO] Cayenne ROP Client ................................ SKIPPED
[INFO] Cayenne Project ................................... SKIPPED
[INFO] Cayenne Tools ..................................... SKIPPED
[INFO] Cayenne Lifecycle Utilities ....................... SKIPPED
[INFO] Cayenne Integration Tests Parent .................. SKIPPED
[INFO] Cayenne Maven Plugins ............................. SKIPPED
[INFO] Cayenne Maven Plugin .............................. SKIPPED
[INFO] Integration Tests - Cayenne Tools ................. SKIPPED
[INFO] Cayenne Modeler Parent ............................ SKIPPED
[INFO] Cayenne WebObjects Compatibility Library .......... SKIPPED
[INFO] Cayenne Modeler ................................... SKIPPED
[INFO] Cayenne Modeler Maven Plugin ...................... SKIPPED
[INFO] Cayenne Tutorial .................................. SKIPPED
[INFO] Cayenne ROP Server Tutorial ....................... SKIPPED
[INFO] Cayenne ROP Client Tutorial ....................... SKIPPED
[INFO] Cayenne Tutorials ................................. SKIPPED
[INFO] Cayenne Documenation Parent ....................... SKIPPED
[INFO] Cayenne Documentation ............................. SKIPPED
[INFO] Cayenne Docbook Documentation ..................... SKIPPED
[INFO] Docbook: Cayenne Stylesheets ...................... SKIPPED
[INFO] Docbook: Cayenne Guide ............................ SKIPPED
[INFO] Docbook: Getting Started with Cayenne ............. SKIPPED
[INFO] Docbook: Getting Started with Cayenne ROP ......... SKIPPED
[INFO] Docbook: Cayenne New Features and Upgrade Guide ... SKIPPED
[INFO] ------------------------------------------------------------------------
[INFO] BUILD FAILURE
[INFO] ------------------------------------------------------------------------
[INFO] Total time: 46.187s
[INFO] Finished at: Sun Nov 17 12:08:26 UTC 2013
[INFO] Final Memory: 11M/58M
[INFO] ------------------------------------------------------------------------
[ERROR] Failed to execute goal org.apache.maven.plugins:maven-remote-resources-plugin:1.2:process
(default) on project cayenne-parent: Resources JAR cannot be found. Requested download does
not exist. Could not find artifact org.apache.cayenne.buildtools:cayenne-legal:jar:3.2M2-SNAPSHOT
[ERROR] 
[ERROR] Try downloading the file manually from the project website.
[ERROR] 
[ERROR] Then, install it using the command:
[ERROR] mvn install:install-file -DgroupId=org.apache.cayenne.buildtools -DartifactId=cayenne-legal
-Dversion=3.2M2-SNAPSHOT -Dpackaging=jar -Dfile=/path/to/file
[ERROR] 
[ERROR] Alternatively, if you host your own repository you can deploy the file there:
[ERROR] mvn deploy:deploy-file -DgroupId=org.apache.cayenne.buildtools -DartifactId=cayenne-legal
-Dversion=3.2M2-SNAPSHOT -Dpackaging=jar -Dfile=/path/to/file -Durl=[url] -DrepositoryId=[id]
[ERROR] 
[ERROR] 
[ERROR] org.apache.cayenne.buildtools:cayenne-legal:jar:3.2M2-SNAPSHOT
[ERROR] 
[ERROR] from the specified remote repositories:
[ERROR] objectstyle (http://maven.objectstyle.org/nexus/content/groups/cayenne-deps, releases=true,
snapshots=false),
[ERROR] central (http://repo.maven.apache.org/maven2, releases=true, snapshots=false)
[ERROR] -> [Help 1]
org.apache.maven.lifecycle.LifecycleExecutionException: Failed to execute goal org.apache.maven.plugins:maven-remote-resources-plugin:1.2:process
(default) on project cayenne-parent: Resources JAR cannot be found.
	at org.apache.maven.lifecycle.internal.MojoExecutor.execute(MojoExecutor.java:217)
	at org.apache.maven.lifecycle.internal.MojoExecutor.execute(MojoExecutor.java:153)
	at org.apache.maven.lifecycle.internal.MojoExecutor.execute(MojoExecutor.java:145)
	at org.apache.maven.lifecycle.internal.LifecycleModuleBuilder.buildProject(LifecycleModuleBuilder.java:84)
	at org.apache.maven.lifecycle.internal.LifecycleModuleBuilder.buildProject(LifecycleModuleBuilder.java:59)
	at org.apache.maven.lifecycle.internal.LifecycleStarter.singleThreadedBuild(LifecycleStarter.java:183)
	at org.apache.maven.lifecycle.internal.LifecycleStarter.execute(LifecycleStarter.java:161)
	at org.apache.maven.DefaultMaven.doExecute(DefaultMaven.java:320)
	at org.apache.maven.DefaultMaven.execute(DefaultMaven.java:156)
	at org.apache.maven.cli.MavenCli.execute(MavenCli.java:537)
	at org.apache.maven.cli.MavenCli.doMain(MavenCli.java:196)
	at org.apache.maven.cli.MavenCli.main(MavenCli.java:141)
	at sun.reflect.NativeMethodAccessorImpl.invoke0(Native Method)
	at sun.reflect.NativeMethodAccessorImpl.invoke(NativeMethodAccessorImpl.java:39)
	at sun.reflect.DelegatingMethodAccessorImpl.invoke(DelegatingMethodAccessorImpl.java:25)
	at java.lang.reflect.Method.invoke(Method.java:597)
	at org.codehaus.plexus.classworlds.launcher.Launcher.launchEnhanced(Launcher.java:290)
	at org.codehaus.plexus.classworlds.launcher.Launcher.launch(Launcher.java:230)
	at org.codehaus.plexus.classworlds.launcher.Launcher.mainWithExitCode(Launcher.java:409)
	at org.codehaus.plexus.classworlds.launcher.Launcher.main(Launcher.java:352)
Caused by: org.apache.maven.plugin.MojoExecutionException: Resources JAR cannot be found.
	at org.apache.maven.plugin.resources.remote.ProcessRemoteResourcesMojo.downloadBundles(ProcessRemoteResourcesMojo.java:1045)
	at org.apache.maven.plugin.resources.remote.ProcessRemoteResourcesMojo.execute(ProcessRemoteResourcesMojo.java:507)
	at org.apache.maven.plugin.DefaultBuildPluginManager.executeMojo(DefaultBuildPluginManager.java:101)
	at org.apache.maven.lifecycle.internal.MojoExecutor.execute(MojoExecutor.java:209)
	... 19 more
Caused by: org.apache.maven.shared.downloader.DownloadNotFoundException: Requested download
does not exist.
	at org.apache.maven.shared.downloader.DefaultDownloader.download(DefaultDownloader.java:62)
	at org.apache.maven.plugin.resources.remote.ProcessRemoteResourcesMojo.downloadBundles(ProcessRemoteResourcesMojo.java:1033)
	... 22 more
Caused by: org.apache.maven.artifact.resolver.ArtifactNotFoundException: Could not find artifact
org.apache.cayenne.buildtools:cayenne-legal:jar:3.2M2-SNAPSHOT

Try downloading the file manually from the project website.

Then, install it using the command: 
    mvn install:install-file -DgroupId=org.apache.cayenne.buildtools -DartifactId=cayenne-legal
-Dversion=3.2M2-SNAPSHOT -Dpackaging=jar -Dfile=/path/to/file

Alternatively, if you host your own repository you can deploy the file there: 
    mvn deploy:deploy-file -DgroupId=org.apache.cayenne.buildtools -DartifactId=cayenne-legal
-Dversion=3.2M2-SNAPSHOT -Dpackaging=jar -Dfile=/path/to/file -Durl=[url] -DrepositoryId=[id]


  org.apache.cayenne.buildtools:cayenne-legal:jar:3.2M2-SNAPSHOT

from the specified remote repositories:
  objectstyle (http://maven.objectstyle.org/nexus/content/groups/cayenne-deps, releases=true,
snapshots=false),
  central (http://repo.maven.apache.org/maven2, releases=true, snapshots=false)

	at org.apache.maven.artifact.resolver.DefaultArtifactResolver.resolve(DefaultArtifactResolver.java:219)
	at org.apache.maven.artifact.resolver.DefaultArtifactResolver.resolve(DefaultArtifactResolver.java:157)
	at org.apache.maven.artifact.resolver.DefaultArtifactResolver.resolve(DefaultArtifactResolver.java:525)
	at org.apache.maven.shared.downloader.DefaultDownloader.download(DefaultDownloader.java:54)
	... 23 more
Caused by: org.sonatype.aether.resolution.ArtifactResolutionException: Could not find artifact
org.apache.cayenne.buildtools:cayenne-legal:jar:3.2M2-SNAPSHOT
	at org.sonatype.aether.impl.internal.DefaultArtifactResolver.resolve(DefaultArtifactResolver.java:538)
	at org.sonatype.aether.impl.internal.DefaultArtifactResolver.resolveArtifacts(DefaultArtifactResolver.java:216)
	at org.sonatype.aether.impl.internal.DefaultArtifactResolver.resolveArtifact(DefaultArtifactResolver.java:193)
	at org.sonatype.aether.impl.internal.DefaultRepositorySystem.resolveArtifact(DefaultRepositorySystem.java:286)
	at org.apache.maven.artifact.resolver.DefaultArtifactResolver.resolve(DefaultArtifactResolver.java:213)
	... 26 more
Caused by: org.sonatype.aether.transfer.ArtifactNotFoundException: Could not find artifact
org.apache.cayenne.buildtools:cayenne-legal:jar:3.2M2-SNAPSHOT
	at org.sonatype.aether.impl.internal.DefaultArtifactResolver.resolve(DefaultArtifactResolver.java:528)
	... 30 more
[ERROR] 
[ERROR] Re-run Maven using the -X switch to enable full debug logging.
[ERROR] 
[ERROR] For more information about the errors and possible solutions, please read the following
articles:
[ERROR] [Help 1] http://cwiki.apache.org/confluence/display/MAVEN/MojoExecutionException
Build step 'Invoke top-level Maven targets' marked build as failure

Mime
View raw message