cayenne-commits mailing list archives

Site index · List index
Message view « Date » · « Thread »
Top « Date » · « Thread »
From Apache Jenkins Server <jenk...@builds.apache.org>
Subject Build failed in Jenkins: Cayenne-trunk » h2,JDK 1.6 (latest),Ubuntu #960
Date Sun, 17 Nov 2013 08:26:41 GMT
See <https://builds.apache.org/job/Cayenne-trunk/cayenneTestConnection=h2,jdk=JDK%201.6%20(latest),label=Ubuntu/960/changes>

Changes:

[aadamchik] aligning derby versions

[aadamchik] CAY-1883 - Clean up Cayenne maven structure - get rid of aggregate modules

* splitting ROP client code to cayenne-client module

[aadamchik] CAY-1883 - Clean up Cayenne maven structure - get rid of aggregate modules

* cleanup, being explicit about the scope of
  various dependencies

[aadamchik] CAY-1883 - Clean up Cayenne maven structure - get rid of aggregate modules

* no more direct dependencies on hsqldb (only included in the test profile)
* aligning derby dep versions

[aadamchik] CAY-1883 - Clean up Cayenne maven structure - get rid of aggregate modules

* cleanup, killing unused aggregator plugin, being explicit about the scope of
  various dependencies
* jdbc4-compat no longer needed under Java 6

[aadamchik] CAY-1883 - Clean up Cayenne maven structure - get rid of aggregate modules

* reusing sources plugin config - parent declaration got lost

[aadamchik] CAY-1883 - Clean up Cayenne maven structure - get rid of aggregate modules

* cleaning up adding NOTICE/LICENSE files to all jars

[aadamchik] CAY-1883 - Clean up Cayenne maven structure - get rid of aggregate modules

* cleanup

[aadamchik] CAY-1883 - Clean up Cayenne maven structure - get rid of aggregate modules

* reusing sources plugin config

[aadamchik] CAY-1883 - Clean up Cayenne maven structure - get rid of aggregate modules

* various cleanup

[aadamchik] CAY-1883 - Clean up Cayenne maven structure - get rid of aggregate modules

* adding Eclipse handlers

[aadamchik] CAY-1883 - Clean up Cayenne maven structure - get rid of aggregate modules

* redundant repo declaration

[aadamchik] CAY-1883 - Clean up Cayenne maven structure - get rid of aggregate modules

* figuring out what's 'deployed' and what's not (and usung pom inheritance whenever possible)

[aadamchik] CAY-1883 - Clean up Cayenne maven structure - get rid of aggregate modules

* fixing docs maven structure

[aadamchik] CAY-1883 - Clean up Cayenne maven structure - get rid of aggregate modules

* assembly descriptors to reflect the new module structure

[aadamchik] CAY-1883 - Clean up Cayenne maven structure - get rid of aggregate modules

* fixing modeler pom structure

[aadamchik] CAY-1883 - Clean up Cayenne maven structure - get rid of aggregate modules

* maven-remote-resources-plugin - adding Eclipse handler

[aadamchik] CAY-1883 - Clean up Cayenne maven structure - get rid of aggregate modules

* maven-japplication-plugin - setting explicit version, adding Eclipse handler

[aadamchik] CAY-1883 - Clean up Cayenne maven structure - get rid of aggregate modules

* maven-remote-resources-plugin -> inherit version

[aadamchik] CAY-1883 - Clean up Cayenne maven structure - get rid of aggregate modules

* removing aggregation from server and client - they are normal modules now

[aadamchik] CAY-1883 - Clean up Cayenne maven structure - get rid of aggregate modules

* better naming of the new modules

[aadamchik] CAY-1883 - Clean up Cayenne maven structure - get rid of aggregate modules

* moving cayenne-client, cayenne-server one level up to follow their Maven coordinates

[aadamchik] CAY-1883 - Clean up Cayenne maven structure - get rid of aggregate modules

* moving cayenne-core-unpublished  to cayenne-core and one level up... it is 'published' now

[aadamchik] explicit test scope

[aadamchik] CAY-1883 - Clean up Cayenne maven structure - get rid of aggregate modules

* moving cayenne-di-unpublished  to cayenne-di and one level up... it is 'published' now

[aadamchik] CAY-1883 - Clean up Cayenne maven structure - get rid of aggregate modules

* extracting plugins dep version management to the parent pom

[aadamchik] CAY-1883 - Clean up Cayenne maven structure - get rid of aggregate modules

* moving maven-cayenne-modeler-plugin to plugins folder to align with its Maven group

[aadamchik] CAY-1883 - Clean up Cayenne maven structure - get rid of aggregate modules

* moving maven-cayenne-plugin to plugins folder to align with its Maven group

[aadamchik] CAY-1883 - Clean up Cayenne maven structure - get rid of aggregate modules

* moving cayenne-lifecycle one level up to align with its Maven group

[aadamchik] CAY-1883 - Clean up Cayenne maven structure - get rid of aggregate modules

* moving cayenne-project one level up to align with its Maven group

[aadamchik] CAY-1883 - Clean up Cayenne maven structure - get rid of aggregate modules

* moving cayenne-tools one level up to align with its Maven group

[mkienenb] CAY-1880 - objectStore snapshots never cleared from RefreshQuery when use-shared-cache
unchecked

[mkienenb] CAY-1880 - objectStore snapshots never cleared from RefreshQuery when use-shared-cache
unchecked

[aadamchik] CAY-1883 - Clean up Cayenne maven structure - get rid of aggregate modules

* moving cayenne-wocompat-unpublished to modeler

[aadamchik] CAY-1883 - Clean up Cayenne maven structure - get rid of aggregate modules

* moving cayenne-legal-unpublished to buildtools (that are unpublished by definition)

[aadamchik] CAY-1883 - Clean up Cayenne maven structure - get rid of aggregate modules

* renaming maven-cayenne-build-plugin to cayenne-build-maven-plugin to follow modern maven
conventions

[aadamchik] CAY-1883 - Clean up Cayenne maven structure - get rid of aggregate modules

* organizing buildtools in a clean hierarchical manner

[aadamchik] we are not using clover, removing from HEAD

------------------------------------------
[...truncated 5598 lines...]
477/506 KB   328/412 KB   35/64 KB   353/353 KB   33/256 KB   
478/506 KB   328/412 KB   35/64 KB   353/353 KB   33/256 KB   
482/506 KB   328/412 KB   35/64 KB   353/353 KB   33/256 KB   
486/506 KB   328/412 KB   35/64 KB   353/353 KB   33/256 KB   
490/506 KB   328/412 KB   35/64 KB   353/353 KB   33/256 KB   
494/506 KB   328/412 KB   35/64 KB   353/353 KB   33/256 KB   
494/506 KB   328/412 KB   37/64 KB   353/353 KB   33/256 KB   
498/506 KB   328/412 KB   37/64 KB   353/353 KB   33/256 KB   
498/506 KB   328/412 KB   41/64 KB   353/353 KB   33/256 KB   
502/506 KB   328/412 KB   41/64 KB   353/353 KB   33/256 KB   
502/506 KB   328/412 KB   45/64 KB   353/353 KB   33/256 KB   
506/506 KB   328/412 KB   45/64 KB   353/353 KB   33/256 KB   
506/506 KB   328/412 KB   49/64 KB   353/353 KB   33/256 KB   
506/506 KB   328/412 KB   49/64 KB   353/353 KB   33/256 KB   
506/506 KB   328/412 KB   53/64 KB   353/353 KB   33/256 KB   
506/506 KB   328/412 KB   57/64 KB   353/353 KB   33/256 KB   
506/506 KB   328/412 KB   57/64 KB   353/353 KB   37/256 KB   
506/506 KB   328/412 KB   57/64 KB   353/353 KB   41/256 KB   
506/506 KB   328/412 KB   57/64 KB   353/353 KB   45/256 KB   
506/506 KB   328/412 KB   57/64 KB   353/353 KB   49/256 KB   
506/506 KB   328/412 KB   57/64 KB   353/353 KB   51/256 KB   
506/506 KB   331/412 KB   57/64 KB   353/353 KB   51/256 KB   
506/506 KB   335/412 KB   57/64 KB   353/353 KB   51/256 KB   
506/506 KB   339/412 KB   57/64 KB   353/353 KB   51/256 KB   
506/506 KB   343/412 KB   57/64 KB   353/353 KB   51/256 KB   
506/506 KB   347/412 KB   57/64 KB   353/353 KB   51/256 KB   
506/506 KB   351/412 KB   57/64 KB   353/353 KB   51/256 KB   
506/506 KB   355/412 KB   57/64 KB   353/353 KB   51/256 KB   
506/506 KB   359/412 KB   57/64 KB   353/353 KB   51/256 KB   
506/506 KB   361/412 KB   57/64 KB   353/353 KB   51/256 KB   
506/506 KB   362/412 KB   57/64 KB   353/353 KB   51/256 KB   
506/506 KB   366/412 KB   57/64 KB   353/353 KB   51/256 KB   
506/506 KB   370/412 KB   57/64 KB   353/353 KB   51/256 KB   
506/506 KB   374/412 KB   57/64 KB   353/353 KB   51/256 KB   
506/506 KB   378/412 KB   57/64 KB   353/353 KB   51/256 KB   
506/506 KB   382/412 KB   57/64 KB   353/353 KB   51/256 KB   
506/506 KB   386/412 KB   57/64 KB   353/353 KB   51/256 KB   
506/506 KB   390/412 KB   57/64 KB   353/353 KB   51/256 KB   
506/506 KB   394/412 KB   57/64 KB   353/353 KB   51/256 KB   
506/506 KB   398/412 KB   57/64 KB   353/353 KB   51/256 KB   
506/506 KB   402/412 KB   57/64 KB   353/353 KB   51/256 KB   
506/506 KB   402/412 KB   61/64 KB   353/353 KB   51/256 KB   
506/506 KB   402/412 KB   64/64 KB   353/353 KB   51/256 KB   
506/506 KB   402/412 KB   64/64 KB   353/353 KB   55/256 KB   
506/506 KB   402/412 KB   64/64 KB   353/353 KB   59/256 KB   
506/506 KB   402/412 KB   64/64 KB   353/353 KB   63/256 KB   
506/506 KB   402/412 KB   64/64 KB   353/353 KB   67/256 KB   
506/506 KB   402/412 KB   64/64 KB   353/353 KB   69/256 KB   
506/506 KB   402/412 KB   64/64 KB   353/353 KB   71/256 KB   
                                                              
Downloaded: http://maven.objectstyle.org/nexus/content/groups/cayenne-deps/velocity/velocity/1.4/velocity-1.4.jar
(353 KB at 365.1 KB/sec)
506/506 KB   406/412 KB   64/64 KB   71/256 KB                
506/506 KB   410/412 KB   64/64 KB   71/256 KB   
506/506 KB   412/412 KB   64/64 KB   71/256 KB   
506/506 KB   412/412 KB   64/64 KB   72/256 KB   
506/506 KB   412/412 KB   64/64 KB   74/256 KB   
506/506 KB   412/412 KB   64/64 KB   75/256 KB   
506/506 KB   412/412 KB   64/64 KB   79/256 KB   
506/506 KB   412/412 KB   64/64 KB   83/256 KB   
506/506 KB   412/412 KB   64/64 KB   87/256 KB   
506/506 KB   412/412 KB   64/64 KB   91/256 KB   
                                                 
Downloaded: http://maven.objectstyle.org/nexus/content/groups/cayenne-deps/velocity/velocity-dep/1.4/velocity-dep-1.4.jar
(506 KB at 503.1 KB/sec)
412/412 KB   64/64 KB   95/256 KB                
412/412 KB   64/64 KB   99/256 KB   
412/412 KB   64/64 KB   99/256 KB   
412/412 KB   64/64 KB   103/256 KB   
412/412 KB   64/64 KB   107/256 KB   
412/412 KB   64/64 KB   111/256 KB   
412/412 KB   64/64 KB   115/256 KB   
412/412 KB   64/64 KB   119/256 KB   
412/412 KB   64/64 KB   123/256 KB   
412/412 KB   64/64 KB   123/256 KB   
                                     
Downloaded: http://maven.objectstyle.org/nexus/content/groups/cayenne-deps/oro/oro/2.0.8/oro-2.0.8.jar
(64 KB at 111.6 KB/sec)
                                     
Downloaded: http://maven.objectstyle.org/nexus/content/groups/cayenne-deps/org/apache/velocity/velocity/1.6.4/velocity-1.6.4.jar
(412 KB at 388.9 KB/sec)
126/256 KB                           
130/256 KB   
130/256 KB   
134/256 KB   
138/256 KB   
142/256 KB   
146/256 KB   
150/256 KB   
154/256 KB   
158/256 KB   
162/256 KB   
166/256 KB   
167/256 KB   
170/256 KB   
171/256 KB   
174/256 KB   
178/256 KB   
182/256 KB   
186/256 KB   
190/256 KB   
194/256 KB   
198/256 KB   
202/256 KB   
206/256 KB   
210/256 KB   
214/256 KB   
218/256 KB   
219/256 KB   
222/256 KB   
226/256 KB   
230/256 KB   
234/256 KB   
238/256 KB   
242/256 KB   
246/256 KB   
250/256 KB   
254/256 KB   
256/256 KB   
             
Downloaded: http://maven.objectstyle.org/nexus/content/groups/cayenne-deps/commons-lang/commons-lang/2.4/commons-lang-2.4.jar
(256 KB at 283.1 KB/sec)
[INFO] Setting property: classpath.resource.loader.class => 'org.codehaus.plexus.velocity.ContextClassLoaderResourceLoader'.
[INFO] Setting property: velocimacro.messages.on => 'false'.
[INFO] Setting property: resource.loader => 'classpath'.
[INFO] Setting property: resource.manager.logwhenfound => 'false'.
[INFO] ------------------------------------------------------------------------
[INFO] Reactor Summary:
[INFO] 
[INFO] Cayenne ........................................... FAILURE [39.784s]
[INFO] Cayenne Build Tools Parent ........................ SKIPPED
[INFO] Cayenne Internal Build Plugin ..................... SKIPPED
[INFO] Cayenne License and Notice Bundle ................. SKIPPED
[INFO] Common Unit Test Utilities ........................ SKIPPED
[INFO] Cayenne Dependency Injection Container ............ SKIPPED
[INFO] Cayenne Core ...................................... SKIPPED
[INFO] Cayenne Server .................................... SKIPPED
[INFO] Cayenne ROP Client ................................ SKIPPED
[INFO] Cayenne Project ................................... SKIPPED
[INFO] Cayenne Tools ..................................... SKIPPED
[INFO] Cayenne Lifecycle Utilities ....................... SKIPPED
[INFO] Cayenne Integration Tests Parent .................. SKIPPED
[INFO] Cayenne Maven Plugins ............................. SKIPPED
[INFO] Cayenne Maven Plugin .............................. SKIPPED
[INFO] Integration Tests - Cayenne Tools ................. SKIPPED
[INFO] Cayenne Modeler Parent ............................ SKIPPED
[INFO] Cayenne WebObjects Compatibility Library .......... SKIPPED
[INFO] Cayenne Modeler ................................... SKIPPED
[INFO] Cayenne Modeler Maven Plugin ...................... SKIPPED
[INFO] Cayenne Tutorial .................................. SKIPPED
[INFO] Cayenne ROP Server Tutorial ....................... SKIPPED
[INFO] Cayenne ROP Client Tutorial ....................... SKIPPED
[INFO] Cayenne Tutorials ................................. SKIPPED
[INFO] Cayenne Documenation Parent ....................... SKIPPED
[INFO] Cayenne Documentation ............................. SKIPPED
[INFO] Cayenne Docbook Documentation ..................... SKIPPED
[INFO] Docbook: Cayenne Stylesheets ...................... SKIPPED
[INFO] Docbook: Cayenne Guide ............................ SKIPPED
[INFO] Docbook: Getting Started with Cayenne ............. SKIPPED
[INFO] Docbook: Getting Started with Cayenne ROP ......... SKIPPED
[INFO] Docbook: Cayenne New Features and Upgrade Guide ... SKIPPED
[INFO] ------------------------------------------------------------------------
[INFO] BUILD FAILURE
[INFO] ------------------------------------------------------------------------
[INFO] Total time: 1:11.597s
[INFO] Finished at: Sun Nov 17 08:26:31 UTC 2013
[INFO] Final Memory: 11M/58M
[INFO] ------------------------------------------------------------------------
[ERROR] Failed to execute goal org.apache.maven.plugins:maven-remote-resources-plugin:1.2:process
(default) on project cayenne-parent: Resources JAR cannot be found. Requested download does
not exist. Could not find artifact org.apache.cayenne.buildtools:cayenne-legal:jar:3.2M2-SNAPSHOT
[ERROR] 
[ERROR] Try downloading the file manually from the project website.
[ERROR] 
[ERROR] Then, install it using the command:
[ERROR] mvn install:install-file -DgroupId=org.apache.cayenne.buildtools -DartifactId=cayenne-legal
-Dversion=3.2M2-SNAPSHOT -Dpackaging=jar -Dfile=/path/to/file
[ERROR] 
[ERROR] Alternatively, if you host your own repository you can deploy the file there:
[ERROR] mvn deploy:deploy-file -DgroupId=org.apache.cayenne.buildtools -DartifactId=cayenne-legal
-Dversion=3.2M2-SNAPSHOT -Dpackaging=jar -Dfile=/path/to/file -Durl=[url] -DrepositoryId=[id]
[ERROR] 
[ERROR] 
[ERROR] org.apache.cayenne.buildtools:cayenne-legal:jar:3.2M2-SNAPSHOT
[ERROR] 
[ERROR] from the specified remote repositories:
[ERROR] objectstyle (http://maven.objectstyle.org/nexus/content/groups/cayenne-deps, releases=true,
snapshots=false),
[ERROR] central (http://repo.maven.apache.org/maven2, releases=true, snapshots=false)
[ERROR] -> [Help 1]
org.apache.maven.lifecycle.LifecycleExecutionException: Failed to execute goal org.apache.maven.plugins:maven-remote-resources-plugin:1.2:process
(default) on project cayenne-parent: Resources JAR cannot be found.
	at org.apache.maven.lifecycle.internal.MojoExecutor.execute(MojoExecutor.java:217)
	at org.apache.maven.lifecycle.internal.MojoExecutor.execute(MojoExecutor.java:153)
	at org.apache.maven.lifecycle.internal.MojoExecutor.execute(MojoExecutor.java:145)
	at org.apache.maven.lifecycle.internal.LifecycleModuleBuilder.buildProject(LifecycleModuleBuilder.java:84)
	at org.apache.maven.lifecycle.internal.LifecycleModuleBuilder.buildProject(LifecycleModuleBuilder.java:59)
	at org.apache.maven.lifecycle.internal.LifecycleStarter.singleThreadedBuild(LifecycleStarter.java:183)
	at org.apache.maven.lifecycle.internal.LifecycleStarter.execute(LifecycleStarter.java:161)
	at org.apache.maven.DefaultMaven.doExecute(DefaultMaven.java:320)
	at org.apache.maven.DefaultMaven.execute(DefaultMaven.java:156)
	at org.apache.maven.cli.MavenCli.execute(MavenCli.java:537)
	at org.apache.maven.cli.MavenCli.doMain(MavenCli.java:196)
	at org.apache.maven.cli.MavenCli.main(MavenCli.java:141)
	at sun.reflect.NativeMethodAccessorImpl.invoke0(Native Method)
	at sun.reflect.NativeMethodAccessorImpl.invoke(NativeMethodAccessorImpl.java:39)
	at sun.reflect.DelegatingMethodAccessorImpl.invoke(DelegatingMethodAccessorImpl.java:25)
	at java.lang.reflect.Method.invoke(Method.java:597)
	at org.codehaus.plexus.classworlds.launcher.Launcher.launchEnhanced(Launcher.java:290)
	at org.codehaus.plexus.classworlds.launcher.Launcher.launch(Launcher.java:230)
	at org.codehaus.plexus.classworlds.launcher.Launcher.mainWithExitCode(Launcher.java:409)
	at org.codehaus.plexus.classworlds.launcher.Launcher.main(Launcher.java:352)
Caused by: org.apache.maven.plugin.MojoExecutionException: Resources JAR cannot be found.
	at org.apache.maven.plugin.resources.remote.ProcessRemoteResourcesMojo.downloadBundles(ProcessRemoteResourcesMojo.java:1045)
	at org.apache.maven.plugin.resources.remote.ProcessRemoteResourcesMojo.execute(ProcessRemoteResourcesMojo.java:507)
	at org.apache.maven.plugin.DefaultBuildPluginManager.executeMojo(DefaultBuildPluginManager.java:101)
	at org.apache.maven.lifecycle.internal.MojoExecutor.execute(MojoExecutor.java:209)
	... 19 more
Caused by: org.apache.maven.shared.downloader.DownloadNotFoundException: Requested download
does not exist.
	at org.apache.maven.shared.downloader.DefaultDownloader.download(DefaultDownloader.java:62)
	at org.apache.maven.plugin.resources.remote.ProcessRemoteResourcesMojo.downloadBundles(ProcessRemoteResourcesMojo.java:1033)
	... 22 more
Caused by: org.apache.maven.artifact.resolver.ArtifactNotFoundException: Could not find artifact
org.apache.cayenne.buildtools:cayenne-legal:jar:3.2M2-SNAPSHOT

Try downloading the file manually from the project website.

Then, install it using the command: 
    mvn install:install-file -DgroupId=org.apache.cayenne.buildtools -DartifactId=cayenne-legal
-Dversion=3.2M2-SNAPSHOT -Dpackaging=jar -Dfile=/path/to/file

Alternatively, if you host your own repository you can deploy the file there: 
    mvn deploy:deploy-file -DgroupId=org.apache.cayenne.buildtools -DartifactId=cayenne-legal
-Dversion=3.2M2-SNAPSHOT -Dpackaging=jar -Dfile=/path/to/file -Durl=[url] -DrepositoryId=[id]


  org.apache.cayenne.buildtools:cayenne-legal:jar:3.2M2-SNAPSHOT

from the specified remote repositories:
  objectstyle (http://maven.objectstyle.org/nexus/content/groups/cayenne-deps, releases=true,
snapshots=false),
  central (http://repo.maven.apache.org/maven2, releases=true, snapshots=false)

	at org.apache.maven.artifact.resolver.DefaultArtifactResolver.resolve(DefaultArtifactResolver.java:219)
	at org.apache.maven.artifact.resolver.DefaultArtifactResolver.resolve(DefaultArtifactResolver.java:157)
	at org.apache.maven.artifact.resolver.DefaultArtifactResolver.resolve(DefaultArtifactResolver.java:525)
	at org.apache.maven.shared.downloader.DefaultDownloader.download(DefaultDownloader.java:54)
	... 23 more
Caused by: org.sonatype.aether.resolution.ArtifactResolutionException: Could not find artifact
org.apache.cayenne.buildtools:cayenne-legal:jar:3.2M2-SNAPSHOT
	at org.sonatype.aether.impl.internal.DefaultArtifactResolver.resolve(DefaultArtifactResolver.java:538)
	at org.sonatype.aether.impl.internal.DefaultArtifactResolver.resolveArtifacts(DefaultArtifactResolver.java:216)
	at org.sonatype.aether.impl.internal.DefaultArtifactResolver.resolveArtifact(DefaultArtifactResolver.java:193)
	at org.sonatype.aether.impl.internal.DefaultRepositorySystem.resolveArtifact(DefaultRepositorySystem.java:286)
	at org.apache.maven.artifact.resolver.DefaultArtifactResolver.resolve(DefaultArtifactResolver.java:213)
	... 26 more
Caused by: org.sonatype.aether.transfer.ArtifactNotFoundException: Could not find artifact
org.apache.cayenne.buildtools:cayenne-legal:jar:3.2M2-SNAPSHOT
	at org.sonatype.aether.impl.internal.DefaultArtifactResolver.resolve(DefaultArtifactResolver.java:528)
	... 30 more
[ERROR] 
[ERROR] Re-run Maven using the -X switch to enable full debug logging.
[ERROR] 
[ERROR] For more information about the errors and possible solutions, please read the following
articles:
[ERROR] [Help 1] http://cwiki.apache.org/confluence/display/MAVEN/MojoExecutionException
Build step 'Invoke top-level Maven targets' marked build as failure

Mime
View raw message