cayenne-commits mailing list archives

Site index · List index
Message view « Date » · « Thread »
Top « Date » · « Thread »
From Apache Jenkins Server <jenk...@builds.apache.org>
Subject Build failed in Jenkins: Cayenne-trunk » h2,JDK 1.7 (latest),Ubuntu #946
Date Wed, 09 Oct 2013 00:27:46 GMT
See <https://builds.apache.org/job/Cayenne-trunk/cayenneTestConnection=h2,jdk=JDK%201.7%20(latest),label=Ubuntu/946/changes>

Changes:

[johnthuss] Relax type on Expression.filterObjects parameter (allow Collection)

------------------------------------------
[...truncated 112726 lines...]
INFO: INSERT INTO PAINTING (PAINTING_ID, PAINTING_TITLE, ARTIST_ID, ESTIMATED_PRICE) VALUES
(?, ?, ?, ?)
Oct 09, 2013 12:27:44 AM org.apache.cayenne.log.CommonsJdbcEventLogger logBeginTransaction
INFO: --- transaction started.
Oct 09, 2013 12:27:44 AM org.apache.cayenne.log.CommonsJdbcEventLogger logQuery
INFO: SELECT t0.ARTIST_NAME, t0.DATE_OF_BIRTH, t0.ARTIST_ID FROM ARTIST t0
Oct 09, 2013 12:27:44 AM org.apache.cayenne.log.CommonsJdbcEventLogger logSelectCount
INFO: === returned 1 row. - took 0 ms.
Oct 09, 2013 12:27:44 AM org.apache.cayenne.log.CommonsJdbcEventLogger logCommitTransaction
INFO: +++ transaction committed.
Oct 09, 2013 12:27:44 AM org.apache.cayenne.test.jdbc.UtilityLogger log
INFO: update ARTIST set ARTIST_NAME = ? where ARTIST_ID = ?
Oct 09, 2013 12:27:44 AM org.apache.cayenne.log.CommonsJdbcEventLogger logBeginTransaction
INFO: --- transaction started.
Oct 09, 2013 12:27:44 AM org.apache.cayenne.log.CommonsJdbcEventLogger logQuery
INFO: SELECT t0.ARTIST_NAME, t0.DATE_OF_BIRTH, t0.ARTIST_ID FROM ARTIST t0
Oct 09, 2013 12:27:44 AM org.apache.cayenne.log.CommonsJdbcEventLogger logSelectCount
INFO: === returned 1 row. - took 0 ms.
Oct 09, 2013 12:27:44 AM org.apache.cayenne.log.CommonsJdbcEventLogger logCommitTransaction
INFO: +++ transaction committed.
Tests run: 4, Failures: 0, Errors: 0, Skipped: 0, Time elapsed: 0.085 sec
Running org.apache.cayenne.access.NestedDataContextParentPeerEventsTest
Oct 09, 2013 12:27:44 AM org.apache.cayenne.configuration.XMLDataChannelDescriptorLoader load
INFO: Loading XML configuration resource from file:/home/hudson/jenkins-slave/workspace/Cayenne-trunk/cayenneTestConnection/h2/jdk/JDK%201.7%20(latest)/label/Ubuntu/trunk/framework/cayenne-core-unpublished/target/test-classes/cayenne-relationships.xml
Oct 09, 2013 12:27:44 AM org.apache.cayenne.configuration.XMLDataChannelDescriptorLoader$DataChannelChildrenHandler
createChildTagHandler
INFO: Loading XML DataMap resource from file:/home/hudson/jenkins-slave/workspace/Cayenne-trunk/cayenneTestConnection/h2/jdk/JDK%201.7%20(latest)/label/Ubuntu/trunk/framework/cayenne-core-unpublished/target/test-classes/relationships.map.xml
Oct 09, 2013 12:27:44 AM org.apache.cayenne.configuration.XMLDataChannelDescriptorLoader$DataChannelChildrenHandler
createChildTagHandler
INFO: Loading XML DataMap resource from file:/home/hudson/jenkins-slave/workspace/Cayenne-trunk/cayenneTestConnection/h2/jdk/JDK%201.7%20(latest)/label/Ubuntu/trunk/framework/cayenne-core-unpublished/target/test-classes/relationships1.map.xml
Oct 09, 2013 12:27:44 AM org.apache.cayenne.map.EntityResolver applyDBLayerDefaults
INFO: added runtime complimentary DbRelationship from DELETE_RULE_TEST3 to DELETE_RULE_TEST1
Oct 09, 2013 12:27:44 AM org.apache.cayenne.log.CommonsJdbcEventLogger logBeginTransaction
INFO: --- transaction started.
Oct 09, 2013 12:27:44 AM org.apache.cayenne.log.CommonsJdbcEventLogger logQuery
INFO: SELECT NEXT_ID FROM AUTO_PK_SUPPORT WHERE TABLE_NAME = 'MASTER'
Oct 09, 2013 12:27:44 AM org.apache.cayenne.log.CommonsJdbcEventLogger logSelectCount
INFO: === returned 1 row. - took 0 ms.
Oct 09, 2013 12:27:44 AM org.apache.cayenne.log.CommonsJdbcEventLogger logQuery
INFO: UPDATE AUTO_PK_SUPPORT SET NEXT_ID = NEXT_ID + 20 WHERE TABLE_NAME = 'MASTER'
Oct 09, 2013 12:27:44 AM org.apache.cayenne.log.CommonsJdbcEventLogger logUpdateCount
INFO: === updated 1 row.
Oct 09, 2013 12:27:44 AM org.apache.cayenne.log.CommonsJdbcEventLogger logQuery
INFO: INSERT INTO MASTER (ID, NAME) VALUES (?, ?)
Oct 09, 2013 12:27:44 AM org.apache.cayenne.log.CommonsJdbcEventLogger logQueryParameters
INFO: [bind: 1->ID:200, 2->NAME:'X']
Oct 09, 2013 12:27:44 AM org.apache.cayenne.log.CommonsJdbcEventLogger logUpdateCount
INFO: === updated 1 row.
Oct 09, 2013 12:27:44 AM org.apache.cayenne.log.CommonsJdbcEventLogger logCommitTransaction
INFO: +++ transaction committed.
Oct 09, 2013 12:27:44 AM org.apache.cayenne.log.CommonsJdbcEventLogger logBeginTransaction
INFO: --- transaction started.
Oct 09, 2013 12:27:44 AM org.apache.cayenne.log.CommonsJdbcEventLogger logQuery
INFO: UPDATE MASTER SET NAME = ? WHERE ID = ?
Oct 09, 2013 12:27:44 AM org.apache.cayenne.log.CommonsJdbcEventLogger logQueryParameters
INFO: [bind: 1->NAME:'Y', 2->ID:200]
Oct 09, 2013 12:27:44 AM org.apache.cayenne.log.CommonsJdbcEventLogger logUpdateCount
INFO: === updated 1 row.
Oct 09, 2013 12:27:44 AM org.apache.cayenne.log.CommonsJdbcEventLogger logCommitTransaction
INFO: +++ transaction committed.
Oct 09, 2013 12:27:45 AM org.apache.cayenne.configuration.XMLDataChannelDescriptorLoader load
INFO: Loading XML configuration resource from file:/home/hudson/jenkins-slave/workspace/Cayenne-trunk/cayenneTestConnection/h2/jdk/JDK%201.7%20(latest)/label/Ubuntu/trunk/framework/cayenne-core-unpublished/target/test-classes/cayenne-relationships.xml
Oct 09, 2013 12:27:45 AM org.apache.cayenne.configuration.XMLDataChannelDescriptorLoader$DataChannelChildrenHandler
createChildTagHandler
INFO: Loading XML DataMap resource from file:/home/hudson/jenkins-slave/workspace/Cayenne-trunk/cayenneTestConnection/h2/jdk/JDK%201.7%20(latest)/label/Ubuntu/trunk/framework/cayenne-core-unpublished/target/test-classes/relationships.map.xml
Oct 09, 2013 12:27:45 AM org.apache.cayenne.configuration.XMLDataChannelDescriptorLoader$DataChannelChildrenHandler
createChildTagHandler
INFO: Loading XML DataMap resource from file:/home/hudson/jenkins-slave/workspace/Cayenne-trunk/cayenneTestConnection/h2/jdk/JDK%201.7%20(latest)/label/Ubuntu/trunk/framework/cayenne-core-unpublished/target/test-classes/relationships1.map.xml
Oct 09, 2013 12:27:45 AM org.apache.cayenne.map.EntityResolver applyDBLayerDefaults
INFO: added runtime complimentary DbRelationship from DELETE_RULE_TEST3 to DELETE_RULE_TEST1
Oct 09, 2013 12:27:45 AM org.apache.cayenne.log.CommonsJdbcEventLogger logBeginTransaction
INFO: --- transaction started.
Oct 09, 2013 12:27:45 AM org.apache.cayenne.log.CommonsJdbcEventLogger logQuery
INFO: SELECT NEXT_ID FROM AUTO_PK_SUPPORT WHERE TABLE_NAME = 'CHILD'
Oct 09, 2013 12:27:45 AM org.apache.cayenne.log.CommonsJdbcEventLogger logSelectCount
INFO: === returned 1 row. - took 0 ms.
Oct 09, 2013 12:27:45 AM org.apache.cayenne.log.CommonsJdbcEventLogger logQuery
INFO: UPDATE AUTO_PK_SUPPORT SET NEXT_ID = NEXT_ID + 20 WHERE TABLE_NAME = 'CHILD'
Oct 09, 2013 12:27:45 AM org.apache.cayenne.log.CommonsJdbcEventLogger logUpdateCount
INFO: === updated 1 row.
Oct 09, 2013 12:27:45 AM org.apache.cayenne.log.CommonsJdbcEventLogger logQuery
INFO: INSERT INTO MASTER (ID, NAME) VALUES (?, ?)
Oct 09, 2013 12:27:45 AM org.apache.cayenne.log.CommonsJdbcEventLogger logQueryParameters
INFO: [bind: 1->ID:201, 2->NAME:'Y']
Oct 09, 2013 12:27:45 AM org.apache.cayenne.log.CommonsJdbcEventLogger logUpdateCount
INFO: === updated 1 row.
Oct 09, 2013 12:27:45 AM org.apache.cayenne.log.CommonsJdbcEventLogger logQueryParameters
INFO: [bind: 1->ID:202, 2->NAME:'X']
Oct 09, 2013 12:27:45 AM org.apache.cayenne.log.CommonsJdbcEventLogger logUpdateCount
INFO: === updated 1 row.
Oct 09, 2013 12:27:45 AM org.apache.cayenne.log.CommonsJdbcEventLogger logQuery
INFO: INSERT INTO CHILD (ID, MASTER_ID) VALUES (?, ?)
Oct 09, 2013 12:27:45 AM org.apache.cayenne.log.CommonsJdbcEventLogger logQueryParameters
INFO: [bind: 1->ID:200, 2->MASTER_ID:202]
Oct 09, 2013 12:27:45 AM org.apache.cayenne.log.CommonsJdbcEventLogger logUpdateCount
INFO: === updated 1 row.
Oct 09, 2013 12:27:45 AM org.apache.cayenne.log.CommonsJdbcEventLogger logCommitTransaction
INFO: +++ transaction committed.
Oct 09, 2013 12:27:45 AM org.apache.cayenne.log.CommonsJdbcEventLogger logBeginTransaction
INFO: --- transaction started.
Oct 09, 2013 12:27:45 AM org.apache.cayenne.log.CommonsJdbcEventLogger logQuery
INFO: UPDATE CHILD SET MASTER_ID = ? WHERE ID = ?
Oct 09, 2013 12:27:45 AM org.apache.cayenne.log.CommonsJdbcEventLogger logQueryParameters
INFO: [bind: 1->MASTER_ID:201, 2->ID:200]
Oct 09, 2013 12:27:45 AM org.apache.cayenne.log.CommonsJdbcEventLogger logUpdateCount
INFO: === updated 1 row.
Oct 09, 2013 12:27:45 AM org.apache.cayenne.log.CommonsJdbcEventLogger logCommitTransaction
INFO: +++ transaction committed.
Oct 09, 2013 12:27:45 AM org.apache.cayenne.configuration.XMLDataChannelDescriptorLoader load
INFO: Loading XML configuration resource from file:/home/hudson/jenkins-slave/workspace/Cayenne-trunk/cayenneTestConnection/h2/jdk/JDK%201.7%20(latest)/label/Ubuntu/trunk/framework/cayenne-core-unpublished/target/test-classes/cayenne-relationships.xml
Oct 09, 2013 12:27:45 AM org.apache.cayenne.configuration.XMLDataChannelDescriptorLoader$DataChannelChildrenHandler
createChildTagHandler
INFO: Loading XML DataMap resource from file:/home/hudson/jenkins-slave/workspace/Cayenne-trunk/cayenneTestConnection/h2/jdk/JDK%201.7%20(latest)/label/Ubuntu/trunk/framework/cayenne-core-unpublished/target/test-classes/relationships.map.xml
Oct 09, 2013 12:27:45 AM org.apache.cayenne.configuration.XMLDataChannelDescriptorLoader$DataChannelChildrenHandler
createChildTagHandler
INFO: Loading XML DataMap resource from file:/home/hudson/jenkins-slave/workspace/Cayenne-trunk/cayenneTestConnection/h2/jdk/JDK%201.7%20(latest)/label/Ubuntu/trunk/framework/cayenne-core-unpublished/target/test-classes/relationships1.map.xml
Oct 09, 2013 12:27:45 AM org.apache.cayenne.map.EntityResolver applyDBLayerDefaults
INFO: added runtime complimentary DbRelationship from DELETE_RULE_TEST3 to DELETE_RULE_TEST1
Oct 09, 2013 12:27:45 AM org.apache.cayenne.log.CommonsJdbcEventLogger logBeginTransaction
INFO: --- transaction started.
Oct 09, 2013 12:27:45 AM org.apache.cayenne.log.CommonsJdbcEventLogger logQuery
INFO: INSERT INTO MASTER (ID, NAME) VALUES (?, ?)
Oct 09, 2013 12:27:45 AM org.apache.cayenne.log.CommonsJdbcEventLogger logQueryParameters
INFO: [bind: 1->ID:203, 2->NAME:'X']
Oct 09, 2013 12:27:45 AM org.apache.cayenne.log.CommonsJdbcEventLogger logUpdateCount
INFO: === updated 1 row.
Oct 09, 2013 12:27:45 AM org.apache.cayenne.log.CommonsJdbcEventLogger logQuery
INFO: INSERT INTO CHILD (ID, MASTER_ID) VALUES (?, ?)
Oct 09, 2013 12:27:45 AM org.apache.cayenne.log.CommonsJdbcEventLogger logQueryParameters
INFO: [bind: 1->ID:201, 2->MASTER_ID:NULL]
Oct 09, 2013 12:27:45 AM org.apache.cayenne.log.CommonsJdbcEventLogger logUpdateCount
INFO: === updated 1 row.
Oct 09, 2013 12:27:45 AM org.apache.cayenne.log.CommonsJdbcEventLogger logQueryParameters
INFO: [bind: 1->ID:202, 2->MASTER_ID:203]
Oct 09, 2013 12:27:45 AM org.apache.cayenne.log.CommonsJdbcEventLogger logUpdateCount
INFO: === updated 1 row.
Oct 09, 2013 12:27:45 AM org.apache.cayenne.log.CommonsJdbcEventLogger logCommitTransaction
INFO: +++ transaction committed.
Oct 09, 2013 12:27:45 AM org.apache.cayenne.log.CommonsJdbcEventLogger logBeginTransaction
INFO: --- transaction started.
Oct 09, 2013 12:27:45 AM org.apache.cayenne.log.CommonsJdbcEventLogger logQuery
INFO: UPDATE CHILD SET MASTER_ID = ? WHERE ID = ?
Oct 09, 2013 12:27:45 AM org.apache.cayenne.log.CommonsJdbcEventLogger logQueryParameters
INFO: [bind: 1->MASTER_ID:203, 2->ID:201]
Oct 09, 2013 12:27:45 AM org.apache.cayenne.log.CommonsJdbcEventLogger logUpdateCount
INFO: === updated 1 row.
Oct 09, 2013 12:27:45 AM org.apache.cayenne.log.CommonsJdbcEventLogger logCommitTransaction
INFO: +++ transaction committed.
Oct 09, 2013 12:27:45 AM org.apache.cayenne.log.CommonsJdbcEventLogger logBeginTransaction
INFO: --- transaction started.
Oct 09, 2013 12:27:45 AM org.apache.cayenne.log.CommonsJdbcEventLogger logQuery
INFO: SELECT t0.MASTER_ID, t0.ID FROM CHILD t0 WHERE t0.MASTER_ID = ? [bind: 1->MASTER_ID:203]
Oct 09, 2013 12:27:45 AM org.apache.cayenne.log.CommonsJdbcEventLogger logSelectCount
INFO: === returned 2 rows. - took 1 ms.
Oct 09, 2013 12:27:45 AM org.apache.cayenne.log.CommonsJdbcEventLogger logCommitTransaction
INFO: +++ transaction committed.
Tests run: 3, Failures: 0, Errors: 0, Skipped: 0, Time elapsed: 0.938 sec
Running org.apache.cayenne.DataRowTest
Tests run: 2, Failures: 0, Errors: 0, Skipped: 0, Time elapsed: 0.002 sec
Running org.apache.cayenne.access.types.EnumTypeTest
Tests run: 7, Failures: 0, Errors: 0, Skipped: 0, Time elapsed: 0.002 sec
Running org.apache.cayenne.exp.parser.ASTObjPathTest
Tests run: 2, Failures: 0, Errors: 0, Skipped: 0, Time elapsed: 0.001 sec

Results :

Tests in error: 
  testNewAdd(org.apache.cayenne.CDOOne2ManyTest)

Tests run: 2200, Failures: 0, Errors: 1, Skipped: 0

[INFO] ------------------------------------------------------------------------
[INFO] Reactor Summary:
[INFO] 
[INFO] Cayenne ........................................... SUCCESS [12.910s]
[INFO] Common Unit Test Utilities ........................ SUCCESS [34.898s]
[INFO] Cayenne Internal Build Plugin ..................... SUCCESS [45.280s]
[INFO] Cayenne Build Tools Parent ........................ SUCCESS [0.005s]
[INFO] Cayenne License and Notice Bundle ................. SUCCESS [7.587s]
[INFO] Cayenne Dependency Injection Container ............ SUCCESS [3.039s]
[INFO] Cayenne Core Unpublished .......................... FAILURE [2:14.628s]
[INFO] Cayenne WebObjects Compatibility Library .......... SKIPPED
[INFO] Cayenne Aggregated Server Jar ..................... SKIPPED
[INFO] Cayenne Aggregated Client Jar ..................... SKIPPED
[INFO] Cayenne Project ................................... SKIPPED
[INFO] Cayenne Tools ..................................... SKIPPED
[INFO] Library: cayenne-lifecycle ........................ SKIPPED
[INFO] Cayenne Maven Plugin .............................. SKIPPED
[INFO] Cayenne Framework Aggregator Project .............. SKIPPED
[INFO] Cayenne Integration Tests Parent .................. SKIPPED
[INFO] Integration Tests - Cayenne Tools ................. SKIPPED
[INFO] Cayenne Modeler ................................... SKIPPED
[INFO] Cayenne Modeler Maven Plugin ...................... SKIPPED
[INFO] Cayenne Modeler Parent ............................ SKIPPED
[INFO] Cayenne Tutorial .................................. SKIPPED
[INFO] Cayenne ROP Server Tutorial ....................... SKIPPED
[INFO] Cayenne ROP Client Tutorial ....................... SKIPPED
[INFO] Cayenne Tutorials ................................. SKIPPED
[INFO] Cayenne Documentation ............................. SKIPPED
[INFO] Cayenne Documenation Parent ....................... SKIPPED
[INFO] Cayenne Docbook Documentation ..................... SKIPPED
[INFO] Docbook: Cayenne Stylesheets ...................... SKIPPED
[INFO] Docbook: Cayenne Guide ............................ SKIPPED
[INFO] Docbook: Getting Started with Cayenne ............. SKIPPED
[INFO] Docbook: Getting Started with Cayenne ROP ......... SKIPPED
[INFO] Docbook: Cayenne New Features and Upgrade Guide ... SKIPPED
[INFO] ------------------------------------------------------------------------
[INFO] BUILD FAILURE
[INFO] ------------------------------------------------------------------------
[INFO] Total time: 4:05.705s
[INFO] Finished at: Wed Oct 09 00:27:46 UTC 2013
[INFO] Final Memory: 42M/250M
[INFO] ------------------------------------------------------------------------
[ERROR] Failed to execute goal org.apache.maven.plugins:maven-surefire-plugin:2.5:test (default-test)
on project cayenne-core-unpublished: There are test failures.
[ERROR] 
[ERROR] Please refer to /home/hudson/jenkins-slave/workspace/Cayenne-trunk/cayenneTestConnection/h2/jdk/JDK
1.7 (latest)/label/Ubuntu/trunk/framework/cayenne-core-unpublished/target/surefire-reports
for the individual test results.
[ERROR] -> [Help 1]
org.apache.maven.lifecycle.LifecycleExecutionException: Failed to execute goal org.apache.maven.plugins:maven-surefire-plugin:2.5:test
(default-test) on project cayenne-core-unpublished: There are test failures.

Please refer to /home/hudson/jenkins-slave/workspace/Cayenne-trunk/cayenneTestConnection/h2/jdk/JDK
1.7 (latest)/label/Ubuntu/trunk/framework/cayenne-core-unpublished/target/surefire-reports
for the individual test results.
	at org.apache.maven.lifecycle.internal.MojoExecutor.execute(MojoExecutor.java:213)
	at org.apache.maven.lifecycle.internal.MojoExecutor.execute(MojoExecutor.java:153)
	at org.apache.maven.lifecycle.internal.MojoExecutor.execute(MojoExecutor.java:145)
	at org.apache.maven.lifecycle.internal.LifecycleModuleBuilder.buildProject(LifecycleModuleBuilder.java:84)
	at org.apache.maven.lifecycle.internal.LifecycleModuleBuilder.buildProject(LifecycleModuleBuilder.java:59)
	at org.apache.maven.lifecycle.internal.LifecycleStarter.singleThreadedBuild(LifecycleStarter.java:183)
	at org.apache.maven.lifecycle.internal.LifecycleStarter.execute(LifecycleStarter.java:161)
	at org.apache.maven.DefaultMaven.doExecute(DefaultMaven.java:320)
	at org.apache.maven.DefaultMaven.execute(DefaultMaven.java:156)
	at org.apache.maven.cli.MavenCli.execute(MavenCli.java:537)
	at org.apache.maven.cli.MavenCli.doMain(MavenCli.java:196)
	at org.apache.maven.cli.MavenCli.main(MavenCli.java:141)
	at sun.reflect.NativeMethodAccessorImpl.invoke0(Native Method)
	at sun.reflect.NativeMethodAccessorImpl.invoke(NativeMethodAccessorImpl.java:57)
	at sun.reflect.DelegatingMethodAccessorImpl.invoke(DelegatingMethodAccessorImpl.java:43)
	at java.lang.reflect.Method.invoke(Method.java:606)
	at org.codehaus.plexus.classworlds.launcher.Launcher.launchEnhanced(Launcher.java:290)
	at org.codehaus.plexus.classworlds.launcher.Launcher.launch(Launcher.java:230)
	at org.codehaus.plexus.classworlds.launcher.Launcher.mainWithExitCode(Launcher.java:409)
	at org.codehaus.plexus.classworlds.launcher.Launcher.main(Launcher.java:352)
Caused by: org.apache.maven.plugin.MojoFailureException: There are test failures.

Please refer to /home/hudson/jenkins-slave/workspace/Cayenne-trunk/cayenneTestConnection/h2/jdk/JDK
1.7 (latest)/label/Ubuntu/trunk/framework/cayenne-core-unpublished/target/surefire-reports
for the individual test results.
	at org.apache.maven.plugin.surefire.SurefirePlugin.execute(SurefirePlugin.java:629)
	at org.apache.maven.plugin.DefaultBuildPluginManager.executeMojo(DefaultBuildPluginManager.java:101)
	at org.apache.maven.lifecycle.internal.MojoExecutor.execute(MojoExecutor.java:209)
	... 19 more
[ERROR] 
[ERROR] Re-run Maven using the -X switch to enable full debug logging.
[ERROR] 
[ERROR] For more information about the errors and possible solutions, please read the following
articles:
[ERROR] [Help 1] http://cwiki.apache.org/confluence/display/MAVEN/MojoFailureException
[ERROR] 
[ERROR] After correcting the problems, you can resume the build with the command
[ERROR]   mvn <goals> -rf :cayenne-core-unpublished
Build step 'Invoke top-level Maven targets' marked build as failure

Mime
View raw message