cayenne-commits mailing list archives

Site index · List index
Message view « Date » · « Thread »
Top « Date » · « Thread »
From Apache Jenkins Server <jenk...@builds.apache.org>
Subject Build failed in Jenkins: Cayenne-trunk » derby,JDK 1.5 (latest),Ubuntu #892
Date Thu, 04 Jul 2013 01:49:06 GMT
See <https://builds.apache.org/job/Cayenne-trunk/./cayenneTestConnection=derby,jdk=JDK%201.5%20(latest),label=Ubuntu/892/changes>

Changes:

[amaniatis] Add RAT to our top level pom for easy execution. Just do this:

     mvn rat:check

and the output can be seen at target/rat.txt

------------------------------------------
[...truncated 124213 lines...]
INFO: Loading XML DataMap resource from file:/home/hudson/jenkins-slave/workspace/Cayenne-trunk/cayenneTestConnection/derby/jdk/JDK%201.5%20(latest)/label/Ubuntu/trunk/framework/cayenne-jdk1.5-unpublished/target/test-classes/testmap.map.xml
Jul 4, 2013 1:49:05 AM org.apache.cayenne.map.EntityResolver applyDBLayerDefaults
INFO: added runtime complimentary DbRelationship from ARTIST to PAINTING1
Jul 4, 2013 1:49:05 AM org.apache.cayenne.map.EntityResolver applyObjectLayerDefaults
INFO: added runtime complimentary ObjRelationship from Ball to Bag
Jul 4, 2013 1:49:05 AM org.apache.cayenne.map.EntityResolver applyObjectLayerDefaults
INFO: added runtime complimentary ObjRelationship from Thing to Bag
Jul 4, 2013 1:49:05 AM org.apache.cayenne.map.EntityResolver applyObjectLayerDefaults
INFO: added runtime complimentary ObjRelationship from Artist to CompoundPainting
Jul 4, 2013 1:49:05 AM org.apache.cayenne.map.EntityResolver applyObjectLayerDefaults
INFO: added runtime complimentary ObjRelationship from Gallery to CompoundPainting
Jul 4, 2013 1:49:05 AM org.apache.cayenne.map.EntityResolver applyObjectLayerDefaults
INFO: added runtime complimentary ObjRelationship from PaintingInfo to CompoundPainting
Jul 4, 2013 1:49:05 AM org.apache.cayenne.map.EntityResolver applyObjectLayerDefaults
INFO: added runtime complimentary ObjRelationship from Artist to CompoundPaintingLongNames
Jul 4, 2013 1:49:05 AM org.apache.cayenne.map.EntityResolver applyObjectLayerDefaults
INFO: added runtime complimentary ObjRelationship from ROArtist to CompoundPaintingLongNames
Jul 4, 2013 1:49:05 AM org.apache.cayenne.map.EntityResolver applyObjectLayerDefaults
INFO: added runtime complimentary ObjRelationship from Gallery to CompoundPaintingLongNames
Jul 4, 2013 1:49:05 AM org.apache.cayenne.map.EntityResolver applyObjectLayerDefaults
INFO: added runtime complimentary ObjRelationship from PaintingInfo to CompoundPaintingLongNames
Jul 4, 2013 1:49:05 AM org.apache.cayenne.map.EntityResolver applyObjectLayerDefaults
INFO: added runtime complimentary ObjRelationship from Artist to Painting1
Jul 4, 2013 1:49:05 AM org.apache.cayenne.map.EntityResolver applyObjectLayerDefaults
INFO: added runtime complimentary ObjRelationship from Painting to ROArtist
Jul 4, 2013 1:49:05 AM org.apache.cayenne.map.EntityResolver applyObjectLayerDefaults
INFO: added runtime complimentary ObjRelationship from Artist to ROPainting
Jul 4, 2013 1:49:05 AM org.apache.cayenne.test.jdbc.UtilityLogger log
INFO: delete from PAINTING_INFO
Jul 4, 2013 1:49:05 AM org.apache.cayenne.test.jdbc.UtilityLogger log
INFO: delete from PAINTING
Jul 4, 2013 1:49:05 AM org.apache.cayenne.test.jdbc.UtilityLogger log
INFO: delete from ARTIST_EXHIBIT
Jul 4, 2013 1:49:05 AM org.apache.cayenne.test.jdbc.UtilityLogger log
INFO: delete from ARTIST_GROUP
Jul 4, 2013 1:49:05 AM org.apache.cayenne.test.jdbc.UtilityLogger log
INFO: delete from ARTIST
Jul 4, 2013 1:49:05 AM org.apache.cayenne.test.jdbc.UtilityLogger log
INFO: INSERT INTO ARTIST (ARTIST_ID, ARTIST_NAME) VALUES (?, ?)
Jul 4, 2013 1:49:05 AM org.apache.cayenne.log.CommonsJdbcEventLogger logBeginTransaction
INFO: --- transaction started.
Jul 4, 2013 1:49:05 AM org.apache.cayenne.log.CommonsJdbcEventLogger logQuery
INFO: SELECT t0.ARTIST_NAME, t0.DATE_OF_BIRTH, t0.ARTIST_ID FROM ARTIST t0
Jul 4, 2013 1:49:05 AM org.apache.cayenne.log.CommonsJdbcEventLogger logSelectCount
INFO: === returned 1 row. - took 1 ms.
Jul 4, 2013 1:49:05 AM org.apache.cayenne.log.CommonsJdbcEventLogger logCommitTransaction
INFO: +++ transaction committed.
Jul 4, 2013 1:49:05 AM org.apache.cayenne.log.CommonsJdbcEventLogger logBeginTransaction
INFO: --- transaction started.
Jul 4, 2013 1:49:05 AM org.apache.cayenne.log.CommonsJdbcEventLogger logQuery
INFO: SELECT t0.ARTIST_NAME, t0.DATE_OF_BIRTH, t0.ARTIST_ID FROM ARTIST t0 WHERE t0.ARTIST_ID
= ? [bind: 1->ARTIST_ID:5]
Jul 4, 2013 1:49:05 AM org.apache.cayenne.log.CommonsJdbcEventLogger logSelectCount
INFO: === returned 1 row. - took 1 ms.
Jul 4, 2013 1:49:05 AM org.apache.cayenne.log.CommonsJdbcEventLogger logCommitTransaction
INFO: +++ transaction committed.
Jul 4, 2013 1:49:05 AM org.apache.cayenne.configuration.XMLDataChannelDescriptorLoader load
INFO: Loading XML configuration resource from file:/home/hudson/jenkins-slave/workspace/Cayenne-trunk/cayenneTestConnection/derby/jdk/JDK%201.5%20(latest)/label/Ubuntu/trunk/framework/cayenne-jdk1.5-unpublished/target/test-classes/cayenne-testmap.xml
Jul 4, 2013 1:49:05 AM org.apache.cayenne.configuration.XMLDataChannelDescriptorLoader$DataChannelChildrenHandler
createChildTagHandler
INFO: Loading XML DataMap resource from file:/home/hudson/jenkins-slave/workspace/Cayenne-trunk/cayenneTestConnection/derby/jdk/JDK%201.5%20(latest)/label/Ubuntu/trunk/framework/cayenne-jdk1.5-unpublished/target/test-classes/testmap.map.xml
Jul 4, 2013 1:49:05 AM org.apache.cayenne.map.EntityResolver applyDBLayerDefaults
INFO: added runtime complimentary DbRelationship from ARTIST to PAINTING1
Jul 4, 2013 1:49:05 AM org.apache.cayenne.map.EntityResolver applyObjectLayerDefaults
INFO: added runtime complimentary ObjRelationship from Ball to Bag
Jul 4, 2013 1:49:05 AM org.apache.cayenne.map.EntityResolver applyObjectLayerDefaults
INFO: added runtime complimentary ObjRelationship from Thing to Bag
Jul 4, 2013 1:49:05 AM org.apache.cayenne.map.EntityResolver applyObjectLayerDefaults
INFO: added runtime complimentary ObjRelationship from Artist to CompoundPainting
Jul 4, 2013 1:49:05 AM org.apache.cayenne.map.EntityResolver applyObjectLayerDefaults
INFO: added runtime complimentary ObjRelationship from Gallery to CompoundPainting
Jul 4, 2013 1:49:05 AM org.apache.cayenne.map.EntityResolver applyObjectLayerDefaults
INFO: added runtime complimentary ObjRelationship from PaintingInfo to CompoundPainting
Jul 4, 2013 1:49:05 AM org.apache.cayenne.map.EntityResolver applyObjectLayerDefaults
INFO: added runtime complimentary ObjRelationship from Artist to CompoundPaintingLongNames
Jul 4, 2013 1:49:05 AM org.apache.cayenne.map.EntityResolver applyObjectLayerDefaults
INFO: added runtime complimentary ObjRelationship from ROArtist to CompoundPaintingLongNames
Jul 4, 2013 1:49:05 AM org.apache.cayenne.map.EntityResolver applyObjectLayerDefaults
INFO: added runtime complimentary ObjRelationship from Gallery to CompoundPaintingLongNames
Jul 4, 2013 1:49:05 AM org.apache.cayenne.map.EntityResolver applyObjectLayerDefaults
INFO: added runtime complimentary ObjRelationship from PaintingInfo to CompoundPaintingLongNames
Jul 4, 2013 1:49:05 AM org.apache.cayenne.map.EntityResolver applyObjectLayerDefaults
INFO: added runtime complimentary ObjRelationship from Artist to Painting1
Jul 4, 2013 1:49:05 AM org.apache.cayenne.map.EntityResolver applyObjectLayerDefaults
INFO: added runtime complimentary ObjRelationship from Painting to ROArtist
Jul 4, 2013 1:49:05 AM org.apache.cayenne.map.EntityResolver applyObjectLayerDefaults
INFO: added runtime complimentary ObjRelationship from Artist to ROPainting
Jul 4, 2013 1:49:05 AM org.apache.cayenne.test.jdbc.UtilityLogger log
INFO: delete from PAINTING_INFO
Jul 4, 2013 1:49:05 AM org.apache.cayenne.test.jdbc.UtilityLogger log
INFO: delete from PAINTING
Jul 4, 2013 1:49:05 AM org.apache.cayenne.test.jdbc.UtilityLogger log
INFO: delete from ARTIST_EXHIBIT
Jul 4, 2013 1:49:05 AM org.apache.cayenne.test.jdbc.UtilityLogger log
INFO: delete from ARTIST_GROUP
Jul 4, 2013 1:49:05 AM org.apache.cayenne.test.jdbc.UtilityLogger log
INFO: delete from ARTIST
Jul 4, 2013 1:49:05 AM org.apache.cayenne.test.jdbc.UtilityLogger log
INFO: INSERT INTO ARTIST (ARTIST_ID, ARTIST_NAME) VALUES (?, ?)
Jul 4, 2013 1:49:05 AM org.apache.cayenne.test.jdbc.UtilityLogger log
INFO: INSERT INTO PAINTING (PAINTING_ID, PAINTING_TITLE, ARTIST_ID, ESTIMATED_PRICE) VALUES
(?, ?, ?, ?)
Jul 4, 2013 1:49:05 AM org.apache.cayenne.log.CommonsJdbcEventLogger logBeginTransaction
INFO: --- transaction started.
Jul 4, 2013 1:49:05 AM org.apache.cayenne.log.CommonsJdbcEventLogger logQuery
INFO: SELECT t0.ESTIMATED_PRICE, t0.PAINTING_DESCRIPTION, t0.PAINTING_TITLE, t0.ARTIST_ID,
t0.GALLERY_ID, t0.PAINTING_ID FROM PAINTING t0
Jul 4, 2013 1:49:05 AM org.apache.cayenne.log.CommonsJdbcEventLogger logSelectCount
INFO: === returned 1 row. - took 1 ms.
Jul 4, 2013 1:49:05 AM org.apache.cayenne.log.CommonsJdbcEventLogger logCommitTransaction
INFO: +++ transaction committed.
Jul 4, 2013 1:49:05 AM org.apache.cayenne.log.CommonsJdbcEventLogger logBeginTransaction
INFO: --- transaction started.
Jul 4, 2013 1:49:05 AM org.apache.cayenne.log.CommonsJdbcEventLogger logQuery
INFO: SELECT t0.ARTIST_NAME, t0.DATE_OF_BIRTH, t0.ARTIST_ID FROM ARTIST t0 WHERE t0.ARTIST_ID
= ? [bind: 1->ARTIST_ID:5]
Jul 4, 2013 1:49:05 AM org.apache.cayenne.log.CommonsJdbcEventLogger logSelectCount
INFO: === returned 1 row. - took 0 ms.
Jul 4, 2013 1:49:05 AM org.apache.cayenne.log.CommonsJdbcEventLogger logCommitTransaction
INFO: +++ transaction committed.
Tests run: 14, Failures: 0, Errors: 0, Skipped: 0, Time elapsed: 2.014 sec

Results :

Tests in error: 
  testSimpleColumn(org.apache.cayenne.merge.DropColumnToModelTest)
  testRemoveFKColumnWithoutRelationshipInDb(org.apache.cayenne.merge.DropColumnToModelTest)
  test(org.apache.cayenne.merge.SetPrimaryKeyToDbTest)
  test(org.apache.cayenne.merge.SetNotNullToDbTest)
  testMerging(org.apache.cayenne.util.EntityMergeSupportTest)
  testAddAndDropColumnToDb(org.apache.cayenne.merge.MergerFactoryTest)
  testChangeVarcharSizeToDb(org.apache.cayenne.merge.MergerFactoryTest)
  testMultipleTokensToDb(org.apache.cayenne.merge.MergerFactoryTest)
  testAddTableToDb(org.apache.cayenne.merge.MergerFactoryTest)
  testAddForeignKeyWithTable(org.apache.cayenne.merge.MergerFactoryTest)
  testAddForeignKeyAfterTable(org.apache.cayenne.merge.MergerFactoryTest)
  test(org.apache.cayenne.merge.ValueForNullTest)
  testSelectWithOuterJoinFlattened(org.apache.cayenne.access.DataContextOuterJoinsTest)
  testSelectWithOuterJoin(org.apache.cayenne.access.DataContextOuterJoinsTest)
  testSelectWithOuterJoinFromString(org.apache.cayenne.access.DataContextOuterJoinsTest)
  testSelectWithOuterOrdering(org.apache.cayenne.access.DataContextOuterJoinsTest)
  testAddTable(org.apache.cayenne.merge.CreateTableToModelTest)
  test(org.apache.cayenne.merge.SetAllowNullToDbTest)
  testResolveToOneOverFKOfDifferentNumType(org.apache.cayenne.unit.jira.CAY_191Test)
  testAddColumn(org.apache.cayenne.merge.AddColumnToModelTest)
  testDropTable(org.apache.cayenne.merge.DropTableToModelTest)
  testForreignKey(org.apache.cayenne.merge.DropRelationshipToModelTest)
  testNullifyToOne(org.apache.cayenne.access.DataContextDeleteRulesTest)
  testCascadeToOne(org.apache.cayenne.access.DataContextDeleteRulesTest)
  testCascadeToManyFlattened(org.apache.cayenne.access.DataContextDeleteRulesTest)
  testNullifyToManyFlattened(org.apache.cayenne.access.DataContextDeleteRulesTest)
  testNullifyToMany(org.apache.cayenne.access.DataContextDeleteRulesTest)
  testCascadeToMany(org.apache.cayenne.access.DataContextDeleteRulesTest)
  testDenyToMany(org.apache.cayenne.access.DataContextDeleteRulesTest)
  testReadFlattenedRelationship(org.apache.cayenne.CayenneDataObjectFlattenedRelTest)
  testReadFlattenedRelationship2(org.apache.cayenne.CayenneDataObjectFlattenedRelTest)
  testAddToFlattenedRelationship(org.apache.cayenne.CayenneDataObjectFlattenedRelTest)
  testDoubleCommitAddToFlattenedRelationship(org.apache.cayenne.CayenneDataObjectFlattenedRelTest)
  testRemoveFromFlattenedRelationship(org.apache.cayenne.CayenneDataObjectFlattenedRelTest)
  testRemoveFlattenedRelationshipAndRootRecord(org.apache.cayenne.CayenneDataObjectFlattenedRelTest)
  testAddRemoveFlattenedRelationship1(org.apache.cayenne.CayenneDataObjectFlattenedRelTest)
  testAddRemoveFlattenedRelationship2(org.apache.cayenne.CayenneDataObjectFlattenedRelTest)
  testManyToMany(org.apache.cayenne.access.FlattenedPrefetchTest)
  testMultiPrefetch(org.apache.cayenne.access.FlattenedPrefetchTest)
  testJointManyToMany(org.apache.cayenne.access.FlattenedPrefetchTest)
  testJointMultiPrefetch(org.apache.cayenne.access.FlattenedPrefetchTest)

Tests run: 2179, Failures: 0, Errors: 41, Skipped: 0

[INFO] ------------------------------------------------------------------------
[INFO] Reactor Summary:
[INFO] 
[INFO] Cayenne ........................................... SUCCESS [0.448s]
[INFO] Common Unit Test Utilities ........................ SUCCESS [3.141s]
[INFO] Cayenne Internal Build Plugin ..................... SUCCESS [5.139s]
[INFO] Cayenne Build Tools Parent ........................ SUCCESS [0.013s]
[INFO] Cayenne License and Notice Bundle ................. SUCCESS [1.871s]
[INFO] Cayenne Dependency Injection Container ............ SUCCESS [3.185s]
[INFO] Cayenne Java 1.5 Unpublished ...................... FAILURE [12:48.319s]
[INFO] Cayenne WebObjects Compatibility Library .......... SKIPPED
[INFO] Cayenne Aggregated Server Jar ..................... SKIPPED
[INFO] Cayenne Aggregated Client Jar ..................... SKIPPED
[INFO] Cayenne Project ................................... SKIPPED
[INFO] Cayenne Tools ..................................... SKIPPED
[INFO] Library: cayenne-lifecycle ........................ SKIPPED
[INFO] Cayenne Maven Plugin .............................. SKIPPED
[INFO] Cayenne Framework Aggregator Project .............. SKIPPED
[INFO] Cayenne Integration Tests Parent .................. SKIPPED
[INFO] Integration Tests - Cayenne Tools ................. SKIPPED
[INFO] Cayenne Modeler ................................... SKIPPED
[INFO] Cayenne Modeler Maven Plugin ...................... SKIPPED
[INFO] Cayenne Modeler Parent ............................ SKIPPED
[INFO] Cayenne Tutorial .................................. SKIPPED
[INFO] Cayenne ROP Server Tutorial ....................... SKIPPED
[INFO] Cayenne ROP Client Tutorial ....................... SKIPPED
[INFO] Cayenne Tutorials ................................. SKIPPED
[INFO] Cayenne Documentation ............................. SKIPPED
[INFO] Cayenne Documenation Parent ....................... SKIPPED
[INFO] Cayenne Docbook Documentation ..................... SKIPPED
[INFO] Docbook: Cayenne Stylesheets ...................... SKIPPED
[INFO] Docbook: Cayenne Guide ............................ SKIPPED
[INFO] Docbook: Getting Started with Cayenne ............. SKIPPED
[INFO] Docbook: Getting Started with Cayenne ROP ......... SKIPPED
[INFO] Docbook: Cayenne New Features and Upgrade Guide ... SKIPPED
[INFO] ------------------------------------------------------------------------
[INFO] BUILD FAILURE
[INFO] ------------------------------------------------------------------------
[INFO] Total time: 13:03.426s
[INFO] Finished at: Thu Jul 04 01:49:06 UTC 2013
[INFO] Final Memory: 17M/103M
[INFO] ------------------------------------------------------------------------
[ERROR] Failed to execute goal org.apache.maven.plugins:maven-surefire-plugin:2.5:test (default-test)
on project cayenne-jdk1.5-unpublished: There are test failures.
[ERROR] 
[ERROR] Please refer to /home/hudson/jenkins-slave/workspace/Cayenne-trunk/cayenneTestConnection/derby/jdk/JDK
1.5 (latest)/label/Ubuntu/trunk/framework/cayenne-jdk1.5-unpublished/target/surefire-reports
for the individual test results.
[ERROR] -> [Help 1]
org.apache.maven.lifecycle.LifecycleExecutionException: Failed to execute goal org.apache.maven.plugins:maven-surefire-plugin:2.5:test
(default-test) on project cayenne-jdk1.5-unpublished: There are test failures.

Please refer to /home/hudson/jenkins-slave/workspace/Cayenne-trunk/cayenneTestConnection/derby/jdk/JDK
1.5 (latest)/label/Ubuntu/trunk/framework/cayenne-jdk1.5-unpublished/target/surefire-reports
for the individual test results.
	at org.apache.maven.lifecycle.internal.MojoExecutor.execute(MojoExecutor.java:213)
	at org.apache.maven.lifecycle.internal.MojoExecutor.execute(MojoExecutor.java:153)
	at org.apache.maven.lifecycle.internal.MojoExecutor.execute(MojoExecutor.java:145)
	at org.apache.maven.lifecycle.internal.LifecycleModuleBuilder.buildProject(LifecycleModuleBuilder.java:84)
	at org.apache.maven.lifecycle.internal.LifecycleModuleBuilder.buildProject(LifecycleModuleBuilder.java:59)
	at org.apache.maven.lifecycle.internal.LifecycleStarter.singleThreadedBuild(LifecycleStarter.java:183)
	at org.apache.maven.lifecycle.internal.LifecycleStarter.execute(LifecycleStarter.java:161)
	at org.apache.maven.DefaultMaven.doExecute(DefaultMaven.java:320)
	at org.apache.maven.DefaultMaven.execute(DefaultMaven.java:156)
	at org.apache.maven.cli.MavenCli.execute(MavenCli.java:537)
	at org.apache.maven.cli.MavenCli.doMain(MavenCli.java:196)
	at org.apache.maven.cli.MavenCli.main(MavenCli.java:141)
	at sun.reflect.NativeMethodAccessorImpl.invoke0(Native Method)
	at sun.reflect.NativeMethodAccessorImpl.invoke(NativeMethodAccessorImpl.java:39)
	at sun.reflect.DelegatingMethodAccessorImpl.invoke(DelegatingMethodAccessorImpl.java:25)
	at java.lang.reflect.Method.invoke(Method.java:592)
	at org.codehaus.plexus.classworlds.launcher.Launcher.launchEnhanced(Launcher.java:290)
	at org.codehaus.plexus.classworlds.launcher.Launcher.launch(Launcher.java:230)
	at org.codehaus.plexus.classworlds.launcher.Launcher.mainWithExitCode(Launcher.java:409)
	at org.codehaus.plexus.classworlds.launcher.Launcher.main(Launcher.java:352)
Caused by: org.apache.maven.plugin.MojoFailureException: There are test failures.

Please refer to /home/hudson/jenkins-slave/workspace/Cayenne-trunk/cayenneTestConnection/derby/jdk/JDK
1.5 (latest)/label/Ubuntu/trunk/framework/cayenne-jdk1.5-unpublished/target/surefire-reports
for the individual test results.
	at org.apache.maven.plugin.surefire.SurefirePlugin.execute(SurefirePlugin.java:629)
	at org.apache.maven.plugin.DefaultBuildPluginManager.executeMojo(DefaultBuildPluginManager.java:101)
	at org.apache.maven.lifecycle.internal.MojoExecutor.execute(MojoExecutor.java:209)
	... 19 more
[ERROR] 
[ERROR] Re-run Maven using the -X switch to enable full debug logging.
[ERROR] 
[ERROR] For more information about the errors and possible solutions, please read the following
articles:
[ERROR] [Help 1] http://cwiki.apache.org/confluence/display/MAVEN/MojoFailureException
[ERROR] 
[ERROR] After correcting the problems, you can resume the build with the command
[ERROR]   mvn <goals> -rf :cayenne-jdk1.5-unpublished
Build step 'Invoke top-level Maven targets' marked build as failure

Mime
View raw message