cayenne-commits mailing list archives

Site index · List index
Message view « Date » · « Thread »
Top « Date » · « Thread »
From Apache Jenkins Server <jenk...@builds.apache.org>
Subject Build failed in Jenkins: Cayenne-trunk » derby,JDK 1.6 (latest),Ubuntu #909
Date Sat, 20 Jul 2013 09:41:51 GMT
See <https://builds.apache.org/job/Cayenne-trunk/./cayenneTestConnection=derby,jdk=JDK%201.6%20(latest),label=Ubuntu/909/changes>

Changes:

[aadamchik] CAY-1736  IllegalArgumentException when synchronizing entities in the Modeler

[aadamchik] CAY-1736  IllegalArgumentException when synchronizing entities in the Modeler

somewhat based on Ilya's patch, but the fix itself is limited to NamedObjectFactory.java

------------------------------------------
[...truncated 133376 lines...]
Jul 20, 2013 9:41:48 AM org.apache.cayenne.log.CommonsJdbcEventLogger logBeginTransaction
INFO: --- transaction started.
Jul 20, 2013 9:41:48 AM org.apache.cayenne.log.CommonsJdbcEventLogger logQuery
INFO: INSERT INTO MASTER (ID, NAME) VALUES (?, ?)
Jul 20, 2013 9:41:48 AM org.apache.cayenne.log.CommonsJdbcEventLogger logQueryParameters
INFO: [batch bind: 1->ID:200, 2->NAME:'X']
Jul 20, 2013 9:41:48 AM org.apache.cayenne.log.CommonsJdbcEventLogger logUpdateCount
INFO: === updated 1 row.
Jul 20, 2013 9:41:48 AM org.apache.cayenne.log.CommonsJdbcEventLogger logCommitTransaction
INFO: +++ transaction committed.
Jul 20, 2013 9:41:48 AM org.apache.cayenne.log.CommonsJdbcEventLogger logBeginTransaction
INFO: --- transaction started.
Jul 20, 2013 9:41:48 AM org.apache.cayenne.log.CommonsJdbcEventLogger logQuery
INFO: UPDATE MASTER SET NAME = ? WHERE ID = ?
Jul 20, 2013 9:41:48 AM org.apache.cayenne.log.CommonsJdbcEventLogger logQueryParameters
INFO: [batch bind: 1->NAME:'Y', 2->ID:200]
Jul 20, 2013 9:41:48 AM org.apache.cayenne.log.CommonsJdbcEventLogger logUpdateCount
INFO: === updated 1 row.
Jul 20, 2013 9:41:48 AM org.apache.cayenne.log.CommonsJdbcEventLogger logCommitTransaction
INFO: +++ transaction committed.
Jul 20, 2013 9:41:49 AM org.apache.cayenne.configuration.XMLDataChannelDescriptorLoader load
INFO: Loading XML configuration resource from file:/home/hudson/jenkins-slave/workspace/Cayenne-trunk/cayenneTestConnection/derby/jdk/JDK%201.6%20(latest)/label/Ubuntu/trunk/framework/cayenne-jdk1.5-unpublished/target/test-classes/cayenne-relationships.xml
Jul 20, 2013 9:41:49 AM org.apache.cayenne.configuration.XMLDataChannelDescriptorLoader$DataChannelChildrenHandler
createChildTagHandler
INFO: Loading XML DataMap resource from file:/home/hudson/jenkins-slave/workspace/Cayenne-trunk/cayenneTestConnection/derby/jdk/JDK%201.6%20(latest)/label/Ubuntu/trunk/framework/cayenne-jdk1.5-unpublished/target/test-classes/relationships.map.xml
Jul 20, 2013 9:41:49 AM org.apache.cayenne.map.EntityResolver applyDBLayerDefaults
INFO: added runtime complimentary DbRelationship from DELETE_RULE_TEST3 to DELETE_RULE_TEST1
Jul 20, 2013 9:41:49 AM org.apache.cayenne.map.EntityResolver applyObjectLayerDefaults
INFO: added runtime complimentary ObjRelationship from FlattenedTest3 to FlattenedTest1
Jul 20, 2013 9:41:49 AM org.apache.cayenne.map.EntityResolver applyObjectLayerDefaults
INFO: added runtime complimentary ObjRelationship from FlattenedTest4 to FlattenedTest1
Jul 20, 2013 9:41:49 AM org.apache.cayenne.log.CommonsJdbcEventLogger logQuery
INFO: SELECT NEXT_ID FROM AUTO_PK_SUPPORT WHERE TABLE_NAME = ? FOR UPDATE [bind: 1:'CHILD']
Jul 20, 2013 9:41:49 AM org.apache.cayenne.log.CommonsJdbcEventLogger logBeginTransaction
INFO: --- transaction started.
Jul 20, 2013 9:41:49 AM org.apache.cayenne.log.CommonsJdbcEventLogger logQuery
INFO: INSERT INTO MASTER (ID, NAME) VALUES (?, ?)
Jul 20, 2013 9:41:49 AM org.apache.cayenne.log.CommonsJdbcEventLogger logQueryParameters
INFO: [batch bind: 1->ID:201, 2->NAME:'Y']
Jul 20, 2013 9:41:49 AM org.apache.cayenne.log.CommonsJdbcEventLogger logQueryParameters
INFO: [batch bind: 1->ID:202, 2->NAME:'X']
Jul 20, 2013 9:41:49 AM org.apache.cayenne.log.CommonsJdbcEventLogger logUpdateCount
INFO: === updated 2 rows.
Jul 20, 2013 9:41:49 AM org.apache.cayenne.log.CommonsJdbcEventLogger logQuery
INFO: INSERT INTO CHILD (ID, MASTER_ID) VALUES (?, ?)
Jul 20, 2013 9:41:49 AM org.apache.cayenne.log.CommonsJdbcEventLogger logQueryParameters
INFO: [batch bind: 1->ID:200, 2->MASTER_ID:202]
Jul 20, 2013 9:41:49 AM org.apache.cayenne.log.CommonsJdbcEventLogger logUpdateCount
INFO: === updated 1 row.
Jul 20, 2013 9:41:49 AM org.apache.cayenne.log.CommonsJdbcEventLogger logCommitTransaction
INFO: +++ transaction committed.
Jul 20, 2013 9:41:49 AM org.apache.cayenne.log.CommonsJdbcEventLogger logBeginTransaction
INFO: --- transaction started.
Jul 20, 2013 9:41:49 AM org.apache.cayenne.log.CommonsJdbcEventLogger logQuery
INFO: UPDATE CHILD SET MASTER_ID = ? WHERE ID = ?
Jul 20, 2013 9:41:49 AM org.apache.cayenne.log.CommonsJdbcEventLogger logQueryParameters
INFO: [batch bind: 1->MASTER_ID:201, 2->ID:200]
Jul 20, 2013 9:41:49 AM org.apache.cayenne.log.CommonsJdbcEventLogger logUpdateCount
INFO: === updated 1 row.
Jul 20, 2013 9:41:49 AM org.apache.cayenne.log.CommonsJdbcEventLogger logCommitTransaction
INFO: +++ transaction committed.
Jul 20, 2013 9:41:49 AM org.apache.cayenne.configuration.XMLDataChannelDescriptorLoader load
INFO: Loading XML configuration resource from file:/home/hudson/jenkins-slave/workspace/Cayenne-trunk/cayenneTestConnection/derby/jdk/JDK%201.6%20(latest)/label/Ubuntu/trunk/framework/cayenne-jdk1.5-unpublished/target/test-classes/cayenne-relationships.xml
Jul 20, 2013 9:41:49 AM org.apache.cayenne.configuration.XMLDataChannelDescriptorLoader$DataChannelChildrenHandler
createChildTagHandler
INFO: Loading XML DataMap resource from file:/home/hudson/jenkins-slave/workspace/Cayenne-trunk/cayenneTestConnection/derby/jdk/JDK%201.6%20(latest)/label/Ubuntu/trunk/framework/cayenne-jdk1.5-unpublished/target/test-classes/relationships.map.xml
Jul 20, 2013 9:41:49 AM org.apache.cayenne.map.EntityResolver applyDBLayerDefaults
INFO: added runtime complimentary DbRelationship from DELETE_RULE_TEST3 to DELETE_RULE_TEST1
Jul 20, 2013 9:41:49 AM org.apache.cayenne.map.EntityResolver applyObjectLayerDefaults
INFO: added runtime complimentary ObjRelationship from FlattenedTest3 to FlattenedTest1
Jul 20, 2013 9:41:49 AM org.apache.cayenne.map.EntityResolver applyObjectLayerDefaults
INFO: added runtime complimentary ObjRelationship from FlattenedTest4 to FlattenedTest1
Jul 20, 2013 9:41:49 AM org.apache.cayenne.log.CommonsJdbcEventLogger logBeginTransaction
INFO: --- transaction started.
Jul 20, 2013 9:41:49 AM org.apache.cayenne.log.CommonsJdbcEventLogger logQuery
INFO: INSERT INTO MASTER (ID, NAME) VALUES (?, ?)
Jul 20, 2013 9:41:49 AM org.apache.cayenne.log.CommonsJdbcEventLogger logQueryParameters
INFO: [batch bind: 1->ID:203, 2->NAME:'X']
Jul 20, 2013 9:41:49 AM org.apache.cayenne.log.CommonsJdbcEventLogger logUpdateCount
INFO: === updated 1 row.
Jul 20, 2013 9:41:49 AM org.apache.cayenne.log.CommonsJdbcEventLogger logQuery
INFO: INSERT INTO CHILD (ID, MASTER_ID) VALUES (?, ?)
Jul 20, 2013 9:41:49 AM org.apache.cayenne.log.CommonsJdbcEventLogger logQueryParameters
INFO: [batch bind: 1->ID:201, 2->MASTER_ID:203]
Jul 20, 2013 9:41:49 AM org.apache.cayenne.log.CommonsJdbcEventLogger logQueryParameters
INFO: [batch bind: 1->ID:202, 2->MASTER_ID:NULL]
Jul 20, 2013 9:41:49 AM org.apache.cayenne.log.CommonsJdbcEventLogger logUpdateCount
INFO: === updated 2 rows.
Jul 20, 2013 9:41:49 AM org.apache.cayenne.log.CommonsJdbcEventLogger logCommitTransaction
INFO: +++ transaction committed.
Jul 20, 2013 9:41:49 AM org.apache.cayenne.log.CommonsJdbcEventLogger logBeginTransaction
INFO: --- transaction started.
Jul 20, 2013 9:41:49 AM org.apache.cayenne.log.CommonsJdbcEventLogger logQuery
INFO: UPDATE CHILD SET MASTER_ID = ? WHERE ID = ?
Jul 20, 2013 9:41:49 AM org.apache.cayenne.log.CommonsJdbcEventLogger logQueryParameters
INFO: [batch bind: 1->MASTER_ID:203, 2->ID:202]
Jul 20, 2013 9:41:49 AM org.apache.cayenne.log.CommonsJdbcEventLogger logUpdateCount
INFO: === updated 1 row.
Jul 20, 2013 9:41:49 AM org.apache.cayenne.log.CommonsJdbcEventLogger logCommitTransaction
INFO: +++ transaction committed.
Jul 20, 2013 9:41:50 AM org.apache.cayenne.log.CommonsJdbcEventLogger logBeginTransaction
INFO: --- transaction started.
Jul 20, 2013 9:41:50 AM org.apache.cayenne.log.CommonsJdbcEventLogger logQuery
INFO: SELECT t0.MASTER_ID, t0.ID FROM CHILD t0 WHERE t0.MASTER_ID = ? [bind: 1->MASTER_ID:203]
Jul 20, 2013 9:41:50 AM org.apache.cayenne.log.CommonsJdbcEventLogger logSelectCount
INFO: === returned 2 rows. - took 4 ms.
Jul 20, 2013 9:41:50 AM org.apache.cayenne.log.CommonsJdbcEventLogger logCommitTransaction
INFO: +++ transaction committed.
Tests run: 3, Failures: 0, Errors: 0, Skipped: 0, Time elapsed: 1.563 sec
Running org.apache.cayenne.DataRowTest
Tests run: 2, Failures: 0, Errors: 0, Skipped: 0, Time elapsed: 0.002 sec
Running org.apache.cayenne.access.types.EnumTypeTest
Tests run: 7, Failures: 0, Errors: 0, Skipped: 0, Time elapsed: 0.002 sec
Running org.apache.cayenne.exp.parser.ASTObjPathTest
Tests run: 2, Failures: 0, Errors: 0, Skipped: 0, Time elapsed: 0.001 sec

Results :

Failed tests: 
  testDeadlock(org.apache.cayenne.access.NestedDataContext_DeadlockTest)

Tests in error: 
  testAddTable(org.apache.cayenne.merge.CreateTableToModelTest)
  testForreignKey(org.apache.cayenne.merge.DropRelationshipToModelTest)
  testReadFlattenedRelationship(org.apache.cayenne.CayenneDataObjectFlattenedRelTest)
  testReadFlattenedRelationship2(org.apache.cayenne.CayenneDataObjectFlattenedRelTest)
  testAddToFlattenedRelationship(org.apache.cayenne.CayenneDataObjectFlattenedRelTest)
  testDoubleCommitAddToFlattenedRelationship(org.apache.cayenne.CayenneDataObjectFlattenedRelTest)
  testRemoveFromFlattenedRelationship(org.apache.cayenne.CayenneDataObjectFlattenedRelTest)
  testRemoveFlattenedRelationshipAndRootRecord(org.apache.cayenne.CayenneDataObjectFlattenedRelTest)
  testAddRemoveFlattenedRelationship1(org.apache.cayenne.CayenneDataObjectFlattenedRelTest)
  testAddRemoveFlattenedRelationship2(org.apache.cayenne.CayenneDataObjectFlattenedRelTest)
  test(org.apache.cayenne.merge.ValueForNullTest)
  testSimpleColumn(org.apache.cayenne.merge.DropColumnToModelTest)
  testRemoveFKColumnWithoutRelationshipInDb(org.apache.cayenne.merge.DropColumnToModelTest)
  test(org.apache.cayenne.merge.SetPrimaryKeyToDbTest)
  test(org.apache.cayenne.merge.SetAllowNullToDbTest)
  testAddAndDropColumnToDb(org.apache.cayenne.merge.MergerFactoryTest)
  testChangeVarcharSizeToDb(org.apache.cayenne.merge.MergerFactoryTest)
  testMultipleTokensToDb(org.apache.cayenne.merge.MergerFactoryTest)
  testAddTableToDb(org.apache.cayenne.merge.MergerFactoryTest)
  testAddForeignKeyWithTable(org.apache.cayenne.merge.MergerFactoryTest)
  testAddForeignKeyAfterTable(org.apache.cayenne.merge.MergerFactoryTest)
  test(org.apache.cayenne.merge.SetNotNullToDbTest)
  testResolveToOneOverFKOfDifferentNumType(org.apache.cayenne.unit.jira.CAY_191Test)
  testMerging(org.apache.cayenne.util.EntityMergeSupportTest)
  testSelectWithOuterJoinFlattened(org.apache.cayenne.access.DataContextOuterJoinsTest)
  testSelectWithOuterJoin(org.apache.cayenne.access.DataContextOuterJoinsTest)
  testSelectWithOuterJoinFromString(org.apache.cayenne.access.DataContextOuterJoinsTest)
  testSelectWithOuterOrdering(org.apache.cayenne.access.DataContextOuterJoinsTest)
  testNullifyToOne(org.apache.cayenne.access.DataContextDeleteRulesTest)
  testCascadeToOne(org.apache.cayenne.access.DataContextDeleteRulesTest)
  testCascadeToManyFlattened(org.apache.cayenne.access.DataContextDeleteRulesTest)
  testNullifyToManyFlattened(org.apache.cayenne.access.DataContextDeleteRulesTest)
  testNullifyToMany(org.apache.cayenne.access.DataContextDeleteRulesTest)
  testCascadeToMany(org.apache.cayenne.access.DataContextDeleteRulesTest)
  testDenyToMany(org.apache.cayenne.access.DataContextDeleteRulesTest)
  testAddColumn(org.apache.cayenne.merge.AddColumnToModelTest)
  testDropTable(org.apache.cayenne.merge.DropTableToModelTest)
  testManyToMany(org.apache.cayenne.access.FlattenedPrefetchTest)
  testMultiPrefetch(org.apache.cayenne.access.FlattenedPrefetchTest)
  testJointManyToMany(org.apache.cayenne.access.FlattenedPrefetchTest)
  testJointMultiPrefetch(org.apache.cayenne.access.FlattenedPrefetchTest)

Tests run: 2182, Failures: 1, Errors: 41, Skipped: 0

[INFO] ------------------------------------------------------------------------
[INFO] Reactor Summary:
[INFO] 
[INFO] Cayenne ........................................... SUCCESS [12.687s]
[INFO] Common Unit Test Utilities ........................ SUCCESS [47.720s]
[INFO] Cayenne Internal Build Plugin ..................... SUCCESS [54.272s]
[INFO] Cayenne Build Tools Parent ........................ SUCCESS [0.004s]
[INFO] Cayenne License and Notice Bundle ................. SUCCESS [9.588s]
[INFO] Cayenne Dependency Injection Container ............ SUCCESS [3.030s]
[INFO] Cayenne Java 1.5 Unpublished ...................... FAILURE [16:50.886s]
[INFO] Cayenne WebObjects Compatibility Library .......... SKIPPED
[INFO] Cayenne Aggregated Server Jar ..................... SKIPPED
[INFO] Cayenne Aggregated Client Jar ..................... SKIPPED
[INFO] Cayenne Project ................................... SKIPPED
[INFO] Cayenne Tools ..................................... SKIPPED
[INFO] Library: cayenne-lifecycle ........................ SKIPPED
[INFO] Cayenne Maven Plugin .............................. SKIPPED
[INFO] Cayenne Framework Aggregator Project .............. SKIPPED
[INFO] Cayenne Integration Tests Parent .................. SKIPPED
[INFO] Integration Tests - Cayenne Tools ................. SKIPPED
[INFO] Cayenne Modeler ................................... SKIPPED
[INFO] Cayenne Modeler Maven Plugin ...................... SKIPPED
[INFO] Cayenne Modeler Parent ............................ SKIPPED
[INFO] Cayenne Tutorial .................................. SKIPPED
[INFO] Cayenne ROP Server Tutorial ....................... SKIPPED
[INFO] Cayenne ROP Client Tutorial ....................... SKIPPED
[INFO] Cayenne Tutorials ................................. SKIPPED
[INFO] Cayenne Documentation ............................. SKIPPED
[INFO] Cayenne Documenation Parent ....................... SKIPPED
[INFO] Cayenne Docbook Documentation ..................... SKIPPED
[INFO] Docbook: Cayenne Stylesheets ...................... SKIPPED
[INFO] Docbook: Cayenne Guide ............................ SKIPPED
[INFO] Docbook: Getting Started with Cayenne ............. SKIPPED
[INFO] Docbook: Getting Started with Cayenne ROP ......... SKIPPED
[INFO] Docbook: Cayenne New Features and Upgrade Guide ... SKIPPED
[INFO] ------------------------------------------------------------------------
[INFO] BUILD FAILURE
[INFO] ------------------------------------------------------------------------
[INFO] Total time: 19:09.168s
[INFO] Finished at: Sat Jul 20 09:41:50 UTC 2013
[INFO] Final Memory: 35M/161M
[INFO] ------------------------------------------------------------------------
[ERROR] Failed to execute goal org.apache.maven.plugins:maven-surefire-plugin:2.5:test (default-test)
on project cayenne-jdk1.5-unpublished: There are test failures.
[ERROR] 
[ERROR] Please refer to /home/hudson/jenkins-slave/workspace/Cayenne-trunk/cayenneTestConnection/derby/jdk/JDK
1.6 (latest)/label/Ubuntu/trunk/framework/cayenne-jdk1.5-unpublished/target/surefire-reports
for the individual test results.
[ERROR] -> [Help 1]
org.apache.maven.lifecycle.LifecycleExecutionException: Failed to execute goal org.apache.maven.plugins:maven-surefire-plugin:2.5:test
(default-test) on project cayenne-jdk1.5-unpublished: There are test failures.

Please refer to /home/hudson/jenkins-slave/workspace/Cayenne-trunk/cayenneTestConnection/derby/jdk/JDK
1.6 (latest)/label/Ubuntu/trunk/framework/cayenne-jdk1.5-unpublished/target/surefire-reports
for the individual test results.
	at org.apache.maven.lifecycle.internal.MojoExecutor.execute(MojoExecutor.java:213)
	at org.apache.maven.lifecycle.internal.MojoExecutor.execute(MojoExecutor.java:153)
	at org.apache.maven.lifecycle.internal.MojoExecutor.execute(MojoExecutor.java:145)
	at org.apache.maven.lifecycle.internal.LifecycleModuleBuilder.buildProject(LifecycleModuleBuilder.java:84)
	at org.apache.maven.lifecycle.internal.LifecycleModuleBuilder.buildProject(LifecycleModuleBuilder.java:59)
	at org.apache.maven.lifecycle.internal.LifecycleStarter.singleThreadedBuild(LifecycleStarter.java:183)
	at org.apache.maven.lifecycle.internal.LifecycleStarter.execute(LifecycleStarter.java:161)
	at org.apache.maven.DefaultMaven.doExecute(DefaultMaven.java:320)
	at org.apache.maven.DefaultMaven.execute(DefaultMaven.java:156)
	at org.apache.maven.cli.MavenCli.execute(MavenCli.java:537)
	at org.apache.maven.cli.MavenCli.doMain(MavenCli.java:196)
	at org.apache.maven.cli.MavenCli.main(MavenCli.java:141)
	at sun.reflect.NativeMethodAccessorImpl.invoke0(Native Method)
	at sun.reflect.NativeMethodAccessorImpl.invoke(NativeMethodAccessorImpl.java:39)
	at sun.reflect.DelegatingMethodAccessorImpl.invoke(DelegatingMethodAccessorImpl.java:25)
	at java.lang.reflect.Method.invoke(Method.java:597)
	at org.codehaus.plexus.classworlds.launcher.Launcher.launchEnhanced(Launcher.java:290)
	at org.codehaus.plexus.classworlds.launcher.Launcher.launch(Launcher.java:230)
	at org.codehaus.plexus.classworlds.launcher.Launcher.mainWithExitCode(Launcher.java:409)
	at org.codehaus.plexus.classworlds.launcher.Launcher.main(Launcher.java:352)
Caused by: org.apache.maven.plugin.MojoFailureException: There are test failures.

Please refer to /home/hudson/jenkins-slave/workspace/Cayenne-trunk/cayenneTestConnection/derby/jdk/JDK
1.6 (latest)/label/Ubuntu/trunk/framework/cayenne-jdk1.5-unpublished/target/surefire-reports
for the individual test results.
	at org.apache.maven.plugin.surefire.SurefirePlugin.execute(SurefirePlugin.java:629)
	at org.apache.maven.plugin.DefaultBuildPluginManager.executeMojo(DefaultBuildPluginManager.java:101)
	at org.apache.maven.lifecycle.internal.MojoExecutor.execute(MojoExecutor.java:209)
	... 19 more
[ERROR] 
[ERROR] Re-run Maven using the -X switch to enable full debug logging.
[ERROR] 
[ERROR] For more information about the errors and possible solutions, please read the following
articles:
[ERROR] [Help 1] http://cwiki.apache.org/confluence/display/MAVEN/MojoFailureException
[ERROR] 
[ERROR] After correcting the problems, you can resume the build with the command
[ERROR]   mvn <goals> -rf :cayenne-jdk1.5-unpublished
Build step 'Invoke top-level Maven targets' marked build as failure

Mime
View raw message