cayenne-commits mailing list archives

Site index · List index
Message view « Date » · « Thread »
Top « Date » · « Thread »
From Apache Jenkins Server <jenk...@builds.apache.org>
Subject Build failed in Jenkins: Cayenne-trunk » derby,JDK 1.6 (latest),Ubuntu #885
Date Sat, 22 Jun 2013 18:25:54 GMT
See <https://builds.apache.org/job/Cayenne-trunk/./cayenneTestConnection=derby,jdk=JDK%201.6%20(latest),label=Ubuntu/885/changes>

Changes:

[aadamchik] CAY-1789  Lock-free EntityResolver

adding a proxy wrapper for lazy initialization

[aadamchik] CAY-1789  Lock-free EntityResolver

------------------------------------------
[...truncated 132 lines...]

[WARNING] Using platform encoding (ANSI_X3.4-1968 actually) to read mojo metadata, i.e. build
is platform dependent!
[INFO] Applying mojo extractor for language: java
[WARNING] org.apache.cayenne.maven.plugin.aggregator.SourcesAggregatorMojo#archiverManager:
[WARNING]   The syntax
[WARNING]     @parameter expression="${component.<role>#<roleHint>}"
[WARNING]   is deprecated, please use
[WARNING]     @component role="<role>" roleHint="<roleHint>"
[WARNING]   instead.
[WARNING] org.apache.cayenne.maven.plugin.aggregator.SourcesAggregatorMojo#factory:
[WARNING]   The syntax
[WARNING]     @parameter expression="${component.<role>#<roleHint>}"
[WARNING]   is deprecated, please use
[WARNING]     @component role="<role>" roleHint="<roleHint>"
[WARNING]   instead.
[WARNING] org.apache.cayenne.maven.plugin.aggregator.SourcesAggregatorMojo#resolver:
[WARNING]   The syntax
[WARNING]     @parameter expression="${component.<role>#<roleHint>}"
[WARNING]   is deprecated, please use
[WARNING]     @component role="<role>" roleHint="<roleHint>"
[WARNING]   instead.
[WARNING] org.apache.cayenne.maven.plugin.aggregator.BinAggregatorMojo#archiverManager:
[WARNING]   The syntax
[WARNING]     @parameter expression="${component.<role>#<roleHint>}"
[WARNING]   is deprecated, please use
[WARNING]     @component role="<role>" roleHint="<roleHint>"
[WARNING]   instead.
[WARNING] org.apache.cayenne.maven.plugin.aggregator.BinAggregatorMojo#factory:
[WARNING]   The syntax
[WARNING]     @parameter expression="${component.<role>#<roleHint>}"
[WARNING]   is deprecated, please use
[WARNING]     @component role="<role>" roleHint="<roleHint>"
[WARNING]   instead.
[WARNING] org.apache.cayenne.maven.plugin.aggregator.BinAggregatorMojo#resolver:
[WARNING]   The syntax
[WARNING]     @parameter expression="${component.<role>#<roleHint>}"
[WARNING]   is deprecated, please use
[WARNING]     @component role="<role>" roleHint="<roleHint>"
[WARNING]   instead.
[INFO] Mojo extractor for language: java found 3 mojo descriptors.
[INFO] Applying mojo extractor for language: bsh
[INFO] Mojo extractor for language: bsh found 0 mojo descriptors.
[INFO] 
[INFO] --- maven-resources-plugin:2.4.3:resources (default-resources) @ maven-cayenne-build-plugin
---
[INFO] Using 'UTF-8' encoding to copy filtered resources.
[INFO] skip non existing resourceDirectory /home/hudson/jenkins-slave/workspace/Cayenne-trunk/cayenneTestConnection/derby/jdk/JDK
1.6 (latest)/label/Ubuntu/trunk/build-tools/maven-cayenne-build-plugin/src/main/resources
[INFO] 
[INFO] --- maven-compiler-plugin:2.3.2:compile (default-compile) @ maven-cayenne-build-plugin
---
[WARNING] File encoding has not been set, using platform encoding ANSI_X3.4-1968, i.e. build
is platform dependent!
[INFO] Compiling 6 source files to /home/hudson/jenkins-slave/workspace/Cayenne-trunk/cayenneTestConnection/derby/jdk/JDK
1.6 (latest)/label/Ubuntu/trunk/build-tools/maven-cayenne-build-plugin/target/classes
[INFO] 
[INFO] --- maven-resources-plugin:2.4.3:testResources (default-testResources) @ maven-cayenne-build-plugin
---
[INFO] Using 'UTF-8' encoding to copy filtered resources.
[INFO] skip non existing resourceDirectory /home/hudson/jenkins-slave/workspace/Cayenne-trunk/cayenneTestConnection/derby/jdk/JDK
1.6 (latest)/label/Ubuntu/trunk/build-tools/maven-cayenne-build-plugin/src/test/resources
[INFO] 
[INFO] --- maven-compiler-plugin:2.3.2:testCompile (default-testCompile) @ maven-cayenne-build-plugin
---
[INFO] No sources to compile
[INFO] 
[INFO] --- maven-surefire-plugin:2.5:test (default-test) @ maven-cayenne-build-plugin ---
[INFO] No tests to run.
[INFO] 
[INFO] --- maven-jar-plugin:2.3.1:jar (default-jar) @ maven-cayenne-build-plugin ---
[INFO] Building jar: /home/hudson/jenkins-slave/workspace/Cayenne-trunk/cayenneTestConnection/derby/jdk/JDK
1.6 (latest)/label/Ubuntu/trunk/build-tools/maven-cayenne-build-plugin/target/maven-cayenne-build-plugin-3.2M1-SNAPSHOT.jar
[INFO] 
[INFO] --- maven-plugin-plugin:2.9:addPluginArtifactMetadata (default-addPluginArtifactMetadata)
@ maven-cayenne-build-plugin ---
[INFO] 
[INFO] --- maven-install-plugin:2.3.1:install (default-install) @ maven-cayenne-build-plugin
---
[INFO] Installing /home/hudson/jenkins-slave/workspace/Cayenne-trunk/cayenneTestConnection/derby/jdk/JDK
1.6 (latest)/label/Ubuntu/trunk/build-tools/maven-cayenne-build-plugin/target/maven-cayenne-build-plugin-3.2M1-SNAPSHOT.jar
to <https://builds.apache.org/job/Cayenne-trunk/./cayenneTestConnection=derby,jdk=JDK%201.6%20(latest),label=Ubuntu/ws/.repository/org/apache/cayenne/build-tools/maven-cayenne-build-plugin/3.2M1-SNAPSHOT/maven-cayenne-build-plugin-3.2M1-SNAPSHOT.jar>
[INFO] Installing /home/hudson/jenkins-slave/workspace/Cayenne-trunk/cayenneTestConnection/derby/jdk/JDK
1.6 (latest)/label/Ubuntu/trunk/build-tools/maven-cayenne-build-plugin/pom.xml to <https://builds.apache.org/job/Cayenne-trunk/./cayenneTestConnection=derby,jdk=JDK%201.6%20(latest),label=Ubuntu/ws/.repository/org/apache/cayenne/build-tools/maven-cayenne-build-plugin/3.2M1-SNAPSHOT/maven-cayenne-build-plugin-3.2M1-SNAPSHOT.pom>
[INFO]                                                                         
[INFO] ------------------------------------------------------------------------
[INFO] Building Cayenne Build Tools Parent 3.2M1-SNAPSHOT
[INFO] ------------------------------------------------------------------------
[INFO] 
[INFO] --- maven-clean-plugin:2.4.1:clean (default-clean) @ cayenne-build-tools ---
[INFO] 
[INFO] --- maven-install-plugin:2.3.1:install (default-install) @ cayenne-build-tools ---
[INFO] Installing /home/hudson/jenkins-slave/workspace/Cayenne-trunk/cayenneTestConnection/derby/jdk/JDK
1.6 (latest)/label/Ubuntu/trunk/build-tools/pom.xml to <https://builds.apache.org/job/Cayenne-trunk/./cayenneTestConnection=derby,jdk=JDK%201.6%20(latest),label=Ubuntu/ws/.repository/org/apache/cayenne/parents/cayenne-build-tools/3.2M1-SNAPSHOT/cayenne-build-tools-3.2M1-SNAPSHOT.pom>
[INFO]                                                                         
[INFO] ------------------------------------------------------------------------
[INFO] Building Cayenne License and Notice Bundle 3.2M1-SNAPSHOT
[INFO] ------------------------------------------------------------------------
[INFO] 
[INFO] --- maven-clean-plugin:2.4.1:clean (default-clean) @ cayenne-legal-unpublished ---
[INFO] 
[INFO] --- maven-cayenne-build-plugin:3.2M1-SNAPSHOT:date (date) @ cayenne-legal-unpublished
---
[INFO] 
[INFO] --- maven-remote-resources-plugin:1.0-alpha-1:bundle (default) @ cayenne-legal-unpublished
---
[INFO] 
[INFO] --- maven-resources-plugin:2.4.3:resources (default-resources) @ cayenne-legal-unpublished
---
[INFO] Using 'UTF-8' encoding to copy filtered resources.
[INFO] Copying 2 resources
[INFO] 
[INFO] --- maven-compiler-plugin:2.3.2:compile (default-compile) @ cayenne-legal-unpublished
---
[INFO] No sources to compile
[INFO] 
[INFO] --- maven-resources-plugin:2.4.3:testResources (default-testResources) @ cayenne-legal-unpublished
---
[INFO] Using 'UTF-8' encoding to copy filtered resources.
[INFO] skip non existing resourceDirectory /home/hudson/jenkins-slave/workspace/Cayenne-trunk/cayenneTestConnection/derby/jdk/JDK
1.6 (latest)/label/Ubuntu/trunk/framework/cayenne-legal-unpublished/src/test/resources
[INFO] 
[INFO] --- maven-compiler-plugin:2.3.2:testCompile (default-testCompile) @ cayenne-legal-unpublished
---
[INFO] No sources to compile
[INFO] 
[INFO] --- maven-surefire-plugin:2.5:test (default-test) @ cayenne-legal-unpublished ---
[INFO] No tests to run.
[INFO] 
[INFO] --- maven-jar-plugin:2.3.2:jar (default-jar) @ cayenne-legal-unpublished ---
[INFO] Building jar: /home/hudson/jenkins-slave/workspace/Cayenne-trunk/cayenneTestConnection/derby/jdk/JDK
1.6 (latest)/label/Ubuntu/trunk/framework/cayenne-legal-unpublished/target/cayenne-legal-unpublished-3.2M1-SNAPSHOT.jar
[INFO] 
[INFO] >>> maven-source-plugin:2.1.2:jar (bundle-source-jar) @ cayenne-legal-unpublished
>>>
[INFO] 
[INFO] --- maven-cayenne-build-plugin:3.2M1-SNAPSHOT:date (date) @ cayenne-legal-unpublished
---
[INFO] 
[INFO] <<< maven-source-plugin:2.1.2:jar (bundle-source-jar) @ cayenne-legal-unpublished
<<<
[INFO] 
[INFO] --- maven-source-plugin:2.1.2:jar (bundle-source-jar) @ cayenne-legal-unpublished ---
[INFO] Building jar: /home/hudson/jenkins-slave/workspace/Cayenne-trunk/cayenneTestConnection/derby/jdk/JDK
1.6 (latest)/label/Ubuntu/trunk/framework/cayenne-legal-unpublished/target/cayenne-legal-unpublished-3.2M1-SNAPSHOT-sources.jar
[INFO] 
[INFO] --- maven-install-plugin:2.3.1:install (default-install) @ cayenne-legal-unpublished
---
[INFO] Installing /home/hudson/jenkins-slave/workspace/Cayenne-trunk/cayenneTestConnection/derby/jdk/JDK
1.6 (latest)/label/Ubuntu/trunk/framework/cayenne-legal-unpublished/target/cayenne-legal-unpublished-3.2M1-SNAPSHOT.jar
to <https://builds.apache.org/job/Cayenne-trunk/./cayenneTestConnection=derby,jdk=JDK%201.6%20(latest),label=Ubuntu/ws/.repository/org/apache/cayenne/unpublished/cayenne-legal-unpublished/3.2M1-SNAPSHOT/cayenne-legal-unpublished-3.2M1-SNAPSHOT.jar>
[INFO] Installing /home/hudson/jenkins-slave/workspace/Cayenne-trunk/cayenneTestConnection/derby/jdk/JDK
1.6 (latest)/label/Ubuntu/trunk/framework/cayenne-legal-unpublished/pom.xml to <https://builds.apache.org/job/Cayenne-trunk/./cayenneTestConnection=derby,jdk=JDK%201.6%20(latest),label=Ubuntu/ws/.repository/org/apache/cayenne/unpublished/cayenne-legal-unpublished/3.2M1-SNAPSHOT/cayenne-legal-unpublished-3.2M1-SNAPSHOT.pom>
[INFO] Installing /home/hudson/jenkins-slave/workspace/Cayenne-trunk/cayenneTestConnection/derby/jdk/JDK
1.6 (latest)/label/Ubuntu/trunk/framework/cayenne-legal-unpublished/target/cayenne-legal-unpublished-3.2M1-SNAPSHOT-sources.jar
to <https://builds.apache.org/job/Cayenne-trunk/./cayenneTestConnection=derby,jdk=JDK%201.6%20(latest),label=Ubuntu/ws/.repository/org/apache/cayenne/unpublished/cayenne-legal-unpublished/3.2M1-SNAPSHOT/cayenne-legal-unpublished-3.2M1-SNAPSHOT-sources.jar>
[INFO]                                                                         
[INFO] ------------------------------------------------------------------------
[INFO] Building Cayenne Dependency Injection Container 3.2M1-SNAPSHOT
[INFO] ------------------------------------------------------------------------
[INFO] 
[INFO] --- maven-clean-plugin:2.4.1:clean (default-clean) @ cayenne-di-unpublished ---
[INFO] 
[INFO] --- maven-cayenne-build-plugin:3.2M1-SNAPSHOT:date (date) @ cayenne-di-unpublished
---
[INFO] 
[INFO] --- maven-resources-plugin:2.4.3:resources (default-resources) @ cayenne-di-unpublished
---
[INFO] Using 'UTF-8' encoding to copy filtered resources.
[INFO] Copying 1 resource
[INFO] 
[INFO] --- maven-compiler-plugin:2.3.2:compile (default-compile) @ cayenne-di-unpublished
---
[WARNING] File encoding has not been set, using platform encoding ANSI_X3.4-1968, i.e. build
is platform dependent!
[INFO] Compiling 38 source files to /home/hudson/jenkins-slave/workspace/Cayenne-trunk/cayenneTestConnection/derby/jdk/JDK
1.6 (latest)/label/Ubuntu/trunk/framework/cayenne-di-unpublished/target/classes
[INFO] 
[INFO] --- maven-resources-plugin:2.4.3:testResources (default-testResources) @ cayenne-di-unpublished
---
[INFO] Using 'UTF-8' encoding to copy filtered resources.
[INFO] skip non existing resourceDirectory /home/hudson/jenkins-slave/workspace/Cayenne-trunk/cayenneTestConnection/derby/jdk/JDK
1.6 (latest)/label/Ubuntu/trunk/framework/cayenne-di-unpublished/src/test/resources
[INFO] 
[INFO] --- maven-compiler-plugin:2.3.2:testCompile (default-testCompile) @ cayenne-di-unpublished
---
[WARNING] File encoding has not been set, using platform encoding ANSI_X3.4-1968, i.e. build
is platform dependent!
[INFO] Compiling 38 source files to /home/hudson/jenkins-slave/workspace/Cayenne-trunk/cayenneTestConnection/derby/jdk/JDK
1.6 (latest)/label/Ubuntu/trunk/framework/cayenne-di-unpublished/target/test-classes
[INFO] 
[INFO] --- maven-surefire-plugin:2.5:test (default-test) @ cayenne-di-unpublished ---
[INFO] Surefire report directory: /home/hudson/jenkins-slave/workspace/Cayenne-trunk/cayenneTestConnection/derby/jdk/JDK
1.6 (latest)/label/Ubuntu/trunk/framework/cayenne-di-unpublished/target/surefire-reports
[INFO] ------------------------------------------------------------------------
[INFO] Reactor Summary:
[INFO] 
[INFO] Cayenne ........................................... SUCCESS [0.986s]
[INFO] Common Unit Test Utilities ........................ SUCCESS [4.016s]
[INFO] Cayenne Internal Build Plugin ..................... SUCCESS [4.544s]
[INFO] Cayenne Build Tools Parent ........................ SUCCESS [0.018s]
[INFO] Cayenne License and Notice Bundle ................. SUCCESS [1.592s]
[INFO] Cayenne Dependency Injection Container ............ FAILURE [2.904s]
[INFO] Cayenne Java 1.5 Unpublished ...................... SKIPPED
[INFO] Cayenne WebObjects Compatibility Library .......... SKIPPED
[INFO] Cayenne Aggregated Server Jar ..................... SKIPPED
[INFO] Cayenne Aggregated Client Jar ..................... SKIPPED
[INFO] Cayenne Project ................................... SKIPPED
[INFO] Cayenne Tools ..................................... SKIPPED
[INFO] Library: cayenne-lifecycle ........................ SKIPPED
[INFO] Cayenne Maven Plugin .............................. SKIPPED
[INFO] Cayenne Framework Aggregator Project .............. SKIPPED
[INFO] Cayenne Integration Tests Parent .................. SKIPPED
[INFO] Integration Tests - Cayenne Tools ................. SKIPPED
[INFO] Cayenne Modeler ................................... SKIPPED
[INFO] Cayenne Modeler Maven Plugin ...................... SKIPPED
[INFO] Cayenne Modeler Parent ............................ SKIPPED
[INFO] Cayenne Tutorial .................................. SKIPPED
[INFO] Cayenne ROP Server Tutorial ....................... SKIPPED
[INFO] Cayenne ROP Client Tutorial ....................... SKIPPED
[INFO] Cayenne Tutorials ................................. SKIPPED
[INFO] Cayenne Documentation ............................. SKIPPED
[INFO] Cayenne Documenation Parent ....................... SKIPPED
[INFO] Cayenne Docbook Documentation ..................... SKIPPED
[INFO] Docbook: Cayenne Stylesheets ...................... SKIPPED
[INFO] Docbook: Cayenne Guide ............................ SKIPPED
[INFO] Docbook: Getting Started with Cayenne ............. SKIPPED
[INFO] Docbook: Getting Started with Cayenne ROP ......... SKIPPED
[INFO] Docbook: Cayenne New Features and Upgrade Guide ... SKIPPED
[INFO] ------------------------------------------------------------------------
[INFO] BUILD FAILURE
[INFO] ------------------------------------------------------------------------
[INFO] Total time: 15.506s
[INFO] Finished at: Sat Jun 22 18:25:54 UTC 2013
[INFO] Final Memory: 23M/67M
[INFO] ------------------------------------------------------------------------
[ERROR] Failed to execute goal org.apache.maven.plugins:maven-surefire-plugin:2.5:test (default-test)
on project cayenne-di-unpublished: Error creating properties files for forking; nested exception
is java.io.IOException: No space left on device -> [Help 1]
org.apache.maven.lifecycle.LifecycleExecutionException: Failed to execute goal org.apache.maven.plugins:maven-surefire-plugin:2.5:test
(default-test) on project cayenne-di-unpublished: Error creating properties files for forking;
nested exception is java.io.IOException: No space left on device
	at org.apache.maven.lifecycle.internal.MojoExecutor.execute(MojoExecutor.java:217)
	at org.apache.maven.lifecycle.internal.MojoExecutor.execute(MojoExecutor.java:153)
	at org.apache.maven.lifecycle.internal.MojoExecutor.execute(MojoExecutor.java:145)
	at org.apache.maven.lifecycle.internal.LifecycleModuleBuilder.buildProject(LifecycleModuleBuilder.java:84)
	at org.apache.maven.lifecycle.internal.LifecycleModuleBuilder.buildProject(LifecycleModuleBuilder.java:59)
	at org.apache.maven.lifecycle.internal.LifecycleStarter.singleThreadedBuild(LifecycleStarter.java:183)
	at org.apache.maven.lifecycle.internal.LifecycleStarter.execute(LifecycleStarter.java:161)
	at org.apache.maven.DefaultMaven.doExecute(DefaultMaven.java:320)
	at org.apache.maven.DefaultMaven.execute(DefaultMaven.java:156)
	at org.apache.maven.cli.MavenCli.execute(MavenCli.java:537)
	at org.apache.maven.cli.MavenCli.doMain(MavenCli.java:196)
	at org.apache.maven.cli.MavenCli.main(MavenCli.java:141)
	at sun.reflect.NativeMethodAccessorImpl.invoke0(Native Method)
	at sun.reflect.NativeMethodAccessorImpl.invoke(NativeMethodAccessorImpl.java:39)
	at sun.reflect.DelegatingMethodAccessorImpl.invoke(DelegatingMethodAccessorImpl.java:25)
	at java.lang.reflect.Method.invoke(Method.java:597)
	at org.codehaus.plexus.classworlds.launcher.Launcher.launchEnhanced(Launcher.java:290)
	at org.codehaus.plexus.classworlds.launcher.Launcher.launch(Launcher.java:230)
	at org.codehaus.plexus.classworlds.launcher.Launcher.mainWithExitCode(Launcher.java:409)
	at org.codehaus.plexus.classworlds.launcher.Launcher.main(Launcher.java:352)
Caused by: org.apache.maven.plugin.MojoExecutionException: Error creating properties files
for forking; nested exception is java.io.IOException: No space left on device
	at org.apache.maven.plugin.surefire.SurefirePlugin.execute(SurefirePlugin.java:585)
	at org.apache.maven.plugin.DefaultBuildPluginManager.executeMojo(DefaultBuildPluginManager.java:101)
	at org.apache.maven.lifecycle.internal.MojoExecutor.execute(MojoExecutor.java:209)
	... 19 more
Caused by: org.apache.maven.surefire.booter.SurefireBooterForkException: Error creating properties
files for forking; nested exception is java.io.IOException: No space left on device
	at org.apache.maven.surefire.booter.SurefireBooter.fork(SurefireBooter.java:637)
	at org.apache.maven.surefire.booter.SurefireBooter.forkSuites(SurefireBooter.java:485)
	at org.apache.maven.surefire.booter.SurefireBooter.runSuitesForkOnce(SurefireBooter.java:385)
	at org.apache.maven.surefire.booter.SurefireBooter.run(SurefireBooter.java:246)
	at org.apache.maven.plugin.surefire.SurefirePlugin.execute(SurefirePlugin.java:581)
	... 21 more
Caused by: java.io.IOException: No space left on device
	at java.io.FileOutputStream.writeBytes(Native Method)
	at java.io.FileOutputStream.write(FileOutputStream.java:282)
	at sun.nio.cs.StreamEncoder.writeBytes(StreamEncoder.java:202)
	at sun.nio.cs.StreamEncoder.implFlushBuffer(StreamEncoder.java:272)
	at sun.nio.cs.StreamEncoder.implFlush(StreamEncoder.java:276)
	at sun.nio.cs.StreamEncoder.flush(StreamEncoder.java:122)
	at java.io.OutputStreamWriter.flush(OutputStreamWriter.java:212)
	at java.io.BufferedWriter.flush(BufferedWriter.java:236)
	at java.util.Properties.store0(Properties.java:822)
	at java.util.Properties.store(Properties.java:796)
	at org.apache.maven.surefire.booter.SurefireBooter.writePropertiesFile(SurefireBooter.java:547)
	at org.apache.maven.surefire.booter.SurefireBooter.writePropertiesFile(SurefireBooter.java:535)
	at org.apache.maven.surefire.booter.SurefireBooter.fork(SurefireBooter.java:629)
	... 25 more
[ERROR] 
[ERROR] Re-run Maven using the -X switch to enable full debug logging.
[ERROR] 
[ERROR] For more information about the errors and possible solutions, please read the following
articles:
[ERROR] [Help 1] http://cwiki.apache.org/confluence/display/MAVEN/MojoExecutionException
[ERROR] 
[ERROR] After correcting the problems, you can resume the build with the command
[ERROR]   mvn <goals> -rf :cayenne-di-unpublished
Build step 'Invoke top-level Maven targets' marked build as failure

Mime
View raw message