cayenne-commits mailing list archives

Site index · List index
Message view « Date » · « Thread »
Top « Date » · « Thread »
From Apache Jenkins Server <jenk...@builds.apache.org>
Subject Build failed in Jenkins: Cayenne-31 » derby,JDK 1.6 (latest),Ubuntu #58
Date Thu, 11 Apr 2013 22:44:54 GMT
See <https://builds.apache.org/job/Cayenne-31/./cayenneTestConnection=derby,jdk=JDK%201.6%20(latest),label=Ubuntu/58/changes>

Changes:

[aadamchik] CAY-1806  Error importing eomodel

release notes

[aadamchik] CAY-1806  Error importing eomodel

(cherry picked from commit 58d2a4c7c5b6db87fbd6ef1a387207dc418f6b3e)

------------------------------------------
[...truncated 132370 lines...]
INFO: added runtime complimentary DbRelationship from DELETE_RULE_TEST3 to DELETE_RULE_TEST1
Apr 11, 2013 10:44:47 PM org.apache.cayenne.map.EntityResolver applyObjectLayerDefaults
INFO: added runtime complimentary ObjRelationship from FlattenedTest3 to FlattenedTest1
Apr 11, 2013 10:44:47 PM org.apache.cayenne.map.EntityResolver applyObjectLayerDefaults
INFO: added runtime complimentary ObjRelationship from FlattenedTest4 to FlattenedTest1
Apr 11, 2013 10:44:47 PM org.apache.cayenne.log.CommonsJdbcEventLogger logBeginTransaction
INFO: --- transaction started.
Apr 11, 2013 10:44:47 PM org.apache.cayenne.log.CommonsJdbcEventLogger logQuery
INFO: INSERT INTO MASTER (ID, NAME) VALUES (?, ?)
Apr 11, 2013 10:44:47 PM org.apache.cayenne.log.CommonsJdbcEventLogger logQueryParameters
INFO: [bind: 1->ID:203, 2->NAME:'X']
Apr 11, 2013 10:44:47 PM org.apache.cayenne.log.CommonsJdbcEventLogger logUpdateCount
INFO: === updated 1 row.
Apr 11, 2013 10:44:47 PM org.apache.cayenne.log.CommonsJdbcEventLogger logQuery
INFO: INSERT INTO CHILD (ID, MASTER_ID) VALUES (?, ?)
Apr 11, 2013 10:44:47 PM org.apache.cayenne.log.CommonsJdbcEventLogger logQueryParameters
INFO: [bind: 1->ID:201, 2->MASTER_ID:203]
Apr 11, 2013 10:44:47 PM org.apache.cayenne.log.CommonsJdbcEventLogger logUpdateCount
INFO: === updated 1 row.
Apr 11, 2013 10:44:47 PM org.apache.cayenne.log.CommonsJdbcEventLogger logQueryParameters
INFO: [bind: 1->ID:202, 2->MASTER_ID:NULL]
Apr 11, 2013 10:44:47 PM org.apache.cayenne.log.CommonsJdbcEventLogger logUpdateCount
INFO: === updated 1 row.
Apr 11, 2013 10:44:47 PM org.apache.cayenne.log.CommonsJdbcEventLogger logCommitTransaction
INFO: +++ transaction committed.
Apr 11, 2013 10:44:47 PM org.apache.cayenne.log.CommonsJdbcEventLogger logBeginTransaction
INFO: --- transaction started.
Apr 11, 2013 10:44:47 PM org.apache.cayenne.log.CommonsJdbcEventLogger logQuery
INFO: UPDATE CHILD SET MASTER_ID = ? WHERE ID = ?
Apr 11, 2013 10:44:47 PM org.apache.cayenne.log.CommonsJdbcEventLogger logQueryParameters
INFO: [bind: 1->MASTER_ID:203, 2->ID:202]
Apr 11, 2013 10:44:47 PM org.apache.cayenne.log.CommonsJdbcEventLogger logUpdateCount
INFO: === updated 1 row.
Apr 11, 2013 10:44:47 PM org.apache.cayenne.log.CommonsJdbcEventLogger logCommitTransaction
INFO: +++ transaction committed.
Apr 11, 2013 10:44:48 PM org.apache.cayenne.log.CommonsJdbcEventLogger logBeginTransaction
INFO: --- transaction started.
Apr 11, 2013 10:44:48 PM org.apache.cayenne.log.CommonsJdbcEventLogger logQuery
INFO: SELECT t0.MASTER_ID, t0.ID FROM CHILD t0 WHERE t0.MASTER_ID = ? [bind: 1->MASTER_ID:203]
Apr 11, 2013 10:44:48 PM org.apache.cayenne.log.CommonsJdbcEventLogger logSelectCount
INFO: === returned 2 rows. - took 1 ms.
Apr 11, 2013 10:44:48 PM org.apache.cayenne.log.CommonsJdbcEventLogger logCommitTransaction
INFO: +++ transaction committed.
Tests run: 3, Failures: 0, Errors: 0, Skipped: 0, Time elapsed: 0.937 sec
Running org.apache.cayenne.DataRowTest
Tests run: 2, Failures: 0, Errors: 0, Skipped: 0, Time elapsed: 0.003 sec
Running org.apache.cayenne.access.types.EnumTypeTest
Tests run: 7, Failures: 0, Errors: 0, Skipped: 0, Time elapsed: 0.002 sec

Results :

Tests run: 2145, Failures: 0, Errors: 0, Skipped: 0

[INFO] 
[INFO] --- maven-jar-plugin:2.3.2:jar (default-jar) @ cayenne-jdk1.5-unpublished ---
[INFO] Building jar: <https://builds.apache.org/job/Cayenne-31/./cayenneTestConnection=derby,jdk=JDK%201.6%20(latest),label=Ubuntu/ws/stable/framework/cayenne-jdk1.5-unpublished/target/cayenne-jdk1.5-unpublished-3.1B3-SNAPSHOT.jar>
[INFO] 
[INFO] >>> maven-source-plugin:2.1.2:jar (bundle-source-jar) @ cayenne-jdk1.5-unpublished
>>>
[INFO] 
[INFO] --- maven-cayenne-build-plugin:3.1B3-SNAPSHOT:date (date) @ cayenne-jdk1.5-unpublished
---
[INFO] 
[INFO] --- javacc-maven-plugin:2.6:jjtree-javacc (jjtree-ejbql) @ cayenne-jdk1.5-unpublished
---
[INFO] Skipping - all parsers are up to date
[INFO] 
[INFO] <<< maven-source-plugin:2.1.2:jar (bundle-source-jar) @ cayenne-jdk1.5-unpublished
<<<
[INFO] 
[INFO] --- maven-source-plugin:2.1.2:jar (bundle-source-jar) @ cayenne-jdk1.5-unpublished
---
[INFO] org already added, skipping
[INFO] org/apache already added, skipping
[INFO] org/apache/cayenne already added, skipping
[INFO] org/apache/cayenne/ejbql already added, skipping
[INFO] org/apache/cayenne/ejbql/parser already added, skipping
[INFO] org already added, skipping
[INFO] org/apache already added, skipping
[INFO] org/apache/cayenne already added, skipping
[INFO] org/apache/cayenne/ejbql already added, skipping
[INFO] org/apache/cayenne/ejbql/parser already added, skipping
[INFO] org already added, skipping
[INFO] org/apache already added, skipping
[INFO] org/apache/cayenne already added, skipping
[INFO] org/apache/cayenne/dba already added, skipping
[INFO] org/apache/cayenne/dba/mysql already added, skipping
[INFO] org/apache/cayenne/dba/derby already added, skipping
[INFO] org/apache/cayenne/dba/sybase already added, skipping
[INFO] org/apache/cayenne/dba/sqlite already added, skipping
[INFO] org/apache/cayenne/dba/hsqldb already added, skipping
[INFO] org/apache/cayenne/dba/frontbase already added, skipping
[INFO] org/apache/cayenne/dba/postgres already added, skipping
[INFO] org/apache/cayenne/dba/h2 already added, skipping
[INFO] org/apache/cayenne/dba/db2 already added, skipping
[INFO] org/apache/cayenne/dba/ingres already added, skipping
[INFO] org/apache/cayenne/dba/oracle already added, skipping
[INFO] org/apache/cayenne/dba/sqlserver already added, skipping
[INFO] org/apache/cayenne/dba/openbase already added, skipping
[INFO] Building jar: <https://builds.apache.org/job/Cayenne-31/./cayenneTestConnection=derby,jdk=JDK%201.6%20(latest),label=Ubuntu/ws/stable/framework/cayenne-jdk1.5-unpublished/target/cayenne-jdk1.5-unpublished-3.1B3-SNAPSHOT-sources.jar>
[INFO] org already added, skipping
[INFO] org/apache already added, skipping
[INFO] org/apache/cayenne already added, skipping
[INFO] org/apache/cayenne/ejbql already added, skipping
[INFO] org/apache/cayenne/ejbql/parser already added, skipping
[INFO] org already added, skipping
[INFO] org/apache already added, skipping
[INFO] org/apache/cayenne already added, skipping
[INFO] org/apache/cayenne/ejbql already added, skipping
[INFO] org/apache/cayenne/ejbql/parser already added, skipping
[INFO] org already added, skipping
[INFO] org/apache already added, skipping
[INFO] org/apache/cayenne already added, skipping
[INFO] org/apache/cayenne/dba already added, skipping
[INFO] org/apache/cayenne/dba/mysql already added, skipping
[INFO] org/apache/cayenne/dba/derby already added, skipping
[INFO] org/apache/cayenne/dba/sybase already added, skipping
[INFO] org/apache/cayenne/dba/sqlite already added, skipping
[INFO] org/apache/cayenne/dba/hsqldb already added, skipping
[INFO] org/apache/cayenne/dba/frontbase already added, skipping
[INFO] org/apache/cayenne/dba/postgres already added, skipping
[INFO] org/apache/cayenne/dba/h2 already added, skipping
[INFO] org/apache/cayenne/dba/db2 already added, skipping
[INFO] org/apache/cayenne/dba/ingres already added, skipping
[INFO] org/apache/cayenne/dba/oracle already added, skipping
[INFO] org/apache/cayenne/dba/sqlserver already added, skipping
[INFO] org/apache/cayenne/dba/openbase already added, skipping
[INFO] 
[INFO] --- maven-install-plugin:2.3.1:install (default-install) @ cayenne-jdk1.5-unpublished
---
[INFO] Installing <https://builds.apache.org/job/Cayenne-31/./cayenneTestConnection=derby,jdk=JDK%201.6%20(latest),label=Ubuntu/ws/stable/framework/cayenne-jdk1.5-unpublished/target/cayenne-jdk1.5-unpublished-3.1B3-SNAPSHOT.jar>
to <https://builds.apache.org/job/Cayenne-31/./cayenneTestConnection=derby,jdk=JDK%201.6%20(latest),label=Ubuntu/ws/.repository/org/apache/cayenne/unpublished/cayenne-jdk1.5-unpublished/3.1B3-SNAPSHOT/cayenne-jdk1.5-unpublished-3.1B3-SNAPSHOT.jar>
[INFO] Installing <https://builds.apache.org/job/Cayenne-31/./cayenneTestConnection=derby,jdk=JDK%201.6%20(latest),label=Ubuntu/ws/stable/framework/cayenne-jdk1.5-unpublished/pom.xml>
to <https://builds.apache.org/job/Cayenne-31/./cayenneTestConnection=derby,jdk=JDK%201.6%20(latest),label=Ubuntu/ws/.repository/org/apache/cayenne/unpublished/cayenne-jdk1.5-unpublished/3.1B3-SNAPSHOT/cayenne-jdk1.5-unpublished-3.1B3-SNAPSHOT.pom>
[INFO] Installing <https://builds.apache.org/job/Cayenne-31/./cayenneTestConnection=derby,jdk=JDK%201.6%20(latest),label=Ubuntu/ws/stable/framework/cayenne-jdk1.5-unpublished/target/cayenne-jdk1.5-unpublished-3.1B3-SNAPSHOT-sources.jar>
to <https://builds.apache.org/job/Cayenne-31/./cayenneTestConnection=derby,jdk=JDK%201.6%20(latest),label=Ubuntu/ws/.repository/org/apache/cayenne/unpublished/cayenne-jdk1.5-unpublished/3.1B3-SNAPSHOT/cayenne-jdk1.5-unpublished-3.1B3-SNAPSHOT-sources.jar>
[INFO]                                                                         
[INFO] ------------------------------------------------------------------------
[INFO] Building Cayenne WebObjects Compatibility Library 3.1B3-SNAPSHOT
[INFO] ------------------------------------------------------------------------
[INFO] 
[INFO] --- maven-clean-plugin:2.4.1:clean (default-clean) @ cayenne-wocompat-unpublished ---
[INFO] 
[INFO] --- maven-resources-plugin:2.4.3:resources (default-resources) @ cayenne-wocompat-unpublished
---
[INFO] Using 'UTF-8' encoding to copy filtered resources.
[INFO] skip non existing resourceDirectory <https://builds.apache.org/job/Cayenne-31/./cayenneTestConnection=derby,jdk=JDK%201.6%20(latest),label=Ubuntu/ws/stable/framework/cayenne-wocompat-unpublished/src/main/resources>
[INFO] 
[INFO] --- maven-compiler-plugin:2.3.2:compile (default-compile) @ cayenne-wocompat-unpublished
---
[WARNING] File encoding has not been set, using platform encoding ANSI_X3.4-1968, i.e. build
is platform dependent!
[INFO] Compiling 17 source files to <https://builds.apache.org/job/Cayenne-31/./cayenneTestConnection=derby,jdk=JDK%201.6%20(latest),label=Ubuntu/ws/stable/framework/cayenne-wocompat-unpublished/target/classes>
[INFO] 
[INFO] --- maven-resources-plugin:2.4.3:testResources (default-testResources) @ cayenne-wocompat-unpublished
---
[INFO] Using 'UTF-8' encoding to copy filtered resources.
[INFO] Copying 61 resources
[INFO] 
[INFO] --- maven-compiler-plugin:2.3.2:testCompile (default-testCompile) @ cayenne-wocompat-unpublished
---
[WARNING] File encoding has not been set, using platform encoding ANSI_X3.4-1968, i.e. build
is platform dependent!
[INFO] Compiling 8 source files to <https://builds.apache.org/job/Cayenne-31/./cayenneTestConnection=derby,jdk=JDK%201.6%20(latest),label=Ubuntu/ws/stable/framework/cayenne-wocompat-unpublished/target/test-classes>
[INFO] -------------------------------------------------------------
[ERROR] COMPILATION ERROR : 
[INFO] -------------------------------------------------------------
[ERROR] <https://builds.apache.org/job/Cayenne-31/./cayenneTestConnection=derby,jdk=JDK%201.6%20(latest),label=Ubuntu/ws/stable/framework/cayenne-wocompat-unpublished/src/test/java/org/apache/cayenne/wocompat/EOModelProcessorTest.java>:[74,8]
cannot find symbol
symbol  : class URL
location: class org.apache.cayenne.wocompat.EOModelProcessorTest
[INFO] 1 error
[INFO] -------------------------------------------------------------
[INFO] ------------------------------------------------------------------------
[INFO] Reactor Summary:
[INFO] 
[INFO] Cayenne ........................................... SUCCESS [10.010s]
[INFO] Common Unit Test Utilities ........................ SUCCESS [33.327s]
[INFO] Cayenne Internal Build Plugin ..................... SUCCESS [43.518s]
[INFO] Cayenne Build Tools Parent ........................ SUCCESS [0.005s]
[INFO] Cayenne License and Notice Bundle ................. SUCCESS [7.096s]
[INFO] Cayenne Dependency Injection Container ............ SUCCESS [3.068s]
[INFO] Cayenne Java 1.5 Unpublished ...................... SUCCESS [1:50.867s]
[INFO] Cayenne WebObjects Compatibility Library .......... FAILURE [1.488s]
[INFO] Cayenne Aggregated Server Jar ..................... SKIPPED
[INFO] Cayenne Aggregated Client Jar ..................... SKIPPED
[INFO] Cayenne Project ................................... SKIPPED
[INFO] Cayenne Tools ..................................... SKIPPED
[INFO] Library: cayenne-lifecycle ........................ SKIPPED
[INFO] Cayenne Maven Plugin .............................. SKIPPED
[INFO] Cayenne Framework Aggregator Project .............. SKIPPED
[INFO] Cayenne Integration Tests Parent .................. SKIPPED
[INFO] Integration Tests - Cayenne Runtime ............... SKIPPED
[INFO] Integration Tests - Cayenne Tools ................. SKIPPED
[INFO] Cayenne Modeler ................................... SKIPPED
[INFO] Cayenne Modeler Maven Plugin ...................... SKIPPED
[INFO] Cayenne Modeler Parent ............................ SKIPPED
[INFO] Cayenne Tutorial .................................. SKIPPED
[INFO] Cayenne ROP Server Tutorial ....................... SKIPPED
[INFO] Cayenne ROP Client Tutorial ....................... SKIPPED
[INFO] Cayenne Tutorials ................................. SKIPPED
[INFO] Cayenne Documentation ............................. SKIPPED
[INFO] Cayenne Documenation Parent ....................... SKIPPED
[INFO] Cayenne Docbook Documentation ..................... SKIPPED
[INFO] Docbook: Cayenne Stylesheets ...................... SKIPPED
[INFO] Docbook: Cayenne Guide ............................ SKIPPED
[INFO] Docbook: Getting Started with Cayenne ............. SKIPPED
[INFO] Docbook: Getting Started with Cayenne ROP ......... SKIPPED
[INFO] Docbook: Cayenne New Features and Upgrade Guide ... SKIPPED
[INFO] ------------------------------------------------------------------------
[INFO] BUILD FAILURE
[INFO] ------------------------------------------------------------------------
[INFO] Total time: 3:36.605s
[INFO] Finished at: Thu Apr 11 22:44:53 UTC 2013
[INFO] Final Memory: 42M/167M
[INFO] ------------------------------------------------------------------------
[ERROR] Failed to execute goal org.apache.maven.plugins:maven-compiler-plugin:2.3.2:testCompile
(default-testCompile) on project cayenne-wocompat-unpublished: Compilation failure
[ERROR] <https://builds.apache.org/job/Cayenne-31/./cayenneTestConnection=derby,jdk=JDK%201.6%20(latest),label=Ubuntu/ws/stable/framework/cayenne-wocompat-unpublished/src/test/java/org/apache/cayenne/wocompat/EOModelProcessorTest.java>:[74,8]
cannot find symbol
[ERROR] symbol  : class URL
[ERROR] location: class org.apache.cayenne.wocompat.EOModelProcessorTest
[ERROR] -> [Help 1]
org.apache.maven.lifecycle.LifecycleExecutionException: Failed to execute goal org.apache.maven.plugins:maven-compiler-plugin:2.3.2:testCompile
(default-testCompile) on project cayenne-wocompat-unpublished: Compilation failure
<https://builds.apache.org/job/Cayenne-31/./cayenneTestConnection=derby,jdk=JDK%201.6%20(latest),label=Ubuntu/ws/stable/framework/cayenne-wocompat-unpublished/src/test/java/org/apache/cayenne/wocompat/EOModelProcessorTest.java>:[74,8]
cannot find symbol
symbol  : class URL
location: class org.apache.cayenne.wocompat.EOModelProcessorTest

	at org.apache.maven.lifecycle.internal.MojoExecutor.execute(MojoExecutor.java:213)
	at org.apache.maven.lifecycle.internal.MojoExecutor.execute(MojoExecutor.java:153)
	at org.apache.maven.lifecycle.internal.MojoExecutor.execute(MojoExecutor.java:145)
	at org.apache.maven.lifecycle.internal.LifecycleModuleBuilder.buildProject(LifecycleModuleBuilder.java:84)
	at org.apache.maven.lifecycle.internal.LifecycleModuleBuilder.buildProject(LifecycleModuleBuilder.java:59)
	at org.apache.maven.lifecycle.internal.LifecycleStarter.singleThreadedBuild(LifecycleStarter.java:183)
	at org.apache.maven.lifecycle.internal.LifecycleStarter.execute(LifecycleStarter.java:161)
	at org.apache.maven.DefaultMaven.doExecute(DefaultMaven.java:320)
	at org.apache.maven.DefaultMaven.execute(DefaultMaven.java:156)
	at org.apache.maven.cli.MavenCli.execute(MavenCli.java:537)
	at org.apache.maven.cli.MavenCli.doMain(MavenCli.java:196)
	at org.apache.maven.cli.MavenCli.main(MavenCli.java:141)
	at sun.reflect.NativeMethodAccessorImpl.invoke0(Native Method)
	at sun.reflect.NativeMethodAccessorImpl.invoke(NativeMethodAccessorImpl.java:39)
	at sun.reflect.DelegatingMethodAccessorImpl.invoke(DelegatingMethodAccessorImpl.java:25)
	at java.lang.reflect.Method.invoke(Method.java:597)
	at org.codehaus.plexus.classworlds.launcher.Launcher.launchEnhanced(Launcher.java:290)
	at org.codehaus.plexus.classworlds.launcher.Launcher.launch(Launcher.java:230)
	at org.codehaus.plexus.classworlds.launcher.Launcher.mainWithExitCode(Launcher.java:409)
	at org.codehaus.plexus.classworlds.launcher.Launcher.main(Launcher.java:352)
Caused by: org.apache.maven.plugin.CompilationFailureException: Compilation failure
<https://builds.apache.org/job/Cayenne-31/./cayenneTestConnection=derby,jdk=JDK%201.6%20(latest),label=Ubuntu/ws/stable/framework/cayenne-wocompat-unpublished/src/test/java/org/apache/cayenne/wocompat/EOModelProcessorTest.java>:[74,8]
cannot find symbol
symbol  : class URL
location: class org.apache.cayenne.wocompat.EOModelProcessorTest

	at org.apache.maven.plugin.AbstractCompilerMojo.execute(AbstractCompilerMojo.java:656)
	at org.apache.maven.plugin.TestCompilerMojo.execute(TestCompilerMojo.java:161)
	at org.apache.maven.plugin.DefaultBuildPluginManager.executeMojo(DefaultBuildPluginManager.java:101)
	at org.apache.maven.lifecycle.internal.MojoExecutor.execute(MojoExecutor.java:209)
	... 19 more
[ERROR] 
[ERROR] Re-run Maven using the -X switch to enable full debug logging.
[ERROR] 
[ERROR] For more information about the errors and possible solutions, please read the following
articles:
[ERROR] [Help 1] http://cwiki.apache.org/confluence/display/MAVEN/MojoFailureException
[ERROR] 
[ERROR] After correcting the problems, you can resume the build with the command
[ERROR]   mvn <goals> -rf :cayenne-wocompat-unpublished
Build step 'Invoke top-level Maven targets' marked build as failure

Mime
View raw message