cayenne-commits mailing list archives

Site index · List index
Message view « Date » · « Thread »
Top « Date » · « Thread »
From Apache Jenkins Server <jenk...@builds.apache.org>
Subject Build failed in Jenkins: Cayenne-31 » HSQLDB,JDK 1.5 (latest),Ubuntu #44
Date Fri, 11 Jan 2013 11:54:03 GMT
See <https://builds.apache.org/job/Cayenne-31/./cayenneTestConnection=HSQLDB,jdk=JDK%201.5%20(latest),label=Ubuntu/44/changes>

Changes:

[aadamchik] ew PK generator is no longer guaranteed sequential, so changing to
more deterministic ordering

------------------------------------------
[...truncated 12757 lines...]
793/1292 KB   
797/1292 KB   
801/1292 KB   
805/1292 KB   
809/1292 KB   
813/1292 KB   
817/1292 KB   
821/1292 KB   
825/1292 KB   
829/1292 KB   
833/1292 KB   
837/1292 KB   
841/1292 KB   
845/1292 KB   
849/1292 KB   
853/1292 KB   
857/1292 KB   
861/1292 KB   
865/1292 KB   
869/1292 KB   
873/1292 KB   
877/1292 KB   
881/1292 KB   
884/1292 KB   
887/1292 KB   
891/1292 KB   
895/1292 KB   
899/1292 KB   
903/1292 KB   
905/1292 KB   
909/1292 KB   
913/1292 KB   
917/1292 KB   
921/1292 KB   
925/1292 KB   
929/1292 KB   
933/1292 KB   
937/1292 KB   
941/1292 KB   
945/1292 KB   
949/1292 KB   
953/1292 KB   
957/1292 KB   
961/1292 KB   
965/1292 KB   
969/1292 KB   
970/1292 KB   
974/1292 KB   
978/1292 KB   
982/1292 KB   
986/1292 KB   
990/1292 KB   
993/1292 KB   
997/1292 KB   
1001/1292 KB   
1005/1292 KB   
1009/1292 KB   
1013/1292 KB   
1017/1292 KB   
1021/1292 KB   
1025/1292 KB   
1029/1292 KB   
1033/1292 KB   
1037/1292 KB   
1041/1292 KB   
1045/1292 KB   
1049/1292 KB   
1053/1292 KB   
1057/1292 KB   
1061/1292 KB   
1065/1292 KB   
1069/1292 KB   
1073/1292 KB   
1075/1292 KB   
1079/1292 KB   
1083/1292 KB   
1087/1292 KB   
1091/1292 KB   
1095/1292 KB   
1096/1292 KB   
1097/1292 KB   
1101/1292 KB   
1105/1292 KB   
1109/1292 KB   
1113/1292 KB   
1117/1292 KB   
1121/1292 KB   
1125/1292 KB   
1129/1292 KB   
1133/1292 KB   
1137/1292 KB   
1141/1292 KB   
1145/1292 KB   
1149/1292 KB   
1153/1292 KB   
1157/1292 KB   
1160/1292 KB   
1164/1292 KB   
1168/1292 KB   
1172/1292 KB   
1176/1292 KB   
1180/1292 KB   
1184/1292 KB   
1188/1292 KB   
1188/1292 KB   
1192/1292 KB   
1196/1292 KB   
1200/1292 KB   
1204/1292 KB   
1208/1292 KB   
1212/1292 KB   
1216/1292 KB   
1220/1292 KB   
1224/1292 KB   
1228/1292 KB   
1232/1292 KB   
1236/1292 KB   
1240/1292 KB   
1244/1292 KB   
1248/1292 KB   
1252/1292 KB   
1256/1292 KB   
1260/1292 KB   
1261/1292 KB   
1264/1292 KB   
1268/1292 KB   
1272/1292 KB   
1276/1292 KB   
1280/1292 KB   
1284/1292 KB   
1288/1292 KB   
1292/1292 KB   
1292/1292 KB   
               
Downloaded: http://maven.objectstyle.org/nexus/content/groups/cayenne-deps/org/apache/ant/ant/1.7.1/ant-1.7.1.jar
(1292 KB at 853.4 KB/sec)
[INFO] Executing tasks
[INFO] Executed tasks
[INFO] 
[INFO] --- maven-resources-plugin:2.4.3:resources (default-resources) @ cayenne-jdk1.5-unpublished
---
[INFO] Using 'UTF-8' encoding to copy filtered resources.
[INFO] Copying 17 resources
[INFO] 
[INFO] --- maven-compiler-plugin:2.3.2:compile (default-compile) @ cayenne-jdk1.5-unpublished
---
[WARNING] File encoding has not been set, using platform encoding ANSI_X3.4-1968, i.e. build
is platform dependent!
[INFO] Compiling 940 source files to <https://builds.apache.org/job/Cayenne-31/./cayenneTestConnection=HSQLDB,jdk=JDK%201.5%20(latest),label=Ubuntu/ws/stable/framework/cayenne-jdk1.5-unpublished/target/classes>
[INFO] 
[INFO] --- maven-resources-plugin:2.4.3:testResources (default-testResources) @ cayenne-jdk1.5-unpublished
---
[INFO] Using 'UTF-8' encoding to copy filtered resources.
[INFO] Copying 96 resources
[INFO] 
[INFO] --- maven-compiler-plugin:2.3.2:testCompile (default-testCompile) @ cayenne-jdk1.5-unpublished
---
[WARNING] File encoding has not been set, using platform encoding ANSI_X3.4-1968, i.e. build
is platform dependent!
[INFO] Compiling 955 source files to <https://builds.apache.org/job/Cayenne-31/./cayenneTestConnection=HSQLDB,jdk=JDK%201.5%20(latest),label=Ubuntu/ws/stable/framework/cayenne-jdk1.5-unpublished/target/test-classes>
[INFO] -------------------------------------------------------------
[ERROR] COMPILATION ERROR : 
[INFO] -------------------------------------------------------------
[ERROR] <https://builds.apache.org/job/Cayenne-31/./cayenneTestConnection=HSQLDB,jdk=JDK%201.5%20(latest),label=Ubuntu/ws/stable/framework/cayenne-jdk1.5-unpublished/src/test/java/org/apache/cayenne/access/SimpleIdIncrementalFaultListTest.java>:[169,19]
type org.apache.cayenne.query.SelectQuery does not take parameters
[ERROR] <https://builds.apache.org/job/Cayenne-31/./cayenneTestConnection=HSQLDB,jdk=JDK%201.5%20(latest),label=Ubuntu/ws/stable/framework/cayenne-jdk1.5-unpublished/src/test/java/org/apache/cayenne/access/SimpleIdIncrementalFaultListTest.java>:[169,47]
type org.apache.cayenne.query.SelectQuery does not take parameters
[ERROR] <https://builds.apache.org/job/Cayenne-31/./cayenneTestConnection=HSQLDB,jdk=JDK%201.5%20(latest),label=Ubuntu/ws/stable/framework/cayenne-jdk1.5-unpublished/src/test/java/org/apache/cayenne/access/SimpleIdIncrementalFaultListTest.java>:[171,28]
cannot find symbol
symbol  : variable ARTIST_NAME
location: class org.apache.cayenne.testdo.testmap.Artist
[INFO] 3 errors 
[INFO] -------------------------------------------------------------
[INFO] ------------------------------------------------------------------------
[INFO] Reactor Summary:
[INFO] 
[INFO] Cayenne ........................................... SUCCESS [11.041s]
[INFO] Common Unit Test Utilities ........................ SUCCESS [36.390s]
[INFO] Cayenne Internal Build Plugin ..................... SUCCESS [46.319s]
[INFO] Cayenne Build Tools Parent ........................ SUCCESS [0.005s]
[INFO] Cayenne License and Notice Bundle ................. SUCCESS [7.678s]
[INFO] Cayenne Dependency Injection Container ............ SUCCESS [3.116s]
[INFO] Cayenne Java 1.5 Unpublished ...................... FAILURE [42.005s]
[INFO] Cayenne WebObjects Compatibility Library .......... SKIPPED
[INFO] Cayenne Aggregated Server Jar ..................... SKIPPED
[INFO] Cayenne Aggregated Client Jar ..................... SKIPPED
[INFO] Cayenne Project ................................... SKIPPED
[INFO] Cayenne Tools ..................................... SKIPPED
[INFO] Library: cayenne-lifecycle ........................ SKIPPED
[INFO] Cayenne Maven Plugin .............................. SKIPPED
[INFO] Cayenne Framework Aggregator Project .............. SKIPPED
[INFO] Cayenne Integration Tests Parent .................. SKIPPED
[INFO] Integration Tests - Cayenne Runtime ............... SKIPPED
[INFO] Integration Tests - Cayenne Tools ................. SKIPPED
[INFO] Cayenne Modeler ................................... SKIPPED
[INFO] Cayenne Modeler Maven Plugin ...................... SKIPPED
[INFO] Cayenne Modeler Parent ............................ SKIPPED
[INFO] Cayenne Tutorial .................................. SKIPPED
[INFO] Cayenne ROP Server Tutorial ....................... SKIPPED
[INFO] Cayenne ROP Client Tutorial ....................... SKIPPED
[INFO] Cayenne Tutorials ................................. SKIPPED
[INFO] Cayenne Documentation ............................. SKIPPED
[INFO] Cayenne Documenation Parent ....................... SKIPPED
[INFO] Cayenne Docbook Documentation ..................... SKIPPED
[INFO] Docbook: Cayenne Stylesheets ...................... SKIPPED
[INFO] Docbook: Cayenne Guide ............................ SKIPPED
[INFO] Docbook: Getting Started with Cayenne ............. SKIPPED
[INFO] Docbook: Getting Started with Cayenne ROP ......... SKIPPED
[INFO] Docbook: Cayenne New Features and Upgrade Guide ... SKIPPED
[INFO] ------------------------------------------------------------------------
[INFO] BUILD FAILURE
[INFO] ------------------------------------------------------------------------
[INFO] Total time: 2:34.898s
[INFO] Finished at: Fri Jan 11 11:54:03 UTC 2013
[INFO] Final Memory: 25M/115M
[INFO] ------------------------------------------------------------------------
[ERROR] Failed to execute goal org.apache.maven.plugins:maven-compiler-plugin:2.3.2:testCompile
(default-testCompile) on project cayenne-jdk1.5-unpublished: Compilation failure: Compilation
failure:
[ERROR] <https://builds.apache.org/job/Cayenne-31/./cayenneTestConnection=HSQLDB,jdk=JDK%201.5%20(latest),label=Ubuntu/ws/stable/framework/cayenne-jdk1.5-unpublished/src/test/java/org/apache/cayenne/access/SimpleIdIncrementalFaultListTest.java>:[169,19]
type org.apache.cayenne.query.SelectQuery does not take parameters
[ERROR] <https://builds.apache.org/job/Cayenne-31/./cayenneTestConnection=HSQLDB,jdk=JDK%201.5%20(latest),label=Ubuntu/ws/stable/framework/cayenne-jdk1.5-unpublished/src/test/java/org/apache/cayenne/access/SimpleIdIncrementalFaultListTest.java>:[169,47]
type org.apache.cayenne.query.SelectQuery does not take parameters
[ERROR] <https://builds.apache.org/job/Cayenne-31/./cayenneTestConnection=HSQLDB,jdk=JDK%201.5%20(latest),label=Ubuntu/ws/stable/framework/cayenne-jdk1.5-unpublished/src/test/java/org/apache/cayenne/access/SimpleIdIncrementalFaultListTest.java>:[171,28]
cannot find symbol
[ERROR] symbol  : variable ARTIST_NAME
[ERROR] location: class org.apache.cayenne.testdo.testmap.Artist
[ERROR] -> [Help 1]
org.apache.maven.lifecycle.LifecycleExecutionException: Failed to execute goal org.apache.maven.plugins:maven-compiler-plugin:2.3.2:testCompile
(default-testCompile) on project cayenne-jdk1.5-unpublished: Compilation failure
	at org.apache.maven.lifecycle.internal.MojoExecutor.execute(MojoExecutor.java:213)
	at org.apache.maven.lifecycle.internal.MojoExecutor.execute(MojoExecutor.java:153)
	at org.apache.maven.lifecycle.internal.MojoExecutor.execute(MojoExecutor.java:145)
	at org.apache.maven.lifecycle.internal.LifecycleModuleBuilder.buildProject(LifecycleModuleBuilder.java:84)
	at org.apache.maven.lifecycle.internal.LifecycleModuleBuilder.buildProject(LifecycleModuleBuilder.java:59)
	at org.apache.maven.lifecycle.internal.LifecycleStarter.singleThreadedBuild(LifecycleStarter.java:183)
	at org.apache.maven.lifecycle.internal.LifecycleStarter.execute(LifecycleStarter.java:161)
	at org.apache.maven.DefaultMaven.doExecute(DefaultMaven.java:320)
	at org.apache.maven.DefaultMaven.execute(DefaultMaven.java:156)
	at org.apache.maven.cli.MavenCli.execute(MavenCli.java:537)
	at org.apache.maven.cli.MavenCli.doMain(MavenCli.java:196)
	at org.apache.maven.cli.MavenCli.main(MavenCli.java:141)
	at sun.reflect.NativeMethodAccessorImpl.invoke0(Native Method)
	at sun.reflect.NativeMethodAccessorImpl.invoke(NativeMethodAccessorImpl.java:39)
	at sun.reflect.DelegatingMethodAccessorImpl.invoke(DelegatingMethodAccessorImpl.java:25)
	at java.lang.reflect.Method.invoke(Method.java:592)
	at org.codehaus.plexus.classworlds.launcher.Launcher.launchEnhanced(Launcher.java:290)
	at org.codehaus.plexus.classworlds.launcher.Launcher.launch(Launcher.java:230)
	at org.codehaus.plexus.classworlds.launcher.Launcher.mainWithExitCode(Launcher.java:409)
	at org.codehaus.plexus.classworlds.launcher.Launcher.main(Launcher.java:352)
Caused by: org.apache.maven.plugin.CompilationFailureException: Compilation failure
	at org.apache.maven.plugin.AbstractCompilerMojo.execute(AbstractCompilerMojo.java:656)
	at org.apache.maven.plugin.TestCompilerMojo.execute(TestCompilerMojo.java:161)
	at org.apache.maven.plugin.DefaultBuildPluginManager.executeMojo(DefaultBuildPluginManager.java:101)
	at org.apache.maven.lifecycle.internal.MojoExecutor.execute(MojoExecutor.java:209)
	... 19 more
[ERROR] 
[ERROR] Re-run Maven using the -X switch to enable full debug logging.
[ERROR] 
[ERROR] For more information about the errors and possible solutions, please read the following
articles:
[ERROR] [Help 1] http://cwiki.apache.org/confluence/display/MAVEN/MojoFailureException
[ERROR] 
[ERROR] After correcting the problems, you can resume the build with the command
[ERROR]   mvn <goals> -rf :cayenne-jdk1.5-unpublished
Build step 'Invoke top-level Maven targets' marked build as failure

Mime
View raw message