cayenne-commits mailing list archives

Site index · List index
Message view « Date » · « Thread »
Top « Date » · « Thread »
From Apache Jenkins Server <jenk...@builds.apache.org>
Subject Build failed in Jenkins: Cayenne-trunk » h2,JDK 1.7 (latest),Ubuntu #824
Date Sat, 15 Dec 2012 15:05:10 GMT
See <https://builds.apache.org/job/Cayenne-trunk/./cayenneTestConnection=h2,jdk=JDK%201.7%20(latest),label=Ubuntu/824/changes>

Changes:

[johnthuss] Fix tutorial build

------------------------------------------
[...truncated 137653 lines...]
33 KB   49 KB   84 KB   100 KB   
33 KB   49 KB   88 KB   100 KB   
33 KB   49 KB   92 KB   100 KB   
33 KB   49 KB   96 KB   100 KB   
33 KB   49 KB   100 KB   100 KB   
33 KB   49 KB   102 KB   100 KB   
33 KB   50 KB   102 KB   100 KB   
                                  
Downloaded: http://repo1.maven.org/maven2/org/apache/maven/shared/maven-filtering/1.0-beta-2/maven-filtering-1.0-beta-2.jar
(33 KB at 1200.1 KB/sec)
50 KB   102 KB   104 KB           
50 KB   102 KB   106 KB   
50 KB   102 KB   110 KB   
50 KB   102 KB   114 KB   
50 KB   102 KB   118 KB   
50 KB   106 KB   118 KB   
50 KB   106 KB   122 KB   
50 KB   110 KB   122 KB   
50 KB   110 KB   122 KB   
50 KB   110 KB   126 KB   
50 KB   111 KB   126 KB   
50 KB   111 KB   130 KB   
50 KB   114 KB   130 KB   
50 KB   114 KB   134 KB   
50 KB   116 KB   134 KB   
50 KB   116 KB   138 KB   
50 KB   116 KB   140 KB   
50 KB   120 KB   140 KB   
50 KB   124 KB   140 KB   
50 KB   128 KB   140 KB   
50 KB   132 KB   140 KB   
50 KB   136 KB   140 KB   
50 KB   140 KB   140 KB   
50 KB   144 KB   140 KB   
50 KB   148 KB   140 KB   
50 KB   149 KB   140 KB   
                          
Downloaded: http://repo1.maven.org/maven2/org/codehaus/plexus/plexus-io/1.0.1/plexus-io-1.0.1.jar
(50 KB at 1419.3 KB/sec)
149 KB   144 KB           
149 KB   147 KB   
149 KB   151 KB   
149 KB   155 KB   
153 KB   155 KB   
153 KB   159 KB   
153 KB   159 KB   
153 KB   163 KB   
157 KB   163 KB   
161 KB   163 KB   
161 KB   167 KB   
161 KB   167 KB   
161 KB   171 KB   
165 KB   171 KB   
169 KB   171 KB   
169 KB   175 KB   
171 KB   175 KB   
171 KB   178 KB   
174 KB   178 KB   
178 KB   178 KB   
180 KB   178 KB   
184 KB   178 KB   
188 KB   178 KB   
192 KB   178 KB   
196 KB   178 KB   
200 KB   178 KB   
204 KB   178 KB   
208 KB   178 KB   
208 KB   178 KB   
211 KB   178 KB   
215 KB   178 KB   
219 KB   178 KB   
223 KB   178 KB   
226 KB   178 KB   
230 KB   178 KB   
234 KB   178 KB   
238 KB   178 KB   
238 KB   178 KB   
242 KB   178 KB   
243 KB   178 KB   
247 KB   178 KB   
251 KB   178 KB   
255 KB   178 KB   
259 KB   178 KB   
263 KB   178 KB   
267 KB   178 KB   
271 KB   178 KB   
275 KB   178 KB   
279 KB   178 KB   
283 KB   178 KB   
284 KB   178 KB   
                  
Downloaded: http://repo1.maven.org/maven2/org/codehaus/plexus/plexus-archiver/1.2/plexus-archiver-1.2.jar
(178 KB at 3778.3 KB/sec)
288 KB            
292 KB   
296 KB   
300 KB   
304 KB   
308 KB   
311 KB   
315 KB   
319 KB   
320 KB   
324 KB   
327 KB   
331 KB   
335 KB   
339 KB   
343 KB   
347 KB   
351 KB   
355 KB   
359 KB   
363 KB   
367 KB   
371 KB   
372 KB   
375 KB   
379 KB   
383 KB   
387 KB   
391 KB   
395 KB   
399 KB   
403 KB   
407 KB   
411 KB   
415 KB   
419 KB   
422 KB   
         
Downloaded: http://repo1.maven.org/maven2/com/thoughtworks/xstream/xstream/1.3.1/xstream-1.3.1.jar
(422 KB at 6481.5 KB/sec)
[INFO] Packaging webapp
[INFO] Assembling webapp [tutorial-rop-server] in [/x1/jenkins/jenkins-slave/workspace/Cayenne-trunk/cayenneTestConnection/h2/jdk/JDK
1.7 (latest)/label/Ubuntu/trunk/tutorials/tutorial-rop-server/target/tutorial-rop-server-3.2M1-SNAPSHOT]
[INFO] Processing war project
[INFO] Copying webapp resources [/x1/jenkins/jenkins-slave/workspace/Cayenne-trunk/cayenneTestConnection/h2/jdk/JDK
1.7 (latest)/label/Ubuntu/trunk/tutorials/tutorial-rop-server/src/main/webapp]
[INFO] Webapp assembled in [65 msecs]
[INFO] Building war: /x1/jenkins/jenkins-slave/workspace/Cayenne-trunk/cayenneTestConnection/h2/jdk/JDK
1.7 (latest)/label/Ubuntu/trunk/tutorials/tutorial-rop-server/target/tutorial-rop-server-3.2M1-SNAPSHOT.war
[INFO] WEB-INF/web.xml already added, skipping
[INFO] 
[INFO] --- maven-install-plugin:2.3.1:install (default-install) @ tutorial-rop-server ---
[INFO] Installing /x1/jenkins/jenkins-slave/workspace/Cayenne-trunk/cayenneTestConnection/h2/jdk/JDK
1.7 (latest)/label/Ubuntu/trunk/tutorials/tutorial-rop-server/target/tutorial-rop-server-3.2M1-SNAPSHOT.war
to <https://builds.apache.org/job/Cayenne-trunk/./cayenneTestConnection=h2,jdk=JDK%201.7%20(latest),label=Ubuntu/ws/.repository/org/apache/cayenne/tutorial-rop-server/3.2M1-SNAPSHOT/tutorial-rop-server-3.2M1-SNAPSHOT.war>
[INFO] Installing /x1/jenkins/jenkins-slave/workspace/Cayenne-trunk/cayenneTestConnection/h2/jdk/JDK
1.7 (latest)/label/Ubuntu/trunk/tutorials/tutorial-rop-server/pom.xml to <https://builds.apache.org/job/Cayenne-trunk/./cayenneTestConnection=h2,jdk=JDK%201.7%20(latest),label=Ubuntu/ws/.repository/org/apache/cayenne/tutorial-rop-server/3.2M1-SNAPSHOT/tutorial-rop-server-3.2M1-SNAPSHOT.pom>
[INFO]                                                                         
[INFO] ------------------------------------------------------------------------
[INFO] Building Cayenne ROP Client Tutorial 3.2M1-SNAPSHOT
[INFO] ------------------------------------------------------------------------
[INFO] 
[INFO] --- maven-clean-plugin:2.4.1:clean (default-clean) @ tutorial-rop-client ---
[INFO] 
[INFO] --- maven-resources-plugin:2.4.3:resources (default-resources) @ tutorial-rop-client
---
[WARNING] Using platform encoding (ANSI_X3.4-1968 actually) to copy filtered resources, i.e.
build is platform dependent!
[INFO] Copying 1 resource
[INFO] 
[INFO] --- maven-compiler-plugin:2.3.2:compile (default-compile) @ tutorial-rop-client ---
[WARNING] File encoding has not been set, using platform encoding ANSI_X3.4-1968, i.e. build
is platform dependent!
[INFO] Compiling 9 source files to /x1/jenkins/jenkins-slave/workspace/Cayenne-trunk/cayenneTestConnection/h2/jdk/JDK
1.7 (latest)/label/Ubuntu/trunk/tutorials/tutorial-rop-client/target/classes
[INFO] -------------------------------------------------------------
[ERROR] COMPILATION ERROR : 
[INFO] -------------------------------------------------------------
[ERROR] /x1/jenkins/jenkins-slave/workspace/Cayenne-trunk/cayenneTestConnection/h2/jdk/JDK
1.7 (latest)/label/Ubuntu/trunk/tutorials/tutorial-rop-client/src/main/java/org/apache/cayenne/tutorial/persistent/client/Main.java:[81,45]
error: cannot find symbol
[ERROR]  class SelectQuery
/x1/jenkins/jenkins-slave/workspace/Cayenne-trunk/cayenneTestConnection/h2/jdk/JDK 1.7 (latest)/label/Ubuntu/trunk/tutorials/tutorial-rop-client/src/main/java/org/apache/cayenne/tutorial/persistent/client/Main.java:[86,45]
error: cannot find symbol
[ERROR]  class SelectQuery
/x1/jenkins/jenkins-slave/workspace/Cayenne-trunk/cayenneTestConnection/h2/jdk/JDK 1.7 (latest)/label/Ubuntu/trunk/tutorials/tutorial-rop-client/src/main/java/org/apache/cayenne/tutorial/persistent/client/Main.java:[94,50]
error: cannot find symbol
[INFO] 3 errors 
[INFO] -------------------------------------------------------------
[INFO] ------------------------------------------------------------------------
[INFO] Reactor Summary:
[INFO] 
[INFO] Cayenne ........................................... SUCCESS [12.423s]
[INFO] Common Unit Test Utilities ........................ SUCCESS [32.757s]
[INFO] Cayenne Internal Build Plugin ..................... SUCCESS [37.613s]
[INFO] Cayenne Build Tools Parent ........................ SUCCESS [0.004s]
[INFO] Cayenne License and Notice Bundle ................. SUCCESS [8.144s]
[INFO] Cayenne Dependency Injection Container ............ SUCCESS [2.779s]
[INFO] Cayenne Java 1.5 Unpublished ...................... SUCCESS [1:38.112s]
[INFO] Cayenne WebObjects Compatibility Library .......... SUCCESS [2.016s]
[INFO] Cayenne Aggregated Server Jar ..................... SUCCESS [1.647s]
[INFO] Cayenne Aggregated Client Jar ..................... SUCCESS [1.170s]
[INFO] Cayenne Project ................................... SUCCESS [2.015s]
[INFO] Cayenne Tools ..................................... SUCCESS [16.773s]
[INFO] Library: cayenne-lifecycle ........................ SUCCESS [3.165s]
[INFO] Cayenne Maven Plugin .............................. SUCCESS [10.053s]
[INFO] Cayenne Framework Aggregator Project .............. SUCCESS [0.003s]
[INFO] Cayenne Integration Tests Parent .................. SUCCESS [0.005s]
[INFO] Integration Tests - Cayenne Runtime ............... SUCCESS [1.502s]
[INFO] Integration Tests - Cayenne Tools ................. SUCCESS [1.535s]
[INFO] Cayenne Modeler ................................... SUCCESS [10.441s]
[INFO] Cayenne Modeler Maven Plugin ...................... SUCCESS [0.380s]
[INFO] Cayenne Modeler Parent ............................ SUCCESS [0.003s]
[INFO] Cayenne Tutorial .................................. SUCCESS [2.509s]
[INFO] Cayenne ROP Server Tutorial ....................... SUCCESS [1.781s]
[INFO] Cayenne ROP Client Tutorial ....................... FAILURE [0.322s]
[INFO] Cayenne Tutorials ................................. SKIPPED
[INFO] Cayenne Documentation ............................. SKIPPED
[INFO] Cayenne Documenation Parent ....................... SKIPPED
[INFO] Cayenne Docbook Documentation ..................... SKIPPED
[INFO] Docbook: Cayenne Guide ............................ SKIPPED
[INFO] Docbook: Getting Started with Cayenne ............. SKIPPED
[INFO] Docbook: Getting Started with Cayenne ROP ......... SKIPPED
[INFO] Docbook: Cayenne New Features and Upgrade Guide ... SKIPPED
[INFO] ------------------------------------------------------------------------
[INFO] BUILD FAILURE
[INFO] ------------------------------------------------------------------------
[INFO] Total time: 4:15.286s
[INFO] Finished at: Sat Dec 15 15:05:09 UTC 2012
[INFO] Final Memory: 128M/370M
[INFO] ------------------------------------------------------------------------
[ERROR] Failed to execute goal org.apache.maven.plugins:maven-compiler-plugin:2.3.2:compile
(default-compile) on project tutorial-rop-client: Compilation failure: Compilation failure:
[ERROR] /x1/jenkins/jenkins-slave/workspace/Cayenne-trunk/cayenneTestConnection/h2/jdk/JDK
1.7 (latest)/label/Ubuntu/trunk/tutorials/tutorial-rop-client/src/main/java/org/apache/cayenne/tutorial/persistent/client/Main.java:[81,45]
error: cannot find symbol
[ERROR] class SelectQuery
[ERROR] /x1/jenkins/jenkins-slave/workspace/Cayenne-trunk/cayenneTestConnection/h2/jdk/JDK
1.7 (latest)/label/Ubuntu/trunk/tutorials/tutorial-rop-client/src/main/java/org/apache/cayenne/tutorial/persistent/client/Main.java:[86,45]
error: cannot find symbol
[ERROR] class SelectQuery
[ERROR] /x1/jenkins/jenkins-slave/workspace/Cayenne-trunk/cayenneTestConnection/h2/jdk/JDK
1.7 (latest)/label/Ubuntu/trunk/tutorials/tutorial-rop-client/src/main/java/org/apache/cayenne/tutorial/persistent/client/Main.java:[94,50]
error: cannot find symbol
[ERROR] -> [Help 1]
org.apache.maven.lifecycle.LifecycleExecutionException: Failed to execute goal org.apache.maven.plugins:maven-compiler-plugin:2.3.2:compile
(default-compile) on project tutorial-rop-client: Compilation failure
	at org.apache.maven.lifecycle.internal.MojoExecutor.execute(MojoExecutor.java:213)
	at org.apache.maven.lifecycle.internal.MojoExecutor.execute(MojoExecutor.java:153)
	at org.apache.maven.lifecycle.internal.MojoExecutor.execute(MojoExecutor.java:145)
	at org.apache.maven.lifecycle.internal.LifecycleModuleBuilder.buildProject(LifecycleModuleBuilder.java:84)
	at org.apache.maven.lifecycle.internal.LifecycleModuleBuilder.buildProject(LifecycleModuleBuilder.java:59)
	at org.apache.maven.lifecycle.internal.LifecycleStarter.singleThreadedBuild(LifecycleStarter.java:183)
	at org.apache.maven.lifecycle.internal.LifecycleStarter.execute(LifecycleStarter.java:161)
	at org.apache.maven.DefaultMaven.doExecute(DefaultMaven.java:319)
	at org.apache.maven.DefaultMaven.execute(DefaultMaven.java:156)
	at org.apache.maven.cli.MavenCli.execute(MavenCli.java:537)
	at org.apache.maven.cli.MavenCli.doMain(MavenCli.java:196)
	at org.apache.maven.cli.MavenCli.main(MavenCli.java:141)
	at sun.reflect.NativeMethodAccessorImpl.invoke0(Native Method)
	at sun.reflect.NativeMethodAccessorImpl.invoke(NativeMethodAccessorImpl.java:57)
	at sun.reflect.DelegatingMethodAccessorImpl.invoke(DelegatingMethodAccessorImpl.java:43)
	at java.lang.reflect.Method.invoke(Method.java:601)
	at org.codehaus.plexus.classworlds.launcher.Launcher.launchEnhanced(Launcher.java:290)
	at org.codehaus.plexus.classworlds.launcher.Launcher.launch(Launcher.java:230)
	at org.codehaus.plexus.classworlds.launcher.Launcher.mainWithExitCode(Launcher.java:409)
	at org.codehaus.plexus.classworlds.launcher.Launcher.main(Launcher.java:352)
Caused by: org.apache.maven.plugin.CompilationFailureException: Compilation failure
	at org.apache.maven.plugin.AbstractCompilerMojo.execute(AbstractCompilerMojo.java:656)
	at org.apache.maven.plugin.CompilerMojo.execute(CompilerMojo.java:128)
	at org.apache.maven.plugin.DefaultBuildPluginManager.executeMojo(DefaultBuildPluginManager.java:101)
	at org.apache.maven.lifecycle.internal.MojoExecutor.execute(MojoExecutor.java:209)
	... 19 more
[ERROR] 
[ERROR] Re-run Maven using the -X switch to enable full debug logging.
[ERROR] 
[ERROR] For more information about the errors and possible solutions, please read the following
articles:
[ERROR] [Help 1] http://cwiki.apache.org/confluence/display/MAVEN/MojoFailureException
[ERROR] 
[ERROR] After correcting the problems, you can resume the build with the command
[ERROR]   mvn <goals> -rf :tutorial-rop-client
Build step 'Invoke top-level Maven targets' marked build as failure

Mime
View raw message