cayenne-commits mailing list archives

Site index · List index
Message view « Date » · « Thread »
Top « Date » · « Thread »
From Apache Jenkins Server <jenk...@builds.apache.org>
Subject Build failed in Jenkins: Cayenne-trunk » h2,JDK 1.5 (latest),Ubuntu #824
Date Sat, 15 Dec 2012 15:00:20 GMT
See <https://builds.apache.org/job/Cayenne-trunk/./cayenneTestConnection=h2,jdk=JDK%201.5%20(latest),label=Ubuntu/824/changes>

Changes:

[johnthuss] Fix tutorial build

------------------------------------------
[...truncated 123120 lines...]
[INFO] --- maven-clean-plugin:2.4.1:clean (default-clean) @ maven-cayenne-modeler-plugin ---
[INFO] 
[INFO] --- maven-plugin-plugin:2.7:descriptor (default-descriptor) @ maven-cayenne-modeler-plugin
---
[WARNING] Using platform encoding (ANSI_X3.4-1968 actually) to read mojo metadata, i.e. build
is platform dependent!
[INFO] Applying mojo extractor for language: java
[INFO] Mojo extractor for language: java found 1 mojo descriptors.
[INFO] Applying mojo extractor for language: bsh
[INFO] Mojo extractor for language: bsh found 0 mojo descriptors.
[INFO] 
[INFO] --- maven-resources-plugin:2.4.3:resources (default-resources) @ maven-cayenne-modeler-plugin
---
[INFO] Using 'UTF-8' encoding to copy filtered resources.
[INFO] skip non existing resourceDirectory <https://builds.apache.org/job/Cayenne-trunk/./cayenneTestConnection=h2,jdk=JDK%201.5%20(latest),label=Ubuntu/ws/trunk/modeler/maven-cayenne-modeler-plugin/src/main/resources>
[INFO] 
[INFO] --- maven-compiler-plugin:2.3.2:compile (default-compile) @ maven-cayenne-modeler-plugin
---
[WARNING] File encoding has not been set, using platform encoding ANSI_X3.4-1968, i.e. build
is platform dependent!
[INFO] Compiling 1 source file to <https://builds.apache.org/job/Cayenne-trunk/./cayenneTestConnection=h2,jdk=JDK%201.5%20(latest),label=Ubuntu/ws/trunk/modeler/maven-cayenne-modeler-plugin/target/classes>
[INFO] 
[INFO] --- maven-resources-plugin:2.4.3:testResources (default-testResources) @ maven-cayenne-modeler-plugin
---
[INFO] Using 'UTF-8' encoding to copy filtered resources.
[INFO] skip non existing resourceDirectory <https://builds.apache.org/job/Cayenne-trunk/./cayenneTestConnection=h2,jdk=JDK%201.5%20(latest),label=Ubuntu/ws/trunk/modeler/maven-cayenne-modeler-plugin/src/test/resources>
[INFO] 
[INFO] --- maven-compiler-plugin:2.3.2:testCompile (default-testCompile) @ maven-cayenne-modeler-plugin
---
[INFO] No sources to compile
[INFO] 
[INFO] --- maven-surefire-plugin:2.5:test (default-test) @ maven-cayenne-modeler-plugin ---
[INFO] No tests to run.
[INFO] 
[INFO] --- maven-jar-plugin:2.3.1:jar (default-jar) @ maven-cayenne-modeler-plugin ---
[INFO] Building jar: <https://builds.apache.org/job/Cayenne-trunk/./cayenneTestConnection=h2,jdk=JDK%201.5%20(latest),label=Ubuntu/ws/trunk/modeler/maven-cayenne-modeler-plugin/target/maven-cayenne-modeler-plugin-3.2M1-SNAPSHOT.jar>
[INFO] 
[INFO] --- maven-plugin-plugin:2.7:addPluginArtifactMetadata (default-addPluginArtifactMetadata)
@ maven-cayenne-modeler-plugin ---
[INFO] 
[INFO] --- maven-install-plugin:2.3.1:install (default-install) @ maven-cayenne-modeler-plugin
---
[INFO] Installing <https://builds.apache.org/job/Cayenne-trunk/./cayenneTestConnection=h2,jdk=JDK%201.5%20(latest),label=Ubuntu/ws/trunk/modeler/maven-cayenne-modeler-plugin/target/maven-cayenne-modeler-plugin-3.2M1-SNAPSHOT.jar>
to <https://builds.apache.org/job/Cayenne-trunk/./cayenneTestConnection=h2,jdk=JDK%201.5%20(latest),label=Ubuntu/ws/.repository/org/apache/cayenne/plugins/maven-cayenne-modeler-plugin/3.2M1-SNAPSHOT/maven-cayenne-modeler-plugin-3.2M1-SNAPSHOT.jar>
[INFO] Installing <https://builds.apache.org/job/Cayenne-trunk/./cayenneTestConnection=h2,jdk=JDK%201.5%20(latest),label=Ubuntu/ws/trunk/modeler/maven-cayenne-modeler-plugin/pom.xml>
to <https://builds.apache.org/job/Cayenne-trunk/./cayenneTestConnection=h2,jdk=JDK%201.5%20(latest),label=Ubuntu/ws/.repository/org/apache/cayenne/plugins/maven-cayenne-modeler-plugin/3.2M1-SNAPSHOT/maven-cayenne-modeler-plugin-3.2M1-SNAPSHOT.pom>
[INFO]                                                                         
[INFO] ------------------------------------------------------------------------
[INFO] Building Cayenne Modeler Parent 3.2M1-SNAPSHOT
[INFO] ------------------------------------------------------------------------
[INFO] 
[INFO] --- maven-clean-plugin:2.4.1:clean (default-clean) @ cayenne-modeler-parent ---
[INFO] 
[INFO] --- maven-install-plugin:2.3.1:install (default-install) @ cayenne-modeler-parent ---
[INFO] Installing <https://builds.apache.org/job/Cayenne-trunk/./cayenneTestConnection=h2,jdk=JDK%201.5%20(latest),label=Ubuntu/ws/trunk/modeler/pom.xml>
to <https://builds.apache.org/job/Cayenne-trunk/./cayenneTestConnection=h2,jdk=JDK%201.5%20(latest),label=Ubuntu/ws/.repository/org/apache/cayenne/parents/cayenne-modeler-parent/3.2M1-SNAPSHOT/cayenne-modeler-parent-3.2M1-SNAPSHOT.pom>
[INFO]                                                                         
[INFO] ------------------------------------------------------------------------
[INFO] Building Cayenne Tutorial 3.2M1-SNAPSHOT
[INFO] ------------------------------------------------------------------------
[INFO] 
[INFO] --- maven-clean-plugin:2.4.1:clean (default-clean) @ tutorial ---
[INFO] 
[INFO] --- maven-resources-plugin:2.4.3:resources (default-resources) @ tutorial ---
[WARNING] Using platform encoding (ANSI_X3.4-1968 actually) to copy filtered resources, i.e.
build is platform dependent!
[INFO] Copying 2 resources
[INFO] 
[INFO] --- maven-compiler-plugin:2.3.2:compile (default-compile) @ tutorial ---
[WARNING] File encoding has not been set, using platform encoding ANSI_X3.4-1968, i.e. build
is platform dependent!
[INFO] Compiling 9 source files to <https://builds.apache.org/job/Cayenne-trunk/./cayenneTestConnection=h2,jdk=JDK%201.5%20(latest),label=Ubuntu/ws/trunk/tutorials/tutorial/target/classes>
[INFO] 
[INFO] --- maven-resources-plugin:2.4.3:testResources (default-testResources) @ tutorial ---
[WARNING] Using platform encoding (ANSI_X3.4-1968 actually) to copy filtered resources, i.e.
build is platform dependent!
[INFO] Copying 1 resource
[INFO] 
[INFO] --- maven-compiler-plugin:2.3.2:testCompile (default-testCompile) @ tutorial ---
[INFO] Nothing to compile - all classes are up to date
[INFO] 
[INFO] --- maven-surefire-plugin:2.7.2:test (default-test) @ tutorial ---
[INFO] Surefire report directory: <https://builds.apache.org/job/Cayenne-trunk/./cayenneTestConnection=h2,jdk=JDK%201.5%20(latest),label=Ubuntu/ws/trunk/tutorials/tutorial/target/surefire-reports>

-------------------------------------------------------
 T E S T S
-------------------------------------------------------
There are no tests to run.

Results :

Tests run: 0, Failures: 0, Errors: 0, Skipped: 0

[INFO] 
[INFO] --- maven-jar-plugin:2.3.1:jar (default-jar) @ tutorial ---
[INFO] Building jar: <https://builds.apache.org/job/Cayenne-trunk/./cayenneTestConnection=h2,jdk=JDK%201.5%20(latest),label=Ubuntu/ws/trunk/tutorials/tutorial/target/tutorial-3.2M1-SNAPSHOT.jar>
[INFO] 
[INFO] --- maven-install-plugin:2.3.1:install (default-install) @ tutorial ---
[INFO] Installing <https://builds.apache.org/job/Cayenne-trunk/./cayenneTestConnection=h2,jdk=JDK%201.5%20(latest),label=Ubuntu/ws/trunk/tutorials/tutorial/target/tutorial-3.2M1-SNAPSHOT.jar>
to <https://builds.apache.org/job/Cayenne-trunk/./cayenneTestConnection=h2,jdk=JDK%201.5%20(latest),label=Ubuntu/ws/.repository/org/apache/cayenne/tutorial/3.2M1-SNAPSHOT/tutorial-3.2M1-SNAPSHOT.jar>
[INFO] Installing <https://builds.apache.org/job/Cayenne-trunk/./cayenneTestConnection=h2,jdk=JDK%201.5%20(latest),label=Ubuntu/ws/trunk/tutorials/tutorial/pom.xml>
to <https://builds.apache.org/job/Cayenne-trunk/./cayenneTestConnection=h2,jdk=JDK%201.5%20(latest),label=Ubuntu/ws/.repository/org/apache/cayenne/tutorial/3.2M1-SNAPSHOT/tutorial-3.2M1-SNAPSHOT.pom>
[INFO]                                                                         
[INFO] ------------------------------------------------------------------------
[INFO] Building Cayenne ROP Server Tutorial 3.2M1-SNAPSHOT
[INFO] ------------------------------------------------------------------------
[INFO] 
[INFO] --- maven-clean-plugin:2.4.1:clean (default-clean) @ tutorial-rop-server ---
[INFO] 
[INFO] --- maven-resources-plugin:2.4.3:resources (default-resources) @ tutorial-rop-server
---
[WARNING] Using platform encoding (ANSI_X3.4-1968 actually) to copy filtered resources, i.e.
build is platform dependent!
[INFO] Copying 2 resources
[INFO] 
[INFO] --- maven-compiler-plugin:2.3.2:compile (default-compile) @ tutorial-rop-server ---
[WARNING] File encoding has not been set, using platform encoding ANSI_X3.4-1968, i.e. build
is platform dependent!
[INFO] Compiling 16 source files to <https://builds.apache.org/job/Cayenne-trunk/./cayenneTestConnection=h2,jdk=JDK%201.5%20(latest),label=Ubuntu/ws/trunk/tutorials/tutorial-rop-server/target/classes>
[INFO] 
[INFO] --- maven-resources-plugin:2.4.3:testResources (default-testResources) @ tutorial-rop-server
---
[WARNING] Using platform encoding (ANSI_X3.4-1968 actually) to copy filtered resources, i.e.
build is platform dependent!
[INFO] Copying 1 resource
[INFO] 
[INFO] --- maven-compiler-plugin:2.3.2:testCompile (default-testCompile) @ tutorial-rop-server
---
[INFO] Nothing to compile - all classes are up to date
[INFO] 
[INFO] --- maven-surefire-plugin:2.7.2:test (default-test) @ tutorial-rop-server ---
[INFO] Surefire report directory: <https://builds.apache.org/job/Cayenne-trunk/./cayenneTestConnection=h2,jdk=JDK%201.5%20(latest),label=Ubuntu/ws/trunk/tutorials/tutorial-rop-server/target/surefire-reports>

-------------------------------------------------------
 T E S T S
-------------------------------------------------------
There are no tests to run.

Results :

Tests run: 0, Failures: 0, Errors: 0, Skipped: 0

[INFO] 
[INFO] --- maven-war-plugin:2.1.1:war (default-war) @ tutorial-rop-server ---
[INFO] Packaging webapp
[INFO] Assembling webapp [tutorial-rop-server] in [<https://builds.apache.org/job/Cayenne-trunk/./cayenneTestConnection=h2,jdk=JDK%201.5%20(latest),label=Ubuntu/ws/trunk/tutorials/tutorial-rop-server/target/tutorial-rop-server-3.2M1-SNAPSHOT]>
[INFO] Processing war project
[INFO] Copying webapp resources [<https://builds.apache.org/job/Cayenne-trunk/./cayenneTestConnection=h2,jdk=JDK%201.5%20(latest),label=Ubuntu/ws/trunk/tutorials/tutorial-rop-server/src/main/webapp]>
[INFO] Webapp assembled in [92 msecs]
[INFO] Building war: <https://builds.apache.org/job/Cayenne-trunk/./cayenneTestConnection=h2,jdk=JDK%201.5%20(latest),label=Ubuntu/ws/trunk/tutorials/tutorial-rop-server/target/tutorial-rop-server-3.2M1-SNAPSHOT.war>
[INFO] WEB-INF/web.xml already added, skipping
[INFO] 
[INFO] --- maven-install-plugin:2.3.1:install (default-install) @ tutorial-rop-server ---
[INFO] Installing <https://builds.apache.org/job/Cayenne-trunk/./cayenneTestConnection=h2,jdk=JDK%201.5%20(latest),label=Ubuntu/ws/trunk/tutorials/tutorial-rop-server/target/tutorial-rop-server-3.2M1-SNAPSHOT.war>
to <https://builds.apache.org/job/Cayenne-trunk/./cayenneTestConnection=h2,jdk=JDK%201.5%20(latest),label=Ubuntu/ws/.repository/org/apache/cayenne/tutorial-rop-server/3.2M1-SNAPSHOT/tutorial-rop-server-3.2M1-SNAPSHOT.war>
[INFO] Installing <https://builds.apache.org/job/Cayenne-trunk/./cayenneTestConnection=h2,jdk=JDK%201.5%20(latest),label=Ubuntu/ws/trunk/tutorials/tutorial-rop-server/pom.xml>
to <https://builds.apache.org/job/Cayenne-trunk/./cayenneTestConnection=h2,jdk=JDK%201.5%20(latest),label=Ubuntu/ws/.repository/org/apache/cayenne/tutorial-rop-server/3.2M1-SNAPSHOT/tutorial-rop-server-3.2M1-SNAPSHOT.pom>
[INFO]                                                                         
[INFO] ------------------------------------------------------------------------
[INFO] Building Cayenne ROP Client Tutorial 3.2M1-SNAPSHOT
[INFO] ------------------------------------------------------------------------
[INFO] 
[INFO] --- maven-clean-plugin:2.4.1:clean (default-clean) @ tutorial-rop-client ---
[INFO] 
[INFO] --- maven-resources-plugin:2.4.3:resources (default-resources) @ tutorial-rop-client
---
[WARNING] Using platform encoding (ANSI_X3.4-1968 actually) to copy filtered resources, i.e.
build is platform dependent!
[INFO] Copying 1 resource
[INFO] 
[INFO] --- maven-compiler-plugin:2.3.2:compile (default-compile) @ tutorial-rop-client ---
[WARNING] File encoding has not been set, using platform encoding ANSI_X3.4-1968, i.e. build
is platform dependent!
[INFO] Compiling 9 source files to <https://builds.apache.org/job/Cayenne-trunk/./cayenneTestConnection=h2,jdk=JDK%201.5%20(latest),label=Ubuntu/ws/trunk/tutorials/tutorial-rop-client/target/classes>
[INFO] -------------------------------------------------------------
[ERROR] COMPILATION ERROR : 
[INFO] -------------------------------------------------------------
[ERROR] <https://builds.apache.org/job/Cayenne-trunk/./cayenneTestConnection=h2,jdk=JDK%201.5%20(latest),label=Ubuntu/ws/trunk/tutorials/tutorial-rop-client/src/main/java/org/apache/cayenne/tutorial/persistent/client/Main.java>:[81,59]
cannot find symbol
symbol  : method from(java.lang.Class<org.apache.cayenne.tutorial.persistent.client.Painting>,<nulltype>)
location: class org.apache.cayenne.query.SelectQuery
[ERROR] <https://builds.apache.org/job/Cayenne-trunk/./cayenneTestConnection=h2,jdk=JDK%201.5%20(latest),label=Ubuntu/ws/trunk/tutorials/tutorial-rop-client/src/main/java/org/apache/cayenne/tutorial/persistent/client/Main.java>:[86,59]
cannot find symbol
symbol  : method from(java.lang.Class<org.apache.cayenne.tutorial.persistent.client.Painting>,org.apache.cayenne.exp.Expression)
location: class org.apache.cayenne.query.SelectQuery
[ERROR] <https://builds.apache.org/job/Cayenne-trunk/./cayenneTestConnection=h2,jdk=JDK%201.5%20(latest),label=Ubuntu/ws/trunk/tutorials/tutorial-rop-client/src/main/java/org/apache/cayenne/tutorial/persistent/client/Main.java>:[94,64]
cannot find symbol
symbol  : method from(java.lang.Class<org.apache.cayenne.tutorial.persistent.client.Artist>,org.apache.cayenne.exp.Expression)
location: class org.apache.cayenne.query.SelectQuery
[INFO] 3 errors 
[INFO] -------------------------------------------------------------
[INFO] ------------------------------------------------------------------------
[INFO] Reactor Summary:
[INFO] 
[INFO] Cayenne ........................................... SUCCESS [2.751s]
[INFO] Common Unit Test Utilities ........................ SUCCESS [3.207s]
[INFO] Cayenne Internal Build Plugin ..................... SUCCESS [2.753s]
[INFO] Cayenne Build Tools Parent ........................ SUCCESS [0.007s]
[INFO] Cayenne License and Notice Bundle ................. SUCCESS [1.392s]
[INFO] Cayenne Dependency Injection Container ............ SUCCESS [2.526s]
[INFO] Cayenne Java 1.5 Unpublished ...................... SUCCESS [1:40.461s]
[INFO] Cayenne WebObjects Compatibility Library .......... SUCCESS [2.842s]
[INFO] Cayenne Aggregated Server Jar ..................... SUCCESS [3.383s]
[INFO] Cayenne Aggregated Client Jar ..................... SUCCESS [2.282s]
[INFO] Cayenne Project ................................... SUCCESS [2.733s]
[INFO] Cayenne Tools ..................................... SUCCESS [6.809s]
[INFO] Library: cayenne-lifecycle ........................ SUCCESS [6.671s]
[INFO] Cayenne Maven Plugin .............................. SUCCESS [3.021s]
[INFO] Cayenne Framework Aggregator Project .............. SUCCESS [0.009s]
[INFO] Cayenne Integration Tests Parent .................. SUCCESS [0.011s]
[INFO] Integration Tests - Cayenne Runtime ............... SUCCESS [3.232s]
[INFO] Integration Tests - Cayenne Tools ................. SUCCESS [5.904s]
[INFO] Cayenne Modeler ................................... SUCCESS [12.478s]
[INFO] Cayenne Modeler Maven Plugin ...................... SUCCESS [0.623s]
[INFO] Cayenne Modeler Parent ............................ SUCCESS [0.006s]
[INFO] Cayenne Tutorial .................................. SUCCESS [2.048s]
[INFO] Cayenne ROP Server Tutorial ....................... SUCCESS [2.249s]
[INFO] Cayenne ROP Client Tutorial ....................... FAILURE [0.379s]
[INFO] Cayenne Tutorials ................................. SKIPPED
[INFO] Cayenne Documentation ............................. SKIPPED
[INFO] Cayenne Documenation Parent ....................... SKIPPED
[INFO] Cayenne Docbook Documentation ..................... SKIPPED
[INFO] Docbook: Cayenne Guide ............................ SKIPPED
[INFO] Docbook: Getting Started with Cayenne ............. SKIPPED
[INFO] Docbook: Getting Started with Cayenne ROP ......... SKIPPED
[INFO] Docbook: Cayenne New Features and Upgrade Guide ... SKIPPED
[INFO] ------------------------------------------------------------------------
[INFO] BUILD FAILURE
[INFO] ------------------------------------------------------------------------
[INFO] Total time: 2:57.017s
[INFO] Finished at: Sat Dec 15 15:00:20 UTC 2012
[INFO] Final Memory: 37M/91M
[INFO] ------------------------------------------------------------------------
[ERROR] Failed to execute goal org.apache.maven.plugins:maven-compiler-plugin:2.3.2:compile
(default-compile) on project tutorial-rop-client: Compilation failure: Compilation failure:
[ERROR] <https://builds.apache.org/job/Cayenne-trunk/./cayenneTestConnection=h2,jdk=JDK%201.5%20(latest),label=Ubuntu/ws/trunk/tutorials/tutorial-rop-client/src/main/java/org/apache/cayenne/tutorial/persistent/client/Main.java>:[81,59]
cannot find symbol
[ERROR] symbol  : method from(java.lang.Class<org.apache.cayenne.tutorial.persistent.client.Painting>,<nulltype>)
[ERROR] location: class org.apache.cayenne.query.SelectQuery
[ERROR] <https://builds.apache.org/job/Cayenne-trunk/./cayenneTestConnection=h2,jdk=JDK%201.5%20(latest),label=Ubuntu/ws/trunk/tutorials/tutorial-rop-client/src/main/java/org/apache/cayenne/tutorial/persistent/client/Main.java>:[86,59]
cannot find symbol
[ERROR] symbol  : method from(java.lang.Class<org.apache.cayenne.tutorial.persistent.client.Painting>,org.apache.cayenne.exp.Expression)
[ERROR] location: class org.apache.cayenne.query.SelectQuery
[ERROR] <https://builds.apache.org/job/Cayenne-trunk/./cayenneTestConnection=h2,jdk=JDK%201.5%20(latest),label=Ubuntu/ws/trunk/tutorials/tutorial-rop-client/src/main/java/org/apache/cayenne/tutorial/persistent/client/Main.java>:[94,64]
cannot find symbol
[ERROR] symbol  : method from(java.lang.Class<org.apache.cayenne.tutorial.persistent.client.Artist>,org.apache.cayenne.exp.Expression)
[ERROR] location: class org.apache.cayenne.query.SelectQuery
[ERROR] -> [Help 1]
org.apache.maven.lifecycle.LifecycleExecutionException: Failed to execute goal org.apache.maven.plugins:maven-compiler-plugin:2.3.2:compile
(default-compile) on project tutorial-rop-client: Compilation failure
	at org.apache.maven.lifecycle.internal.MojoExecutor.execute(MojoExecutor.java:213)
	at org.apache.maven.lifecycle.internal.MojoExecutor.execute(MojoExecutor.java:153)
	at org.apache.maven.lifecycle.internal.MojoExecutor.execute(MojoExecutor.java:145)
	at org.apache.maven.lifecycle.internal.LifecycleModuleBuilder.buildProject(LifecycleModuleBuilder.java:84)
	at org.apache.maven.lifecycle.internal.LifecycleModuleBuilder.buildProject(LifecycleModuleBuilder.java:59)
	at org.apache.maven.lifecycle.internal.LifecycleStarter.singleThreadedBuild(LifecycleStarter.java:183)
	at org.apache.maven.lifecycle.internal.LifecycleStarter.execute(LifecycleStarter.java:161)
	at org.apache.maven.DefaultMaven.doExecute(DefaultMaven.java:319)
	at org.apache.maven.DefaultMaven.execute(DefaultMaven.java:156)
	at org.apache.maven.cli.MavenCli.execute(MavenCli.java:537)
	at org.apache.maven.cli.MavenCli.doMain(MavenCli.java:196)
	at org.apache.maven.cli.MavenCli.main(MavenCli.java:141)
	at sun.reflect.NativeMethodAccessorImpl.invoke0(Native Method)
	at sun.reflect.NativeMethodAccessorImpl.invoke(NativeMethodAccessorImpl.java:39)
	at sun.reflect.DelegatingMethodAccessorImpl.invoke(DelegatingMethodAccessorImpl.java:25)
	at java.lang.reflect.Method.invoke(Method.java:592)
	at org.codehaus.plexus.classworlds.launcher.Launcher.launchEnhanced(Launcher.java:290)
	at org.codehaus.plexus.classworlds.launcher.Launcher.launch(Launcher.java:230)
	at org.codehaus.plexus.classworlds.launcher.Launcher.mainWithExitCode(Launcher.java:409)
	at org.codehaus.plexus.classworlds.launcher.Launcher.main(Launcher.java:352)
Caused by: org.apache.maven.plugin.CompilationFailureException: Compilation failure
	at org.apache.maven.plugin.AbstractCompilerMojo.execute(AbstractCompilerMojo.java:656)
	at org.apache.maven.plugin.CompilerMojo.execute(CompilerMojo.java:128)
	at org.apache.maven.plugin.DefaultBuildPluginManager.executeMojo(DefaultBuildPluginManager.java:101)
	at org.apache.maven.lifecycle.internal.MojoExecutor.execute(MojoExecutor.java:209)
	... 19 more
[ERROR] 
[ERROR] Re-run Maven using the -X switch to enable full debug logging.
[ERROR] 
[ERROR] For more information about the errors and possible solutions, please read the following
articles:
[ERROR] [Help 1] http://cwiki.apache.org/confluence/display/MAVEN/MojoFailureException
[ERROR] 
[ERROR] After correcting the problems, you can resume the build with the command
[ERROR]   mvn <goals> -rf :tutorial-rop-client
Build step 'Invoke top-level Maven targets' marked build as failure

Mime
View raw message