cayenne-commits mailing list archives

Site index · List index
Message view « Date » · « Thread »
Top « Date » · « Thread »
From Apache Jenkins Server <jenk...@builds.apache.org>
Subject Build failed in Jenkins: Cayenne-trunk » derby,JDK 1.5 (latest),Ubuntu #832
Date Wed, 26 Dec 2012 15:45:14 GMT
See <https://builds.apache.org/job/Cayenne-trunk/./cayenneTestConnection=derby,jdk=JDK%201.5%20(latest),label=Ubuntu/832/changes>

Changes:

[aadamchik] CAY-1784 Improving 'Property' class to handle a few extra common cases

in(Collection)

[aadamchik] CAY-1784 Improving 'Property' class to handle a few extra common cases

notlike

[aadamchik] CAY-1784 Improving 'Property' class to handle a few extra common cases

prefetches

[aadamchik] regenerated test classes in one of the DataMaps so that we can test Property API

[aadamchik] CAY-1784 Improving 'Property' class to handle a few extra common cases

------------------------------------------
[...truncated 123919 lines...]
INFO: delete from ARTIST
Dec 26, 2012 3:45:13 PM org.apache.cayenne.test.jdbc.UtilityLogger log
INFO: INSERT INTO ARTIST (ARTIST_ID, ARTIST_NAME) VALUES (?, ?)
Dec 26, 2012 3:45:13 PM org.apache.cayenne.log.CommonsJdbcEventLogger logBeginTransaction
INFO: --- transaction started.
Dec 26, 2012 3:45:13 PM org.apache.cayenne.log.CommonsJdbcEventLogger logQuery
INFO: SELECT t0.ARTIST_NAME, t0.DATE_OF_BIRTH, t0.ARTIST_ID FROM ARTIST t0
Dec 26, 2012 3:45:13 PM org.apache.cayenne.log.CommonsJdbcEventLogger logSelectCount
INFO: === returned 1 row. - took 0 ms.
Dec 26, 2012 3:45:13 PM org.apache.cayenne.log.CommonsJdbcEventLogger logCommitTransaction
INFO: +++ transaction committed.
Dec 26, 2012 3:45:13 PM org.apache.cayenne.log.CommonsJdbcEventLogger logBeginTransaction
INFO: --- transaction started.
Dec 26, 2012 3:45:13 PM org.apache.cayenne.log.CommonsJdbcEventLogger logQuery
INFO: SELECT t0.ESTIMATED_PRICE, t0.PAINTING_DESCRIPTION, t0.PAINTING_TITLE, t0.ARTIST_ID,
t0.GALLERY_ID, t0.PAINTING_ID FROM PAINTING t0 WHERE t0.ARTIST_ID = ? [bind: 1->ARTIST_ID:5]
Dec 26, 2012 3:45:13 PM org.apache.cayenne.log.CommonsJdbcEventLogger logSelectCount
INFO: === returned 0 rows. - took 1 ms.
Dec 26, 2012 3:45:13 PM org.apache.cayenne.log.CommonsJdbcEventLogger logCommitTransaction
INFO: +++ transaction committed.
Dec 26, 2012 3:45:13 PM org.apache.cayenne.test.jdbc.UtilityLogger log
INFO: INSERT INTO PAINTING (PAINTING_ID, PAINTING_TITLE, ARTIST_ID, ESTIMATED_PRICE) VALUES
(?, ?, ?, ?)
Dec 26, 2012 3:45:13 PM org.apache.cayenne.log.CommonsJdbcEventLogger logBeginTransaction
INFO: --- transaction started.
Dec 26, 2012 3:45:13 PM org.apache.cayenne.log.CommonsJdbcEventLogger logQuery
INFO: SELECT t0.ARTIST_NAME, t0.DATE_OF_BIRTH, t0.ARTIST_ID FROM ARTIST t0 WHERE t0.ARTIST_ID
= ? [bind: 1->ARTIST_ID:5]
Dec 26, 2012 3:45:13 PM org.apache.cayenne.log.CommonsJdbcEventLogger logSelectCount
INFO: === returned 1 row. - took 0 ms.
Dec 26, 2012 3:45:13 PM org.apache.cayenne.log.CommonsJdbcEventLogger logCommitTransaction
INFO: +++ transaction committed.
Dec 26, 2012 3:45:13 PM org.apache.cayenne.log.CommonsJdbcEventLogger logBeginTransaction
INFO: --- transaction started.
Dec 26, 2012 3:45:13 PM org.apache.cayenne.log.CommonsJdbcEventLogger logQuery
INFO: SELECT t0.ESTIMATED_PRICE, t0.PAINTING_DESCRIPTION, t0.PAINTING_TITLE, t0.ARTIST_ID,
t0.GALLERY_ID, t0.PAINTING_ID FROM PAINTING t0 WHERE t0.ARTIST_ID = ? [bind: 1->ARTIST_ID:5]
Dec 26, 2012 3:45:13 PM org.apache.cayenne.log.CommonsJdbcEventLogger logSelectCount
INFO: === returned 1 row. - took 0 ms.
Dec 26, 2012 3:45:13 PM org.apache.cayenne.log.CommonsJdbcEventLogger logCommitTransaction
INFO: +++ transaction committed.
Dec 26, 2012 3:45:13 PM org.apache.cayenne.configuration.XMLDataChannelDescriptorLoader load
INFO: Loading XML configuration resource from <https://builds.apache.org/job/Cayenne-trunk/./cayenneTestConnection=derby,jdk=JDK%201.5%20(latest),label=Ubuntu/ws/trunk/framework/cayenne-jdk1.5-unpublished/target/test-classes/cayenne-testmap.xml>
Dec 26, 2012 3:45:13 PM org.apache.cayenne.configuration.XMLDataChannelDescriptorLoader$DataChannelChildrenHandler
createChildTagHandler
INFO: Loading XML DataMap resource from <https://builds.apache.org/job/Cayenne-trunk/./cayenneTestConnection=derby,jdk=JDK%201.5%20(latest),label=Ubuntu/ws/trunk/framework/cayenne-jdk1.5-unpublished/target/test-classes/testmap.map.xml>
Dec 26, 2012 3:45:13 PM org.apache.cayenne.map.EntityResolver applyDBLayerDefaults
INFO: added runtime complimentary DbRelationship from ARTIST to PAINTING1
Dec 26, 2012 3:45:13 PM org.apache.cayenne.map.EntityResolver applyObjectLayerDefaults
INFO: added runtime complimentary ObjRelationship from Ball to Bag
Dec 26, 2012 3:45:13 PM org.apache.cayenne.map.EntityResolver applyObjectLayerDefaults
INFO: added runtime complimentary ObjRelationship from Thing to Bag
Dec 26, 2012 3:45:13 PM org.apache.cayenne.map.EntityResolver applyObjectLayerDefaults
INFO: added runtime complimentary ObjRelationship from Artist to CompoundPainting
Dec 26, 2012 3:45:13 PM org.apache.cayenne.map.EntityResolver applyObjectLayerDefaults
INFO: added runtime complimentary ObjRelationship from Gallery to CompoundPainting
Dec 26, 2012 3:45:13 PM org.apache.cayenne.map.EntityResolver applyObjectLayerDefaults
INFO: added runtime complimentary ObjRelationship from PaintingInfo to CompoundPainting
Dec 26, 2012 3:45:13 PM org.apache.cayenne.map.EntityResolver applyObjectLayerDefaults
INFO: added runtime complimentary ObjRelationship from Artist to CompoundPaintingLongNames
Dec 26, 2012 3:45:13 PM org.apache.cayenne.map.EntityResolver applyObjectLayerDefaults
INFO: added runtime complimentary ObjRelationship from ROArtist to CompoundPaintingLongNames
Dec 26, 2012 3:45:13 PM org.apache.cayenne.map.EntityResolver applyObjectLayerDefaults
INFO: added runtime complimentary ObjRelationship from Gallery to CompoundPaintingLongNames
Dec 26, 2012 3:45:13 PM org.apache.cayenne.map.EntityResolver applyObjectLayerDefaults
INFO: added runtime complimentary ObjRelationship from PaintingInfo to CompoundPaintingLongNames
Dec 26, 2012 3:45:13 PM org.apache.cayenne.map.EntityResolver applyObjectLayerDefaults
INFO: added runtime complimentary ObjRelationship from Artist to Painting1
Dec 26, 2012 3:45:13 PM org.apache.cayenne.map.EntityResolver applyObjectLayerDefaults
INFO: added runtime complimentary ObjRelationship from Painting to ROArtist
Dec 26, 2012 3:45:13 PM org.apache.cayenne.map.EntityResolver applyObjectLayerDefaults
INFO: added runtime complimentary ObjRelationship from Artist to ROPainting
Dec 26, 2012 3:45:13 PM org.apache.cayenne.test.jdbc.UtilityLogger log
INFO: delete from PAINTING_INFO
Dec 26, 2012 3:45:13 PM org.apache.cayenne.test.jdbc.UtilityLogger log
INFO: delete from PAINTING
Dec 26, 2012 3:45:13 PM org.apache.cayenne.test.jdbc.UtilityLogger log
INFO: delete from ARTIST_EXHIBIT
Dec 26, 2012 3:45:13 PM org.apache.cayenne.test.jdbc.UtilityLogger log
INFO: delete from ARTIST_GROUP
Dec 26, 2012 3:45:13 PM org.apache.cayenne.test.jdbc.UtilityLogger log
INFO: delete from ARTIST
Dec 26, 2012 3:45:13 PM org.apache.cayenne.test.jdbc.UtilityLogger log
INFO: INSERT INTO ARTIST (ARTIST_ID, ARTIST_NAME) VALUES (?, ?)
Dec 26, 2012 3:45:13 PM org.apache.cayenne.log.CommonsJdbcEventLogger logBeginTransaction
INFO: --- transaction started.
Dec 26, 2012 3:45:13 PM org.apache.cayenne.log.CommonsJdbcEventLogger logQuery
INFO: SELECT t0.ARTIST_NAME, t0.DATE_OF_BIRTH, t0.ARTIST_ID FROM ARTIST t0
Dec 26, 2012 3:45:13 PM org.apache.cayenne.log.CommonsJdbcEventLogger logSelectCount
INFO: === returned 1 row. - took 1 ms.
Dec 26, 2012 3:45:13 PM org.apache.cayenne.log.CommonsJdbcEventLogger logCommitTransaction
INFO: +++ transaction committed.
Dec 26, 2012 3:45:13 PM org.apache.cayenne.log.CommonsJdbcEventLogger logBeginTransaction
INFO: --- transaction started.
Dec 26, 2012 3:45:13 PM org.apache.cayenne.log.CommonsJdbcEventLogger logQuery
INFO: SELECT t0.ARTIST_NAME, t0.DATE_OF_BIRTH, t0.ARTIST_ID FROM ARTIST t0 WHERE t0.ARTIST_ID
= ? [bind: 1->ARTIST_ID:5]
Dec 26, 2012 3:45:13 PM org.apache.cayenne.log.CommonsJdbcEventLogger logSelectCount
INFO: === returned 1 row. - took 1 ms.
Dec 26, 2012 3:45:13 PM org.apache.cayenne.log.CommonsJdbcEventLogger logCommitTransaction
INFO: +++ transaction committed.
Dec 26, 2012 3:45:13 PM org.apache.cayenne.configuration.XMLDataChannelDescriptorLoader load
INFO: Loading XML configuration resource from <https://builds.apache.org/job/Cayenne-trunk/./cayenneTestConnection=derby,jdk=JDK%201.5%20(latest),label=Ubuntu/ws/trunk/framework/cayenne-jdk1.5-unpublished/target/test-classes/cayenne-testmap.xml>
Dec 26, 2012 3:45:13 PM org.apache.cayenne.configuration.XMLDataChannelDescriptorLoader$DataChannelChildrenHandler
createChildTagHandler
INFO: Loading XML DataMap resource from <https://builds.apache.org/job/Cayenne-trunk/./cayenneTestConnection=derby,jdk=JDK%201.5%20(latest),label=Ubuntu/ws/trunk/framework/cayenne-jdk1.5-unpublished/target/test-classes/testmap.map.xml>
Dec 26, 2012 3:45:13 PM org.apache.cayenne.map.EntityResolver applyDBLayerDefaults
INFO: added runtime complimentary DbRelationship from ARTIST to PAINTING1
Dec 26, 2012 3:45:13 PM org.apache.cayenne.map.EntityResolver applyObjectLayerDefaults
INFO: added runtime complimentary ObjRelationship from Ball to Bag
Dec 26, 2012 3:45:13 PM org.apache.cayenne.map.EntityResolver applyObjectLayerDefaults
INFO: added runtime complimentary ObjRelationship from Thing to Bag
Dec 26, 2012 3:45:13 PM org.apache.cayenne.map.EntityResolver applyObjectLayerDefaults
INFO: added runtime complimentary ObjRelationship from Artist to CompoundPainting
Dec 26, 2012 3:45:13 PM org.apache.cayenne.map.EntityResolver applyObjectLayerDefaults
INFO: added runtime complimentary ObjRelationship from Gallery to CompoundPainting
Dec 26, 2012 3:45:13 PM org.apache.cayenne.map.EntityResolver applyObjectLayerDefaults
INFO: added runtime complimentary ObjRelationship from PaintingInfo to CompoundPainting
Dec 26, 2012 3:45:13 PM org.apache.cayenne.map.EntityResolver applyObjectLayerDefaults
INFO: added runtime complimentary ObjRelationship from Artist to CompoundPaintingLongNames
Dec 26, 2012 3:45:13 PM org.apache.cayenne.map.EntityResolver applyObjectLayerDefaults
INFO: added runtime complimentary ObjRelationship from ROArtist to CompoundPaintingLongNames
Dec 26, 2012 3:45:13 PM org.apache.cayenne.map.EntityResolver applyObjectLayerDefaults
INFO: added runtime complimentary ObjRelationship from Gallery to CompoundPaintingLongNames
Dec 26, 2012 3:45:13 PM org.apache.cayenne.map.EntityResolver applyObjectLayerDefaults
INFO: added runtime complimentary ObjRelationship from PaintingInfo to CompoundPaintingLongNames
Dec 26, 2012 3:45:13 PM org.apache.cayenne.map.EntityResolver applyObjectLayerDefaults
INFO: added runtime complimentary ObjRelationship from Artist to Painting1
Dec 26, 2012 3:45:13 PM org.apache.cayenne.map.EntityResolver applyObjectLayerDefaults
INFO: added runtime complimentary ObjRelationship from Painting to ROArtist
Dec 26, 2012 3:45:13 PM org.apache.cayenne.map.EntityResolver applyObjectLayerDefaults
INFO: added runtime complimentary ObjRelationship from Artist to ROPainting
Dec 26, 2012 3:45:13 PM org.apache.cayenne.test.jdbc.UtilityLogger log
INFO: delete from PAINTING_INFO
Dec 26, 2012 3:45:13 PM org.apache.cayenne.test.jdbc.UtilityLogger log
INFO: delete from PAINTING
Dec 26, 2012 3:45:13 PM org.apache.cayenne.test.jdbc.UtilityLogger log
INFO: delete from ARTIST_EXHIBIT
Dec 26, 2012 3:45:13 PM org.apache.cayenne.test.jdbc.UtilityLogger log
INFO: delete from ARTIST_GROUP
Dec 26, 2012 3:45:13 PM org.apache.cayenne.test.jdbc.UtilityLogger log
INFO: delete from ARTIST
Dec 26, 2012 3:45:13 PM org.apache.cayenne.test.jdbc.UtilityLogger log
INFO: INSERT INTO ARTIST (ARTIST_ID, ARTIST_NAME) VALUES (?, ?)
Dec 26, 2012 3:45:13 PM org.apache.cayenne.test.jdbc.UtilityLogger log
INFO: INSERT INTO PAINTING (PAINTING_ID, PAINTING_TITLE, ARTIST_ID, ESTIMATED_PRICE) VALUES
(?, ?, ?, ?)
Dec 26, 2012 3:45:13 PM org.apache.cayenne.log.CommonsJdbcEventLogger logBeginTransaction
INFO: --- transaction started.
Dec 26, 2012 3:45:13 PM org.apache.cayenne.log.CommonsJdbcEventLogger logQuery
INFO: SELECT t0.ESTIMATED_PRICE, t0.PAINTING_DESCRIPTION, t0.PAINTING_TITLE, t0.ARTIST_ID,
t0.GALLERY_ID, t0.PAINTING_ID FROM PAINTING t0
Dec 26, 2012 3:45:13 PM org.apache.cayenne.log.CommonsJdbcEventLogger logSelectCount
INFO: === returned 1 row. - took 0 ms.
Dec 26, 2012 3:45:13 PM org.apache.cayenne.log.CommonsJdbcEventLogger logCommitTransaction
INFO: +++ transaction committed.
Dec 26, 2012 3:45:13 PM org.apache.cayenne.log.CommonsJdbcEventLogger logBeginTransaction
INFO: --- transaction started.
Dec 26, 2012 3:45:13 PM org.apache.cayenne.log.CommonsJdbcEventLogger logQuery
INFO: SELECT t0.ARTIST_NAME, t0.DATE_OF_BIRTH, t0.ARTIST_ID FROM ARTIST t0 WHERE t0.ARTIST_ID
= ? [bind: 1->ARTIST_ID:5]
Dec 26, 2012 3:45:13 PM org.apache.cayenne.log.CommonsJdbcEventLogger logSelectCount
INFO: === returned 1 row. - took 1 ms.
Dec 26, 2012 3:45:13 PM org.apache.cayenne.log.CommonsJdbcEventLogger logCommitTransaction
INFO: +++ transaction committed.
Tests run: 14, Failures: 0, Errors: 0, Skipped: 0, Time elapsed: 0.308 sec

Results :

Failed tests: 
  testConcurrentInserts(org.apache.cayenne.dba.ConcurrentPkGeneratorTest)

Tests run: 2148, Failures: 1, Errors: 0, Skipped: 0

[INFO] ------------------------------------------------------------------------
[INFO] Reactor Summary:
[INFO] 
[INFO] Cayenne ........................................... SUCCESS [1.315s]
[INFO] Common Unit Test Utilities ........................ SUCCESS [5.908s]
[INFO] Cayenne Internal Build Plugin ..................... SUCCESS [5.230s]
[INFO] Cayenne Build Tools Parent ........................ SUCCESS [0.076s]
[INFO] Cayenne License and Notice Bundle ................. SUCCESS [1.629s]
[INFO] Cayenne Dependency Injection Container ............ SUCCESS [2.901s]
[INFO] Cayenne Java 1.5 Unpublished ...................... FAILURE [1:38.690s]
[INFO] Cayenne WebObjects Compatibility Library .......... SKIPPED
[INFO] Cayenne Aggregated Server Jar ..................... SKIPPED
[INFO] Cayenne Aggregated Client Jar ..................... SKIPPED
[INFO] Cayenne Project ................................... SKIPPED
[INFO] Cayenne Tools ..................................... SKIPPED
[INFO] Library: cayenne-lifecycle ........................ SKIPPED
[INFO] Cayenne Maven Plugin .............................. SKIPPED
[INFO] Cayenne Framework Aggregator Project .............. SKIPPED
[INFO] Cayenne Integration Tests Parent .................. SKIPPED
[INFO] Integration Tests - Cayenne Runtime ............... SKIPPED
[INFO] Integration Tests - Cayenne Tools ................. SKIPPED
[INFO] Cayenne Modeler ................................... SKIPPED
[INFO] Cayenne Modeler Maven Plugin ...................... SKIPPED
[INFO] Cayenne Modeler Parent ............................ SKIPPED
[INFO] Cayenne Tutorial .................................. SKIPPED
[INFO] Cayenne ROP Server Tutorial ....................... SKIPPED
[INFO] Cayenne ROP Client Tutorial ....................... SKIPPED
[INFO] Cayenne Tutorials ................................. SKIPPED
[INFO] Cayenne Documentation ............................. SKIPPED
[INFO] Cayenne Documenation Parent ....................... SKIPPED
[INFO] Cayenne Docbook Documentation ..................... SKIPPED
[INFO] Docbook: Cayenne Guide ............................ SKIPPED
[INFO] Docbook: Getting Started with Cayenne ............. SKIPPED
[INFO] Docbook: Getting Started with Cayenne ROP ......... SKIPPED
[INFO] Docbook: Cayenne New Features and Upgrade Guide ... SKIPPED
[INFO] ------------------------------------------------------------------------
[INFO] BUILD FAILURE
[INFO] ------------------------------------------------------------------------
[INFO] Total time: 2:02.289s
[INFO] Finished at: Wed Dec 26 15:45:14 UTC 2012
[INFO] Final Memory: 22M/102M
[INFO] ------------------------------------------------------------------------
[ERROR] Failed to execute goal org.apache.maven.plugins:maven-surefire-plugin:2.5:test (default-test)
on project cayenne-jdk1.5-unpublished: There are test failures.
[ERROR] 
[ERROR] Please refer to <https://builds.apache.org/job/Cayenne-trunk/./cayenneTestConnection=derby,jdk=JDK%201.5%20(latest),label=Ubuntu/ws/trunk/framework/cayenne-jdk1.5-unpublished/target/surefire-reports>
for the individual test results.
[ERROR] -> [Help 1]
org.apache.maven.lifecycle.LifecycleExecutionException: Failed to execute goal org.apache.maven.plugins:maven-surefire-plugin:2.5:test
(default-test) on project cayenne-jdk1.5-unpublished: There are test failures.

Please refer to <https://builds.apache.org/job/Cayenne-trunk/./cayenneTestConnection=derby,jdk=JDK%201.5%20(latest),label=Ubuntu/ws/trunk/framework/cayenne-jdk1.5-unpublished/target/surefire-reports>
for the individual test results.
	at org.apache.maven.lifecycle.internal.MojoExecutor.execute(MojoExecutor.java:213)
	at org.apache.maven.lifecycle.internal.MojoExecutor.execute(MojoExecutor.java:153)
	at org.apache.maven.lifecycle.internal.MojoExecutor.execute(MojoExecutor.java:145)
	at org.apache.maven.lifecycle.internal.LifecycleModuleBuilder.buildProject(LifecycleModuleBuilder.java:84)
	at org.apache.maven.lifecycle.internal.LifecycleModuleBuilder.buildProject(LifecycleModuleBuilder.java:59)
	at org.apache.maven.lifecycle.internal.LifecycleStarter.singleThreadedBuild(LifecycleStarter.java:183)
	at org.apache.maven.lifecycle.internal.LifecycleStarter.execute(LifecycleStarter.java:161)
	at org.apache.maven.DefaultMaven.doExecute(DefaultMaven.java:319)
	at org.apache.maven.DefaultMaven.execute(DefaultMaven.java:156)
	at org.apache.maven.cli.MavenCli.execute(MavenCli.java:537)
	at org.apache.maven.cli.MavenCli.doMain(MavenCli.java:196)
	at org.apache.maven.cli.MavenCli.main(MavenCli.java:141)
	at sun.reflect.NativeMethodAccessorImpl.invoke0(Native Method)
	at sun.reflect.NativeMethodAccessorImpl.invoke(NativeMethodAccessorImpl.java:39)
	at sun.reflect.DelegatingMethodAccessorImpl.invoke(DelegatingMethodAccessorImpl.java:25)
	at java.lang.reflect.Method.invoke(Method.java:592)
	at org.codehaus.plexus.classworlds.launcher.Launcher.launchEnhanced(Launcher.java:290)
	at org.codehaus.plexus.classworlds.launcher.Launcher.launch(Launcher.java:230)
	at org.codehaus.plexus.classworlds.launcher.Launcher.mainWithExitCode(Launcher.java:409)
	at org.codehaus.plexus.classworlds.launcher.Launcher.main(Launcher.java:352)
Caused by: org.apache.maven.plugin.MojoFailureException: There are test failures.

Please refer to <https://builds.apache.org/job/Cayenne-trunk/./cayenneTestConnection=derby,jdk=JDK%201.5%20(latest),label=Ubuntu/ws/trunk/framework/cayenne-jdk1.5-unpublished/target/surefire-reports>
for the individual test results.
	at org.apache.maven.plugin.surefire.SurefirePlugin.execute(SurefirePlugin.java:629)
	at org.apache.maven.plugin.DefaultBuildPluginManager.executeMojo(DefaultBuildPluginManager.java:101)
	at org.apache.maven.lifecycle.internal.MojoExecutor.execute(MojoExecutor.java:209)
	... 19 more
[ERROR] 
[ERROR] Re-run Maven using the -X switch to enable full debug logging.
[ERROR] 
[ERROR] For more information about the errors and possible solutions, please read the following
articles:
[ERROR] [Help 1] http://cwiki.apache.org/confluence/display/MAVEN/MojoFailureException
[ERROR] 
[ERROR] After correcting the problems, you can resume the build with the command
[ERROR]   mvn <goals> -rf :cayenne-jdk1.5-unpublished
Build step 'Invoke top-level Maven targets' marked build as failure

Mime
View raw message