cayenne-commits mailing list archives

Site index · List index
Message view « Date » · « Thread »
Top « Date » · « Thread »
From Apache Jenkins Server <jenk...@builds.apache.org>
Subject Build failed in Jenkins: Cayenne-trunk » h2,JDK 1.7 (latest),Ubuntu #823
Date Sat, 15 Dec 2012 05:48:22 GMT
See <https://builds.apache.org/job/Cayenne-trunk/./cayenneTestConnection=h2,jdk=JDK%201.7%20(latest),label=Ubuntu/823/changes>

Changes:

[johnthuss] Minimize compiler warnings about missing type parameter for SelectQuery

[johnthuss] CAY-1294 Generify query

Adds type parameter to SelectQuery to indicate query result type,
along with a new 'select' method on ObjectContext.

------------------------------------------
[...truncated 123110 lines...]
[INFO] org/apache/cayenne/modeler/init already added, skipping
[INFO] org/apache/cayenne/modeler/init/platform already added, skipping
[INFO] org/apache/cayenne/modeler/pref already added, skipping
[INFO] org/apache/cayenne/modeler/event already added, skipping
[INFO] org/apache/cayenne/modeler/dialog already added, skipping
[INFO] org/apache/cayenne/modeler/dialog/codegen already added, skipping
[INFO] org/apache/cayenne/modeler/dialog/db already added, skipping
[INFO] org/apache/cayenne/modeler/dialog/objentity already added, skipping
[INFO] org/apache/cayenne/modeler/dialog/datadomain already added, skipping
[INFO] org/apache/cayenne/modeler/dialog/query already added, skipping
[INFO] org/apache/cayenne/modeler/dialog/pref already added, skipping
[INFO] org/apache/cayenne/modeler/dialog/autorelationship already added, skipping
[INFO] org/apache/cayenne/modeler/dialog/validator already added, skipping
[INFO] org/apache/cayenne/modeler/dialog/datamap already added, skipping
[INFO] org/apache/cayenne/modeler/action already added, skipping
[INFO] org/apache/cayenne/modeler/editor already added, skipping
[INFO] org/apache/cayenne/modeler/editor/datanode already added, skipping
[INFO] org/apache/cayenne/modeler/editor/dbentity already added, skipping
[INFO] org/apache/cayenne/swing already added, skipping
[INFO] org/apache/cayenne/swing/components already added, skipping
[INFO] org/apache/cayenne/swing/components/textpane already added, skipping
[INFO] org/apache/cayenne/swing/components/textpane/style already added, skipping
[INFO] org/apache/cayenne/swing/components/textpane/syntax already added, skipping
[INFO] org/apache/cayenne/swing/control already added, skipping
[INFO] org/apache/cayenne/pref already added, skipping
[INFO] commons-logging.properties already added, skipping
[INFO] scope.properties already added, skipping
[INFO] pref/Preferences.map.xml already added, skipping
[INFO] pref/ModelerPreferences.map.xml already added, skipping
[INFO] pref/HSQLNode.driver.xml already added, skipping
[INFO] pref/cayenne.xml already added, skipping
[INFO] org/apache/cayenne/modeler/cayennemodeler-strings.properties already added, skipping
[INFO] org/apache/cayenne/modeler/images/icon-zoom-out.png already added, skipping
[INFO] org/apache/cayenne/modeler/images/icon-welcome-open.png already added, skipping
[INFO] org/apache/cayenne/modeler/images/logo.jpg already added, skipping
[INFO] org/apache/cayenne/modeler/images/icon-undo.gif already added, skipping
[INFO] org/apache/cayenne/modeler/images/icon-new_objentity.gif already added, skipping
[INFO] org/apache/cayenne/modeler/images/icon-create-listener.gif already added, skipping
[INFO] org/apache/cayenne/modeler/images/icon-trash.gif already added, skipping
[INFO] org/apache/cayenne/modeler/images/icon-refresh.png already added, skipping
[INFO] org/apache/cayenne/modeler/images/icon-redo.gif already added, skipping
[INFO] org/apache/cayenne/modeler/images/icon-paste.gif already added, skipping
[INFO] org/apache/cayenne/modeler/images/icon-copy.gif already added, skipping
[INFO] org/apache/cayenne/modeler/images/icon-alphab_sort.gif already added, skipping
[INFO] org/apache/cayenne/modeler/images/icon-remove-method.gif already added, skipping
[INFO] org/apache/cayenne/modeler/images/icon-zoom-in.png already added, skipping
[INFO] org/apache/cayenne/modeler/images/icon-sync.gif already added, skipping
[INFO] org/apache/cayenne/modeler/images/error.gif already added, skipping
[INFO] org/apache/cayenne/modeler/images/icon-plus.gif already added, skipping
[INFO] org/apache/cayenne/modeler/images/icon-create-method.gif already added, skipping
[INFO] org/apache/cayenne/modeler/images/icon-relationship.gif already added, skipping
[INFO] org/apache/cayenne/modeler/images/icon-forward_nav.gif already added, skipping
[INFO] org/apache/cayenne/modeler/images/icon-save-as-image.png already added, skipping
[INFO] org/apache/cayenne/modeler/images/icon-objentity.gif already added, skipping
[INFO] org/apache/cayenne/modeler/images/icon-error.gif already added, skipping
[INFO] org/apache/cayenne/modeler/images/icon-attribute.gif already added, skipping
[INFO] org/apache/cayenne/modeler/images/icon-info.gif already added, skipping
[INFO] org/apache/cayenne/modeler/images/icon-move_up.gif already added, skipping
[INFO] org/apache/cayenne/modeler/images/icon-remove-listener.gif already added, skipping
[INFO] org/apache/cayenne/modeler/images/icon-dbentity.gif already added, skipping
[INFO] org/apache/cayenne/modeler/images/icon-embeddable.gif already added, skipping
[INFO] org/apache/cayenne/modeler/images/icon-open.gif already added, skipping
[INFO] org/apache/cayenne/modeler/images/welcome.jpg already added, skipping
[INFO] org/apache/cayenne/modeler/images/icon-gen_java.gif already added, skipping
[INFO] org/apache/cayenne/modeler/images/icon-backward_nav.gif already added, skipping
[INFO] org/apache/cayenne/modeler/images/CayenneModeler.jpg already added, skipping
[INFO] org/apache/cayenne/modeler/images/icon-welcome-open-over.png already added, skipping
[INFO] org/apache/cayenne/modeler/images/icon-welcome-new.png already added, skipping
[INFO] org/apache/cayenne/modeler/images/scroll_right.gif already added, skipping
[INFO] org/apache/cayenne/modeler/images/icon-welcome-new-over.png already added, skipping
[INFO] org/apache/cayenne/modeler/images/icon-new_embeddable.gif already added, skipping
[INFO] org/apache/cayenne/modeler/images/icon-query.gif already added, skipping
[INFO] org/apache/cayenne/modeler/images/icon-move_down.gif already added, skipping
[INFO] org/apache/cayenne/modeler/images/icon-stored-procedure.gif already added, skipping
[INFO] org/apache/cayenne/modeler/images/icon-cut.gif already added, skipping
[INFO] org/apache/cayenne/modeler/images/icon-new.gif already added, skipping
[INFO] org/apache/cayenne/modeler/images/icon-override.gif already added, skipping
[INFO] org/apache/cayenne/modeler/images/icon-datamap.gif already added, skipping
[INFO] org/apache/cayenne/modeler/images/icon-save.gif already added, skipping
[INFO] org/apache/cayenne/modeler/images/icon-node.gif already added, skipping
[INFO] org/apache/cayenne/modeler/images/icon-dom.gif already added, skipping
[INFO] org/apache/cayenne/modeler/images/icon-eomodel.gif already added, skipping
[INFO] 
[INFO] --- maven-install-plugin:2.3.1:install (default-install) @ cayenne-modeler ---
[INFO] Installing <https://builds.apache.org/job/Cayenne-trunk/./cayenneTestConnection=h2,jdk=JDK%201.7%20(latest),label=Ubuntu/ws/trunk/modeler/cayenne-modeler/target/cayenne-modeler-3.2M1-SNAPSHOT.jar>
to <https://builds.apache.org/job/Cayenne-trunk/./cayenneTestConnection=h2,jdk=JDK%201.7%20(latest),label=Ubuntu/ws/.repository/org/apache/cayenne/cayenne-modeler/3.2M1-SNAPSHOT/cayenne-modeler-3.2M1-SNAPSHOT.jar>
[INFO] Installing <https://builds.apache.org/job/Cayenne-trunk/./cayenneTestConnection=h2,jdk=JDK%201.7%20(latest),label=Ubuntu/ws/trunk/modeler/cayenne-modeler/pom.xml>
to <https://builds.apache.org/job/Cayenne-trunk/./cayenneTestConnection=h2,jdk=JDK%201.7%20(latest),label=Ubuntu/ws/.repository/org/apache/cayenne/cayenne-modeler/3.2M1-SNAPSHOT/cayenne-modeler-3.2M1-SNAPSHOT.pom>
[INFO] Installing <https://builds.apache.org/job/Cayenne-trunk/./cayenneTestConnection=h2,jdk=JDK%201.7%20(latest),label=Ubuntu/ws/trunk/modeler/cayenne-modeler/target/cayenne-modeler-3.2M1-SNAPSHOT-sources.jar>
to <https://builds.apache.org/job/Cayenne-trunk/./cayenneTestConnection=h2,jdk=JDK%201.7%20(latest),label=Ubuntu/ws/.repository/org/apache/cayenne/cayenne-modeler/3.2M1-SNAPSHOT/cayenne-modeler-3.2M1-SNAPSHOT-sources.jar>
[INFO]                                                                         
[INFO] ------------------------------------------------------------------------
[INFO] Building Cayenne Modeler Maven Plugin 3.2M1-SNAPSHOT
[INFO] ------------------------------------------------------------------------
[INFO] 
[INFO] --- maven-clean-plugin:2.4.1:clean (default-clean) @ maven-cayenne-modeler-plugin ---
[INFO] 
[INFO] --- maven-plugin-plugin:2.7:descriptor (default-descriptor) @ maven-cayenne-modeler-plugin
---
[WARNING] Using platform encoding (ANSI_X3.4-1968 actually) to read mojo metadata, i.e. build
is platform dependent!
[INFO] Applying mojo extractor for language: java
[INFO] Mojo extractor for language: java found 1 mojo descriptors.
[INFO] Applying mojo extractor for language: bsh
[INFO] Mojo extractor for language: bsh found 0 mojo descriptors.
[INFO] 
[INFO] --- maven-resources-plugin:2.4.3:resources (default-resources) @ maven-cayenne-modeler-plugin
---
[INFO] Using 'UTF-8' encoding to copy filtered resources.
[INFO] skip non existing resourceDirectory <https://builds.apache.org/job/Cayenne-trunk/./cayenneTestConnection=h2,jdk=JDK%201.7%20(latest),label=Ubuntu/ws/trunk/modeler/maven-cayenne-modeler-plugin/src/main/resources>
[INFO] 
[INFO] --- maven-compiler-plugin:2.3.2:compile (default-compile) @ maven-cayenne-modeler-plugin
---
[WARNING] File encoding has not been set, using platform encoding ANSI_X3.4-1968, i.e. build
is platform dependent!
[INFO] Compiling 1 source file to <https://builds.apache.org/job/Cayenne-trunk/./cayenneTestConnection=h2,jdk=JDK%201.7%20(latest),label=Ubuntu/ws/trunk/modeler/maven-cayenne-modeler-plugin/target/classes>
[INFO] 
[INFO] --- maven-resources-plugin:2.4.3:testResources (default-testResources) @ maven-cayenne-modeler-plugin
---
[INFO] Using 'UTF-8' encoding to copy filtered resources.
[INFO] skip non existing resourceDirectory <https://builds.apache.org/job/Cayenne-trunk/./cayenneTestConnection=h2,jdk=JDK%201.7%20(latest),label=Ubuntu/ws/trunk/modeler/maven-cayenne-modeler-plugin/src/test/resources>
[INFO] 
[INFO] --- maven-compiler-plugin:2.3.2:testCompile (default-testCompile) @ maven-cayenne-modeler-plugin
---
[INFO] No sources to compile
[INFO] 
[INFO] --- maven-surefire-plugin:2.5:test (default-test) @ maven-cayenne-modeler-plugin ---
[INFO] No tests to run.
[INFO] 
[INFO] --- maven-jar-plugin:2.3.1:jar (default-jar) @ maven-cayenne-modeler-plugin ---
[INFO] Building jar: <https://builds.apache.org/job/Cayenne-trunk/./cayenneTestConnection=h2,jdk=JDK%201.7%20(latest),label=Ubuntu/ws/trunk/modeler/maven-cayenne-modeler-plugin/target/maven-cayenne-modeler-plugin-3.2M1-SNAPSHOT.jar>
[INFO] 
[INFO] --- maven-plugin-plugin:2.7:addPluginArtifactMetadata (default-addPluginArtifactMetadata)
@ maven-cayenne-modeler-plugin ---
[INFO] 
[INFO] --- maven-install-plugin:2.3.1:install (default-install) @ maven-cayenne-modeler-plugin
---
[INFO] Installing <https://builds.apache.org/job/Cayenne-trunk/./cayenneTestConnection=h2,jdk=JDK%201.7%20(latest),label=Ubuntu/ws/trunk/modeler/maven-cayenne-modeler-plugin/target/maven-cayenne-modeler-plugin-3.2M1-SNAPSHOT.jar>
to <https://builds.apache.org/job/Cayenne-trunk/./cayenneTestConnection=h2,jdk=JDK%201.7%20(latest),label=Ubuntu/ws/.repository/org/apache/cayenne/plugins/maven-cayenne-modeler-plugin/3.2M1-SNAPSHOT/maven-cayenne-modeler-plugin-3.2M1-SNAPSHOT.jar>
[INFO] Installing <https://builds.apache.org/job/Cayenne-trunk/./cayenneTestConnection=h2,jdk=JDK%201.7%20(latest),label=Ubuntu/ws/trunk/modeler/maven-cayenne-modeler-plugin/pom.xml>
to <https://builds.apache.org/job/Cayenne-trunk/./cayenneTestConnection=h2,jdk=JDK%201.7%20(latest),label=Ubuntu/ws/.repository/org/apache/cayenne/plugins/maven-cayenne-modeler-plugin/3.2M1-SNAPSHOT/maven-cayenne-modeler-plugin-3.2M1-SNAPSHOT.pom>
[INFO]                                                                         
[INFO] ------------------------------------------------------------------------
[INFO] Building Cayenne Modeler Parent 3.2M1-SNAPSHOT
[INFO] ------------------------------------------------------------------------
[INFO] 
[INFO] --- maven-clean-plugin:2.4.1:clean (default-clean) @ cayenne-modeler-parent ---
[INFO] 
[INFO] --- maven-install-plugin:2.3.1:install (default-install) @ cayenne-modeler-parent ---
[INFO] Installing <https://builds.apache.org/job/Cayenne-trunk/./cayenneTestConnection=h2,jdk=JDK%201.7%20(latest),label=Ubuntu/ws/trunk/modeler/pom.xml>
to <https://builds.apache.org/job/Cayenne-trunk/./cayenneTestConnection=h2,jdk=JDK%201.7%20(latest),label=Ubuntu/ws/.repository/org/apache/cayenne/parents/cayenne-modeler-parent/3.2M1-SNAPSHOT/cayenne-modeler-parent-3.2M1-SNAPSHOT.pom>
[INFO]                                                                         
[INFO] ------------------------------------------------------------------------
[INFO] Building Cayenne Tutorial 3.2M1-SNAPSHOT
[INFO] ------------------------------------------------------------------------
[INFO] 
[INFO] --- maven-clean-plugin:2.4.1:clean (default-clean) @ tutorial ---
[INFO] 
[INFO] --- maven-resources-plugin:2.4.3:resources (default-resources) @ tutorial ---
[WARNING] Using platform encoding (ANSI_X3.4-1968 actually) to copy filtered resources, i.e.
build is platform dependent!
[INFO] Copying 2 resources
[INFO] 
[INFO] --- maven-compiler-plugin:2.3.2:compile (default-compile) @ tutorial ---
[WARNING] File encoding has not been set, using platform encoding ANSI_X3.4-1968, i.e. build
is platform dependent!
[INFO] Compiling 9 source files to <https://builds.apache.org/job/Cayenne-trunk/./cayenneTestConnection=h2,jdk=JDK%201.7%20(latest),label=Ubuntu/ws/trunk/tutorials/tutorial/target/classes>
[INFO] -------------------------------------------------------------
[ERROR] COMPILATION ERROR : 
[INFO] -------------------------------------------------------------
[ERROR] <https://builds.apache.org/job/Cayenne-trunk/./cayenneTestConnection=h2,jdk=JDK%201.7%20(latest),label=Ubuntu/ws/trunk/tutorials/tutorial/src/main/java/org/apache/cayenne/tutorial/Main.java>:[82,45]
error: cannot find symbol
[ERROR]  class SelectQuery
<https://builds.apache.org/job/Cayenne-trunk/./cayenneTestConnection=h2,jdk=JDK%201.7%20(latest),label=Ubuntu/ws/trunk/tutorials/tutorial/src/main/java/org/apache/cayenne/tutorial/Main.java>:[87,45]
error: cannot find symbol
[ERROR]  class SelectQuery
<https://builds.apache.org/job/Cayenne-trunk/./cayenneTestConnection=h2,jdk=JDK%201.7%20(latest),label=Ubuntu/ws/trunk/tutorials/tutorial/src/main/java/org/apache/cayenne/tutorial/Main.java>:[97,45]
error: cannot find symbol
[ERROR]  class SelectQuery
<https://builds.apache.org/job/Cayenne-trunk/./cayenneTestConnection=h2,jdk=JDK%201.7%20(latest),label=Ubuntu/ws/trunk/tutorials/tutorial/src/main/java/org/apache/cayenne/tutorial/Main.java>:[105,50]
error: cannot find symbol
[INFO] 4 errors 
[INFO] -------------------------------------------------------------
[INFO] ------------------------------------------------------------------------
[INFO] Reactor Summary:
[INFO] 
[INFO] Cayenne ........................................... SUCCESS [0.548s]
[INFO] Common Unit Test Utilities ........................ SUCCESS [2.569s]
[INFO] Cayenne Internal Build Plugin ..................... SUCCESS [1.982s]
[INFO] Cayenne Build Tools Parent ........................ SUCCESS [0.007s]
[INFO] Cayenne License and Notice Bundle ................. SUCCESS [0.682s]
[INFO] Cayenne Dependency Injection Container ............ SUCCESS [2.987s]
[INFO] Cayenne Java 1.5 Unpublished ...................... SUCCESS [1:26.130s]
[INFO] Cayenne WebObjects Compatibility Library .......... SUCCESS [3.146s]
[INFO] Cayenne Aggregated Server Jar ..................... SUCCESS [2.340s]
[INFO] Cayenne Aggregated Client Jar ..................... SUCCESS [1.703s]
[INFO] Cayenne Project ................................... SUCCESS [3.446s]
[INFO] Cayenne Tools ..................................... SUCCESS [6.322s]
[INFO] Library: cayenne-lifecycle ........................ SUCCESS [4.778s]
[INFO] Cayenne Maven Plugin .............................. SUCCESS [2.989s]
[INFO] Cayenne Framework Aggregator Project .............. SUCCESS [0.017s]
[INFO] Cayenne Integration Tests Parent .................. SUCCESS [0.014s]
[INFO] Integration Tests - Cayenne Runtime ............... SUCCESS [3.031s]
[INFO] Integration Tests - Cayenne Tools ................. SUCCESS [2.298s]
[INFO] Cayenne Modeler ................................... SUCCESS [16.046s]
[INFO] Cayenne Modeler Maven Plugin ...................... SUCCESS [0.901s]
[INFO] Cayenne Modeler Parent ............................ SUCCESS [0.014s]
[INFO] Cayenne Tutorial .................................. FAILURE [0.824s]
[INFO] Cayenne ROP Server Tutorial ....................... SKIPPED
[INFO] Cayenne ROP Client Tutorial ....................... SKIPPED
[INFO] Cayenne Tutorials ................................. SKIPPED
[INFO] Cayenne Documentation ............................. SKIPPED
[INFO] Cayenne Documenation Parent ....................... SKIPPED
[INFO] Cayenne Docbook Documentation ..................... SKIPPED
[INFO] Docbook: Cayenne Guide ............................ SKIPPED
[INFO] Docbook: Getting Started with Cayenne ............. SKIPPED
[INFO] Docbook: Getting Started with Cayenne ROP ......... SKIPPED
[INFO] Docbook: Cayenne New Features and Upgrade Guide ... SKIPPED
[INFO] ------------------------------------------------------------------------
[INFO] BUILD FAILURE
[INFO] ------------------------------------------------------------------------
[INFO] Total time: 2:24.220s
[INFO] Finished at: Sat Dec 15 05:48:21 UTC 2012
[INFO] Final Memory: 119M/322M
[INFO] ------------------------------------------------------------------------
[ERROR] Failed to execute goal org.apache.maven.plugins:maven-compiler-plugin:2.3.2:compile
(default-compile) on project tutorial: Compilation failure: Compilation failure:
[ERROR] <https://builds.apache.org/job/Cayenne-trunk/./cayenneTestConnection=h2,jdk=JDK%201.7%20(latest),label=Ubuntu/ws/trunk/tutorials/tutorial/src/main/java/org/apache/cayenne/tutorial/Main.java>:[82,45]
error: cannot find symbol
[ERROR] class SelectQuery
[ERROR] <https://builds.apache.org/job/Cayenne-trunk/./cayenneTestConnection=h2,jdk=JDK%201.7%20(latest),label=Ubuntu/ws/trunk/tutorials/tutorial/src/main/java/org/apache/cayenne/tutorial/Main.java>:[87,45]
error: cannot find symbol
[ERROR] class SelectQuery
[ERROR] <https://builds.apache.org/job/Cayenne-trunk/./cayenneTestConnection=h2,jdk=JDK%201.7%20(latest),label=Ubuntu/ws/trunk/tutorials/tutorial/src/main/java/org/apache/cayenne/tutorial/Main.java>:[97,45]
error: cannot find symbol
[ERROR] class SelectQuery
[ERROR] <https://builds.apache.org/job/Cayenne-trunk/./cayenneTestConnection=h2,jdk=JDK%201.7%20(latest),label=Ubuntu/ws/trunk/tutorials/tutorial/src/main/java/org/apache/cayenne/tutorial/Main.java>:[105,50]
error: cannot find symbol
[ERROR] -> [Help 1]
org.apache.maven.lifecycle.LifecycleExecutionException: Failed to execute goal org.apache.maven.plugins:maven-compiler-plugin:2.3.2:compile
(default-compile) on project tutorial: Compilation failure
	at org.apache.maven.lifecycle.internal.MojoExecutor.execute(MojoExecutor.java:213)
	at org.apache.maven.lifecycle.internal.MojoExecutor.execute(MojoExecutor.java:153)
	at org.apache.maven.lifecycle.internal.MojoExecutor.execute(MojoExecutor.java:145)
	at org.apache.maven.lifecycle.internal.LifecycleModuleBuilder.buildProject(LifecycleModuleBuilder.java:84)
	at org.apache.maven.lifecycle.internal.LifecycleModuleBuilder.buildProject(LifecycleModuleBuilder.java:59)
	at org.apache.maven.lifecycle.internal.LifecycleStarter.singleThreadedBuild(LifecycleStarter.java:183)
	at org.apache.maven.lifecycle.internal.LifecycleStarter.execute(LifecycleStarter.java:161)
	at org.apache.maven.DefaultMaven.doExecute(DefaultMaven.java:319)
	at org.apache.maven.DefaultMaven.execute(DefaultMaven.java:156)
	at org.apache.maven.cli.MavenCli.execute(MavenCli.java:537)
	at org.apache.maven.cli.MavenCli.doMain(MavenCli.java:196)
	at org.apache.maven.cli.MavenCli.main(MavenCli.java:141)
	at sun.reflect.NativeMethodAccessorImpl.invoke0(Native Method)
	at sun.reflect.NativeMethodAccessorImpl.invoke(NativeMethodAccessorImpl.java:57)
	at sun.reflect.DelegatingMethodAccessorImpl.invoke(DelegatingMethodAccessorImpl.java:43)
	at java.lang.reflect.Method.invoke(Method.java:601)
	at org.codehaus.plexus.classworlds.launcher.Launcher.launchEnhanced(Launcher.java:290)
	at org.codehaus.plexus.classworlds.launcher.Launcher.launch(Launcher.java:230)
	at org.codehaus.plexus.classworlds.launcher.Launcher.mainWithExitCode(Launcher.java:409)
	at org.codehaus.plexus.classworlds.launcher.Launcher.main(Launcher.java:352)
Caused by: org.apache.maven.plugin.CompilationFailureException: Compilation failure
	at org.apache.maven.plugin.AbstractCompilerMojo.execute(AbstractCompilerMojo.java:656)
	at org.apache.maven.plugin.CompilerMojo.execute(CompilerMojo.java:128)
	at org.apache.maven.plugin.DefaultBuildPluginManager.executeMojo(DefaultBuildPluginManager.java:101)
	at org.apache.maven.lifecycle.internal.MojoExecutor.execute(MojoExecutor.java:209)
	... 19 more
[ERROR] 
[ERROR] Re-run Maven using the -X switch to enable full debug logging.
[ERROR] 
[ERROR] For more information about the errors and possible solutions, please read the following
articles:
[ERROR] [Help 1] http://cwiki.apache.org/confluence/display/MAVEN/MojoFailureException
[ERROR] 
[ERROR] After correcting the problems, you can resume the build with the command
[ERROR]   mvn <goals> -rf :tutorial
Build step 'Invoke top-level Maven targets' marked build as failure

Mime
View raw message