cayenne-commits mailing list archives

Site index · List index
Message view « Date » · « Thread »
Top « Date » · « Thread »
From Apache Jenkins Server <jenk...@builds.apache.org>
Subject Build failed in Jenkins: Cayenne-trunk » derby,JDK 1.5 (latest),Ubuntu #824
Date Sat, 15 Dec 2012 14:58:54 GMT
See <https://builds.apache.org/job/Cayenne-trunk/./cayenneTestConnection=derby,jdk=JDK%201.5%20(latest),label=Ubuntu/824/changes>

Changes:

[johnthuss] Fix tutorial build

------------------------------------------
[...truncated 118095 lines...]
154 KB           
Downloaded: http://repo1.maven.org/maven2/xpp3/xpp3_min/1.1.4c/xpp3_min-1.1.4c.jar (25 KB
at 2437.1 KB/sec)
158 KB   
162 KB   
166 KB   
170 KB   
174 KB   
178 KB   
178 KB   
         
Downloaded: http://repo1.maven.org/maven2/org/codehaus/plexus/plexus-archiver/1.2/plexus-archiver-1.2.jar
(178 KB at 11838.7 KB/sec)
3 KB     
7 KB   
11 KB   
15 KB   
19 KB   
20 KB   
24 KB   
28 KB   
32 KB   
36 KB   
40 KB   
43 KB   
47 KB   
51 KB   
55 KB   
59 KB   
63 KB   
67 KB   
71 KB   
75 KB   
79 KB   
83 KB   
87 KB   
91 KB   
95 KB   
99 KB   
103 KB   
107 KB   
111 KB   
115 KB   
119 KB   
123 KB   
127 KB   
131 KB   
135 KB   
139 KB   
143 KB   
147 KB   
151 KB   
155 KB   
159 KB   
163 KB   
167 KB   
171 KB   
175 KB   
179 KB   
183 KB   
187 KB   
191 KB   
195 KB   
196 KB   
200 KB   
204 KB   
208 KB   
212 KB   
216 KB   
220 KB   
224 KB   
228 KB   
232 KB   
236 KB   
240 KB   
244 KB   
248 KB   
252 KB   
256 KB   
260 KB   
264 KB   
268 KB   
272 KB   
276 KB   
280 KB   
284 KB   
288 KB   
292 KB   
296 KB   
300 KB   
304 KB   
308 KB   
312 KB   
316 KB   
320 KB   
324 KB   
328 KB   
332 KB   
336 KB   
340 KB   
344 KB   
348 KB   
352 KB   
356 KB   
360 KB   
364 KB   
368 KB   
372 KB   
376 KB   
380 KB   
384 KB   
388 KB   
392 KB   
396 KB   
400 KB   
404 KB   
408 KB   
412 KB   
416 KB   
420 KB   
422 KB   
         
Downloaded: http://repo1.maven.org/maven2/com/thoughtworks/xstream/xstream/1.3.1/xstream-1.3.1.jar
(422 KB at 11386.3 KB/sec)
[INFO] Packaging webapp
[INFO] Assembling webapp [tutorial-rop-server] in [<https://builds.apache.org/job/Cayenne-trunk/./cayenneTestConnection=derby,jdk=JDK%201.5%20(latest),label=Ubuntu/ws/trunk/tutorials/tutorial-rop-server/target/tutorial-rop-server-3.2M1-SNAPSHOT]>
[INFO] Processing war project
[INFO] Copying webapp resources [<https://builds.apache.org/job/Cayenne-trunk/./cayenneTestConnection=derby,jdk=JDK%201.5%20(latest),label=Ubuntu/ws/trunk/tutorials/tutorial-rop-server/src/main/webapp]>
[INFO] Webapp assembled in [116 msecs]
[INFO] Building war: <https://builds.apache.org/job/Cayenne-trunk/./cayenneTestConnection=derby,jdk=JDK%201.5%20(latest),label=Ubuntu/ws/trunk/tutorials/tutorial-rop-server/target/tutorial-rop-server-3.2M1-SNAPSHOT.war>
[INFO] WEB-INF/web.xml already added, skipping
[INFO] 
[INFO] --- maven-install-plugin:2.3.1:install (default-install) @ tutorial-rop-server ---
[INFO] Installing <https://builds.apache.org/job/Cayenne-trunk/./cayenneTestConnection=derby,jdk=JDK%201.5%20(latest),label=Ubuntu/ws/trunk/tutorials/tutorial-rop-server/target/tutorial-rop-server-3.2M1-SNAPSHOT.war>
to <https://builds.apache.org/job/Cayenne-trunk/./cayenneTestConnection=derby,jdk=JDK%201.5%20(latest),label=Ubuntu/ws/.repository/org/apache/cayenne/tutorial-rop-server/3.2M1-SNAPSHOT/tutorial-rop-server-3.2M1-SNAPSHOT.war>
[INFO] Installing <https://builds.apache.org/job/Cayenne-trunk/./cayenneTestConnection=derby,jdk=JDK%201.5%20(latest),label=Ubuntu/ws/trunk/tutorials/tutorial-rop-server/pom.xml>
to <https://builds.apache.org/job/Cayenne-trunk/./cayenneTestConnection=derby,jdk=JDK%201.5%20(latest),label=Ubuntu/ws/.repository/org/apache/cayenne/tutorial-rop-server/3.2M1-SNAPSHOT/tutorial-rop-server-3.2M1-SNAPSHOT.pom>
[INFO]                                                                         
[INFO] ------------------------------------------------------------------------
[INFO] Building Cayenne ROP Client Tutorial 3.2M1-SNAPSHOT
[INFO] ------------------------------------------------------------------------
[INFO] 
[INFO] --- maven-clean-plugin:2.4.1:clean (default-clean) @ tutorial-rop-client ---
[INFO] 
[INFO] --- maven-resources-plugin:2.4.3:resources (default-resources) @ tutorial-rop-client
---
[WARNING] Using platform encoding (ANSI_X3.4-1968 actually) to copy filtered resources, i.e.
build is platform dependent!
[INFO] Copying 1 resource
[INFO] 
[INFO] --- maven-compiler-plugin:2.3.2:compile (default-compile) @ tutorial-rop-client ---
[WARNING] File encoding has not been set, using platform encoding ANSI_X3.4-1968, i.e. build
is platform dependent!
[INFO] Compiling 9 source files to <https://builds.apache.org/job/Cayenne-trunk/./cayenneTestConnection=derby,jdk=JDK%201.5%20(latest),label=Ubuntu/ws/trunk/tutorials/tutorial-rop-client/target/classes>
[INFO] -------------------------------------------------------------
[ERROR] COMPILATION ERROR : 
[INFO] -------------------------------------------------------------
[ERROR] <https://builds.apache.org/job/Cayenne-trunk/./cayenneTestConnection=derby,jdk=JDK%201.5%20(latest),label=Ubuntu/ws/trunk/tutorials/tutorial-rop-client/src/main/java/org/apache/cayenne/tutorial/persistent/client/Main.java>:[81,59]
cannot find symbol
symbol  : method from(java.lang.Class<org.apache.cayenne.tutorial.persistent.client.Painting>,<nulltype>)
location: class org.apache.cayenne.query.SelectQuery
[ERROR] <https://builds.apache.org/job/Cayenne-trunk/./cayenneTestConnection=derby,jdk=JDK%201.5%20(latest),label=Ubuntu/ws/trunk/tutorials/tutorial-rop-client/src/main/java/org/apache/cayenne/tutorial/persistent/client/Main.java>:[86,59]
cannot find symbol
symbol  : method from(java.lang.Class<org.apache.cayenne.tutorial.persistent.client.Painting>,org.apache.cayenne.exp.Expression)
location: class org.apache.cayenne.query.SelectQuery
[ERROR] <https://builds.apache.org/job/Cayenne-trunk/./cayenneTestConnection=derby,jdk=JDK%201.5%20(latest),label=Ubuntu/ws/trunk/tutorials/tutorial-rop-client/src/main/java/org/apache/cayenne/tutorial/persistent/client/Main.java>:[94,64]
cannot find symbol
symbol  : method from(java.lang.Class<org.apache.cayenne.tutorial.persistent.client.Artist>,org.apache.cayenne.exp.Expression)
location: class org.apache.cayenne.query.SelectQuery
[INFO] 3 errors 
[INFO] -------------------------------------------------------------
[INFO] ------------------------------------------------------------------------
[INFO] Reactor Summary:
[INFO] 
[INFO] Cayenne ........................................... SUCCESS [1.860s]
[INFO] Common Unit Test Utilities ........................ SUCCESS [4.133s]
[INFO] Cayenne Internal Build Plugin ..................... SUCCESS [4.210s]
[INFO] Cayenne Build Tools Parent ........................ SUCCESS [0.042s]
[INFO] Cayenne License and Notice Bundle ................. SUCCESS [1.291s]
[INFO] Cayenne Dependency Injection Container ............ SUCCESS [3.063s]
[INFO] Cayenne Java 1.5 Unpublished ...................... SUCCESS [10:17.163s]
[INFO] Cayenne WebObjects Compatibility Library .......... SUCCESS [3.051s]
[INFO] Cayenne Aggregated Server Jar ..................... SUCCESS [3.632s]
[INFO] Cayenne Aggregated Client Jar ..................... SUCCESS [2.263s]
[INFO] Cayenne Project ................................... SUCCESS [5.431s]
[INFO] Cayenne Tools ..................................... SUCCESS [6.717s]
[INFO] Library: cayenne-lifecycle ........................ SUCCESS [4.417s]
[INFO] Cayenne Maven Plugin .............................. SUCCESS [3.004s]
[INFO] Cayenne Framework Aggregator Project .............. SUCCESS [0.023s]
[INFO] Cayenne Integration Tests Parent .................. SUCCESS [0.029s]
[INFO] Integration Tests - Cayenne Runtime ............... SUCCESS [2.232s]
[INFO] Integration Tests - Cayenne Tools ................. SUCCESS [2.501s]
[INFO] Cayenne Modeler ................................... SUCCESS [14.826s]
[INFO] Cayenne Modeler Maven Plugin ...................... SUCCESS [1.068s]
[INFO] Cayenne Modeler Parent ............................ SUCCESS [0.053s]
[INFO] Cayenne Tutorial .................................. SUCCESS [2.277s]
[INFO] Cayenne ROP Server Tutorial ....................... SUCCESS [2.328s]
[INFO] Cayenne ROP Client Tutorial ....................... FAILURE [0.425s]
[INFO] Cayenne Tutorials ................................. SKIPPED
[INFO] Cayenne Documentation ............................. SKIPPED
[INFO] Cayenne Documenation Parent ....................... SKIPPED
[INFO] Cayenne Docbook Documentation ..................... SKIPPED
[INFO] Docbook: Cayenne Guide ............................ SKIPPED
[INFO] Docbook: Getting Started with Cayenne ............. SKIPPED
[INFO] Docbook: Getting Started with Cayenne ROP ......... SKIPPED
[INFO] Docbook: Cayenne New Features and Upgrade Guide ... SKIPPED
[INFO] ------------------------------------------------------------------------
[INFO] BUILD FAILURE
[INFO] ------------------------------------------------------------------------
[INFO] Total time: 11:28.228s
[INFO] Finished at: Sat Dec 15 14:58:53 UTC 2012
[INFO] Final Memory: 31M/110M
[INFO] ------------------------------------------------------------------------
[ERROR] Failed to execute goal org.apache.maven.plugins:maven-compiler-plugin:2.3.2:compile
(default-compile) on project tutorial-rop-client: Compilation failure: Compilation failure:
[ERROR] <https://builds.apache.org/job/Cayenne-trunk/./cayenneTestConnection=derby,jdk=JDK%201.5%20(latest),label=Ubuntu/ws/trunk/tutorials/tutorial-rop-client/src/main/java/org/apache/cayenne/tutorial/persistent/client/Main.java>:[81,59]
cannot find symbol
[ERROR] symbol  : method from(java.lang.Class<org.apache.cayenne.tutorial.persistent.client.Painting>,<nulltype>)
[ERROR] location: class org.apache.cayenne.query.SelectQuery
[ERROR] <https://builds.apache.org/job/Cayenne-trunk/./cayenneTestConnection=derby,jdk=JDK%201.5%20(latest),label=Ubuntu/ws/trunk/tutorials/tutorial-rop-client/src/main/java/org/apache/cayenne/tutorial/persistent/client/Main.java>:[86,59]
cannot find symbol
[ERROR] symbol  : method from(java.lang.Class<org.apache.cayenne.tutorial.persistent.client.Painting>,org.apache.cayenne.exp.Expression)
[ERROR] location: class org.apache.cayenne.query.SelectQuery
[ERROR] <https://builds.apache.org/job/Cayenne-trunk/./cayenneTestConnection=derby,jdk=JDK%201.5%20(latest),label=Ubuntu/ws/trunk/tutorials/tutorial-rop-client/src/main/java/org/apache/cayenne/tutorial/persistent/client/Main.java>:[94,64]
cannot find symbol
[ERROR] symbol  : method from(java.lang.Class<org.apache.cayenne.tutorial.persistent.client.Artist>,org.apache.cayenne.exp.Expression)
[ERROR] location: class org.apache.cayenne.query.SelectQuery
[ERROR] -> [Help 1]
org.apache.maven.lifecycle.LifecycleExecutionException: Failed to execute goal org.apache.maven.plugins:maven-compiler-plugin:2.3.2:compile
(default-compile) on project tutorial-rop-client: Compilation failure
	at org.apache.maven.lifecycle.internal.MojoExecutor.execute(MojoExecutor.java:213)
	at org.apache.maven.lifecycle.internal.MojoExecutor.execute(MojoExecutor.java:153)
	at org.apache.maven.lifecycle.internal.MojoExecutor.execute(MojoExecutor.java:145)
	at org.apache.maven.lifecycle.internal.LifecycleModuleBuilder.buildProject(LifecycleModuleBuilder.java:84)
	at org.apache.maven.lifecycle.internal.LifecycleModuleBuilder.buildProject(LifecycleModuleBuilder.java:59)
	at org.apache.maven.lifecycle.internal.LifecycleStarter.singleThreadedBuild(LifecycleStarter.java:183)
	at org.apache.maven.lifecycle.internal.LifecycleStarter.execute(LifecycleStarter.java:161)
	at org.apache.maven.DefaultMaven.doExecute(DefaultMaven.java:319)
	at org.apache.maven.DefaultMaven.execute(DefaultMaven.java:156)
	at org.apache.maven.cli.MavenCli.execute(MavenCli.java:537)
	at org.apache.maven.cli.MavenCli.doMain(MavenCli.java:196)
	at org.apache.maven.cli.MavenCli.main(MavenCli.java:141)
	at sun.reflect.NativeMethodAccessorImpl.invoke0(Native Method)
	at sun.reflect.NativeMethodAccessorImpl.invoke(NativeMethodAccessorImpl.java:39)
	at sun.reflect.DelegatingMethodAccessorImpl.invoke(DelegatingMethodAccessorImpl.java:25)
	at java.lang.reflect.Method.invoke(Method.java:592)
	at org.codehaus.plexus.classworlds.launcher.Launcher.launchEnhanced(Launcher.java:290)
	at org.codehaus.plexus.classworlds.launcher.Launcher.launch(Launcher.java:230)
	at org.codehaus.plexus.classworlds.launcher.Launcher.mainWithExitCode(Launcher.java:409)
	at org.codehaus.plexus.classworlds.launcher.Launcher.main(Launcher.java:352)
Caused by: org.apache.maven.plugin.CompilationFailureException: Compilation failure
	at org.apache.maven.plugin.AbstractCompilerMojo.execute(AbstractCompilerMojo.java:656)
	at org.apache.maven.plugin.CompilerMojo.execute(CompilerMojo.java:128)
	at org.apache.maven.plugin.DefaultBuildPluginManager.executeMojo(DefaultBuildPluginManager.java:101)
	at org.apache.maven.lifecycle.internal.MojoExecutor.execute(MojoExecutor.java:209)
	... 19 more
[ERROR] 
[ERROR] Re-run Maven using the -X switch to enable full debug logging.
[ERROR] 
[ERROR] For more information about the errors and possible solutions, please read the following
articles:
[ERROR] [Help 1] http://cwiki.apache.org/confluence/display/MAVEN/MojoFailureException
[ERROR] 
[ERROR] After correcting the problems, you can resume the build with the command
[ERROR]   mvn <goals> -rf :tutorial-rop-client
Build step 'Invoke top-level Maven targets' marked build as failure

Mime
View raw message