cayenne-commits mailing list archives

Site index · List index
Message view « Date » · « Thread »
Top « Date » · « Thread »
From Apache Jenkins Server <jenk...@builds.apache.org>
Subject Build failed in Jenkins: Cayenne-trunk » derby,JDK 1.5 (latest),Ubuntu #823
Date Sat, 15 Dec 2012 05:41:50 GMT
See <https://builds.apache.org/job/Cayenne-trunk/./cayenneTestConnection=derby,jdk=JDK%201.5%20(latest),label=Ubuntu/823/changes>

Changes:

[johnthuss] Minimize compiler warnings about missing type parameter for SelectQuery

[johnthuss] CAY-1294 Generify query

Adds type parameter to SelectQuery to indicate query result type,
along with a new 'select' method on ObjectContext.

------------------------------------------
[...truncated 130850 lines...]
2093 KB   
2097 KB   
2101 KB   
2105 KB   
2109 KB   
2113 KB   
2117 KB   
2121 KB   
2125 KB   
2129 KB   
2133 KB   
2137 KB   
2141 KB   
2145 KB   
2149 KB   
2153 KB   
2157 KB   
2161 KB   
2165 KB   
2169 KB   
2173 KB   
2177 KB   
2181 KB   
2185 KB   
2189 KB   
2193 KB   
2197 KB   
2201 KB   
2205 KB   
2209 KB   
2213 KB   
2217 KB   
2221 KB   
2225 KB   
2229 KB   
2233 KB   
2237 KB   
2241 KB   
2245 KB   
2249 KB   
2253 KB   
2257 KB   
2261 KB   
2265 KB   
2269 KB   
2273 KB   
2277 KB   
2281 KB   
2285 KB   
2289 KB   
2293 KB   
2297 KB   
2301 KB   
2305 KB   
2309 KB   
2313 KB   
2317 KB   
2321 KB   
2325 KB   
2329 KB   
2333 KB   
2337 KB   
2341 KB   
2345 KB   
2349 KB   
2353 KB   
2357 KB   
2361 KB   
2365 KB   
2369 KB   
2373 KB   
2377 KB   
2381 KB   
2385 KB   
2389 KB   
2393 KB   
2397 KB   
2401 KB   
2405 KB   
2409 KB   
2413 KB   
2417 KB   
2421 KB   
2425 KB   
2429 KB   
2433 KB   
2437 KB   
2441 KB   
2445 KB   
2449 KB   
2453 KB   
2454 KB   
          
Downloaded: http://repo1.maven.org/maven2/org/apache/derby/derby/10.5.3.0_1/derby-10.5.3.0_1.jar
(2454 KB at 16034.7 KB/sec)
[INFO] 
[INFO] --- maven-clean-plugin:2.4.1:clean (default-clean) @ tutorial ---
Downloading: http://repo1.maven.org/maven2/org/codehaus/plexus/plexus-utils/2.0.5/plexus-utils-2.0.5.jar
          
Downloaded: http://repo1.maven.org/maven2/org/codehaus/plexus/plexus-utils/2.0.5/plexus-utils-2.0.5.jar
(0 B at 0.0 KB/sec)
[INFO] 
[INFO] --- maven-resources-plugin:2.4.3:resources (default-resources) @ tutorial ---
Downloading: http://repo1.maven.org/maven2/org/apache/maven/reporting/maven-reporting-api/2.0.6/maven-reporting-api-2.0.6.jar
Downloading: http://repo1.maven.org/maven2/org/apache/maven/doxia/doxia-sink-api/1.0-alpha-7/doxia-sink-api-1.0-alpha-7.jar
Downloading: http://repo1.maven.org/maven2/commons-cli/commons-cli/1.0/commons-cli-1.0.jar
Downloading: http://repo1.maven.org/maven2/org/codehaus/plexus/plexus-interactivity-api/1.0-alpha-4/plexus-interactivity-api-1.0-alpha-4.jar
Downloading: http://repo1.maven.org/maven2/junit/junit/3.8.1/junit-3.8.1.jar
          
Downloaded: http://repo1.maven.org/maven2/org/apache/maven/reporting/maven-reporting-api/2.0.6/maven-reporting-api-2.0.6.jar
(0 B at 0.0 KB/sec)
Downloading: http://repo1.maven.org/maven2/org/apache/maven/shared/maven-filtering/1.0-beta-4/maven-filtering-1.0-beta-4.jar
          
Downloaded: http://repo1.maven.org/maven2/junit/junit/3.8.1/junit-3.8.1.jar (0 B at 0.0 KB/sec)
Downloading: http://repo1.maven.org/maven2/org/sonatype/plexus/plexus-build-api/0.0.4/plexus-build-api-0.0.4.jar
          
Downloaded: http://repo1.maven.org/maven2/commons-cli/commons-cli/1.0/commons-cli-1.0.jar
(0 B at 0.0 KB/sec)
Downloading: http://repo1.maven.org/maven2/org/codehaus/plexus/plexus-interpolation/1.13/plexus-interpolation-1.13.jar
          
Downloaded: http://repo1.maven.org/maven2/org/apache/maven/doxia/doxia-sink-api/1.0-alpha-7/doxia-sink-api-1.0-alpha-7.jar
(0 B at 0.0 KB/sec)
          
Downloaded: http://repo1.maven.org/maven2/org/sonatype/plexus/plexus-build-api/0.0.4/plexus-build-api-0.0.4.jar
(0 B at 0.0 KB/sec)
          
Downloaded: http://repo1.maven.org/maven2/org/codehaus/plexus/plexus-interpolation/1.13/plexus-interpolation-1.13.jar
(0 B at 0.0 KB/sec)
          
Downloaded: http://repo1.maven.org/maven2/org/apache/maven/shared/maven-filtering/1.0-beta-4/maven-filtering-1.0-beta-4.jar
(0 B at 0.0 KB/sec)
          
Downloaded: http://repo1.maven.org/maven2/org/codehaus/plexus/plexus-interactivity-api/1.0-alpha-4/plexus-interactivity-api-1.0-alpha-4.jar
(0 B at 0.0 KB/sec)
[WARNING] Using platform encoding (ANSI_X3.4-1968 actually) to copy filtered resources, i.e.
build is platform dependent!
[INFO] Copying 2 resources
[INFO] 
[INFO] --- maven-compiler-plugin:2.3.2:compile (default-compile) @ tutorial ---
Downloading: http://repo1.maven.org/maven2/org/codehaus/plexus/plexus-compiler-api/1.8.1/plexus-compiler-api-1.8.1.jar
Downloading: http://repo1.maven.org/maven2/org/codehaus/plexus/plexus-compiler-manager/1.8.1/plexus-compiler-manager-1.8.1.jar
Downloading: http://repo1.maven.org/maven2/org/codehaus/plexus/plexus-compiler-javac/1.8.1/plexus-compiler-javac-1.8.1.jar
          
Downloaded: http://repo1.maven.org/maven2/org/codehaus/plexus/plexus-compiler-api/1.8.1/plexus-compiler-api-1.8.1.jar
(0 B at 0.0 KB/sec)
          
Downloaded: http://repo1.maven.org/maven2/org/codehaus/plexus/plexus-compiler-manager/1.8.1/plexus-compiler-manager-1.8.1.jar
(0 B at 0.0 KB/sec)
          
Downloaded: http://repo1.maven.org/maven2/org/codehaus/plexus/plexus-compiler-javac/1.8.1/plexus-compiler-javac-1.8.1.jar
(0 B at 0.0 KB/sec)
[WARNING] File encoding has not been set, using platform encoding ANSI_X3.4-1968, i.e. build
is platform dependent!
[INFO] Compiling 9 source files to <https://builds.apache.org/job/Cayenne-trunk/./cayenneTestConnection=derby,jdk=JDK%201.5%20(latest),label=Ubuntu/ws/trunk/tutorials/tutorial/target/classes>
[INFO] -------------------------------------------------------------
[ERROR] COMPILATION ERROR : 
[INFO] -------------------------------------------------------------
[ERROR] <https://builds.apache.org/job/Cayenne-trunk/./cayenneTestConnection=derby,jdk=JDK%201.5%20(latest),label=Ubuntu/ws/trunk/tutorials/tutorial/src/main/java/org/apache/cayenne/tutorial/Main.java>:[82,59]
cannot find symbol
symbol  : method from(java.lang.Class<org.apache.cayenne.tutorial.persistent.Painting>,<nulltype>)
location: class org.apache.cayenne.query.SelectQuery
[ERROR] <https://builds.apache.org/job/Cayenne-trunk/./cayenneTestConnection=derby,jdk=JDK%201.5%20(latest),label=Ubuntu/ws/trunk/tutorials/tutorial/src/main/java/org/apache/cayenne/tutorial/Main.java>:[87,59]
cannot find symbol
symbol  : method from(java.lang.Class<org.apache.cayenne.tutorial.persistent.Painting>,org.apache.cayenne.exp.Expression)
location: class org.apache.cayenne.query.SelectQuery
[ERROR] <https://builds.apache.org/job/Cayenne-trunk/./cayenneTestConnection=derby,jdk=JDK%201.5%20(latest),label=Ubuntu/ws/trunk/tutorials/tutorial/src/main/java/org/apache/cayenne/tutorial/Main.java>:[97,59]
cannot find symbol
symbol  : method from(java.lang.Class<org.apache.cayenne.tutorial.persistent.Painting>,org.apache.cayenne.exp.Expression)
location: class org.apache.cayenne.query.SelectQuery
[ERROR] <https://builds.apache.org/job/Cayenne-trunk/./cayenneTestConnection=derby,jdk=JDK%201.5%20(latest),label=Ubuntu/ws/trunk/tutorials/tutorial/src/main/java/org/apache/cayenne/tutorial/Main.java>:[105,64]
cannot find symbol
symbol  : method from(java.lang.Class<org.apache.cayenne.tutorial.persistent.Artist>,org.apache.cayenne.exp.Expression)
location: class org.apache.cayenne.query.SelectQuery
[INFO] 4 errors 
[INFO] -------------------------------------------------------------
[INFO] ------------------------------------------------------------------------
[INFO] Reactor Summary:
[INFO] 
[INFO] Cayenne ........................................... SUCCESS [11.714s]
[INFO] Common Unit Test Utilities ........................ SUCCESS [36.369s]
[INFO] Cayenne Internal Build Plugin ..................... SUCCESS [38.762s]
[INFO] Cayenne Build Tools Parent ........................ SUCCESS [0.036s]
[INFO] Cayenne License and Notice Bundle ................. SUCCESS [8.934s]
[INFO] Cayenne Dependency Injection Container ............ SUCCESS [3.772s]
[INFO] Cayenne Java 1.5 Unpublished ...................... SUCCESS [8:36.806s]
[INFO] Cayenne WebObjects Compatibility Library .......... SUCCESS [3.582s]
[INFO] Cayenne Aggregated Server Jar ..................... SUCCESS [9.176s]
[INFO] Cayenne Aggregated Client Jar ..................... SUCCESS [7.310s]
[INFO] Cayenne Project ................................... SUCCESS [8.463s]
[INFO] Cayenne Tools ..................................... SUCCESS [15.833s]
[INFO] Library: cayenne-lifecycle ........................ SUCCESS [4.264s]
[INFO] Cayenne Maven Plugin .............................. SUCCESS [10.638s]
[INFO] Cayenne Framework Aggregator Project .............. SUCCESS [0.047s]
[INFO] Cayenne Integration Tests Parent .................. SUCCESS [0.065s]
[INFO] Integration Tests - Cayenne Runtime ............... SUCCESS [2.129s]
[INFO] Integration Tests - Cayenne Tools ................. SUCCESS [4.031s]
[INFO] Cayenne Modeler ................................... SUCCESS [15.888s]
[INFO] Cayenne Modeler Maven Plugin ...................... SUCCESS [0.777s]
[INFO] Cayenne Modeler Parent ............................ SUCCESS [0.026s]
[INFO] Cayenne Tutorial .................................. FAILURE [1.541s]
[INFO] Cayenne ROP Server Tutorial ....................... SKIPPED
[INFO] Cayenne ROP Client Tutorial ....................... SKIPPED
[INFO] Cayenne Tutorials ................................. SKIPPED
[INFO] Cayenne Documentation ............................. SKIPPED
[INFO] Cayenne Documenation Parent ....................... SKIPPED
[INFO] Cayenne Docbook Documentation ..................... SKIPPED
[INFO] Docbook: Cayenne Guide ............................ SKIPPED
[INFO] Docbook: Getting Started with Cayenne ............. SKIPPED
[INFO] Docbook: Getting Started with Cayenne ROP ......... SKIPPED
[INFO] Docbook: Cayenne New Features and Upgrade Guide ... SKIPPED
[INFO] ------------------------------------------------------------------------
[INFO] BUILD FAILURE
[INFO] ------------------------------------------------------------------------
[INFO] Total time: 11:51.010s
[INFO] Finished at: Sat Dec 15 05:41:50 UTC 2012
[INFO] Final Memory: 29M/78M
[INFO] ------------------------------------------------------------------------
[ERROR] Failed to execute goal org.apache.maven.plugins:maven-compiler-plugin:2.3.2:compile
(default-compile) on project tutorial: Compilation failure: Compilation failure:
[ERROR] <https://builds.apache.org/job/Cayenne-trunk/./cayenneTestConnection=derby,jdk=JDK%201.5%20(latest),label=Ubuntu/ws/trunk/tutorials/tutorial/src/main/java/org/apache/cayenne/tutorial/Main.java>:[82,59]
cannot find symbol
[ERROR] symbol  : method from(java.lang.Class<org.apache.cayenne.tutorial.persistent.Painting>,<nulltype>)
[ERROR] location: class org.apache.cayenne.query.SelectQuery
[ERROR] <https://builds.apache.org/job/Cayenne-trunk/./cayenneTestConnection=derby,jdk=JDK%201.5%20(latest),label=Ubuntu/ws/trunk/tutorials/tutorial/src/main/java/org/apache/cayenne/tutorial/Main.java>:[87,59]
cannot find symbol
[ERROR] symbol  : method from(java.lang.Class<org.apache.cayenne.tutorial.persistent.Painting>,org.apache.cayenne.exp.Expression)
[ERROR] location: class org.apache.cayenne.query.SelectQuery
[ERROR] <https://builds.apache.org/job/Cayenne-trunk/./cayenneTestConnection=derby,jdk=JDK%201.5%20(latest),label=Ubuntu/ws/trunk/tutorials/tutorial/src/main/java/org/apache/cayenne/tutorial/Main.java>:[97,59]
cannot find symbol
[ERROR] symbol  : method from(java.lang.Class<org.apache.cayenne.tutorial.persistent.Painting>,org.apache.cayenne.exp.Expression)
[ERROR] location: class org.apache.cayenne.query.SelectQuery
[ERROR] <https://builds.apache.org/job/Cayenne-trunk/./cayenneTestConnection=derby,jdk=JDK%201.5%20(latest),label=Ubuntu/ws/trunk/tutorials/tutorial/src/main/java/org/apache/cayenne/tutorial/Main.java>:[105,64]
cannot find symbol
[ERROR] symbol  : method from(java.lang.Class<org.apache.cayenne.tutorial.persistent.Artist>,org.apache.cayenne.exp.Expression)
[ERROR] location: class org.apache.cayenne.query.SelectQuery
[ERROR] -> [Help 1]
org.apache.maven.lifecycle.LifecycleExecutionException: Failed to execute goal org.apache.maven.plugins:maven-compiler-plugin:2.3.2:compile
(default-compile) on project tutorial: Compilation failure
	at org.apache.maven.lifecycle.internal.MojoExecutor.execute(MojoExecutor.java:213)
	at org.apache.maven.lifecycle.internal.MojoExecutor.execute(MojoExecutor.java:153)
	at org.apache.maven.lifecycle.internal.MojoExecutor.execute(MojoExecutor.java:145)
	at org.apache.maven.lifecycle.internal.LifecycleModuleBuilder.buildProject(LifecycleModuleBuilder.java:84)
	at org.apache.maven.lifecycle.internal.LifecycleModuleBuilder.buildProject(LifecycleModuleBuilder.java:59)
	at org.apache.maven.lifecycle.internal.LifecycleStarter.singleThreadedBuild(LifecycleStarter.java:183)
	at org.apache.maven.lifecycle.internal.LifecycleStarter.execute(LifecycleStarter.java:161)
	at org.apache.maven.DefaultMaven.doExecute(DefaultMaven.java:319)
	at org.apache.maven.DefaultMaven.execute(DefaultMaven.java:156)
	at org.apache.maven.cli.MavenCli.execute(MavenCli.java:537)
	at org.apache.maven.cli.MavenCli.doMain(MavenCli.java:196)
	at org.apache.maven.cli.MavenCli.main(MavenCli.java:141)
	at sun.reflect.NativeMethodAccessorImpl.invoke0(Native Method)
	at sun.reflect.NativeMethodAccessorImpl.invoke(NativeMethodAccessorImpl.java:39)
	at sun.reflect.DelegatingMethodAccessorImpl.invoke(DelegatingMethodAccessorImpl.java:25)
	at java.lang.reflect.Method.invoke(Method.java:592)
	at org.codehaus.plexus.classworlds.launcher.Launcher.launchEnhanced(Launcher.java:290)
	at org.codehaus.plexus.classworlds.launcher.Launcher.launch(Launcher.java:230)
	at org.codehaus.plexus.classworlds.launcher.Launcher.mainWithExitCode(Launcher.java:409)
	at org.codehaus.plexus.classworlds.launcher.Launcher.main(Launcher.java:352)
Caused by: org.apache.maven.plugin.CompilationFailureException: Compilation failure
	at org.apache.maven.plugin.AbstractCompilerMojo.execute(AbstractCompilerMojo.java:656)
	at org.apache.maven.plugin.CompilerMojo.execute(CompilerMojo.java:128)
	at org.apache.maven.plugin.DefaultBuildPluginManager.executeMojo(DefaultBuildPluginManager.java:101)
	at org.apache.maven.lifecycle.internal.MojoExecutor.execute(MojoExecutor.java:209)
	... 19 more
[ERROR] 
[ERROR] Re-run Maven using the -X switch to enable full debug logging.
[ERROR] 
[ERROR] For more information about the errors and possible solutions, please read the following
articles:
[ERROR] [Help 1] http://cwiki.apache.org/confluence/display/MAVEN/MojoFailureException
[ERROR] 
[ERROR] After correcting the problems, you can resume the build with the command
[ERROR]   mvn <goals> -rf :tutorial
Build step 'Invoke top-level Maven targets' marked build as failure

Mime
View raw message