cayenne-commits mailing list archives

Site index · List index
Message view « Date » · « Thread »
Top « Date » · « Thread »
From Apache Jenkins Server <jenk...@builds.apache.org>
Subject Build failed in Jenkins: Cayenne-trunk » h2,JDK 1.5 (latest),Ubuntu #773
Date Fri, 19 Oct 2012 13:26:40 GMT
See <https://builds.apache.org/job/Cayenne-trunk/./cayenneTestConnection=h2,jdk=JDK%201.5%20(latest),label=Ubuntu/773/changes>

Changes:

[aadamchik] CAY-1748 IdCoder/EntityIdCoder improvements to work with ObjectIds, including
temp ones

release notes

[aadamchik] CAY-1748 IdCoder/EntityIdCoder improvements to work with ObjectIds, including
temp ones

temp id to string

[aadamchik] CAY-1748 IdCoder/EntityIdCoder improvements to work with ObjectIds, including
temp ones

idCoder.getStringId(ObjectId id)

[aadamchik] CAY-1748 IdCoder/EntityIdCoder improvements to work with ObjectIds, including
temp ones

preliminary refactoring, formatting, removing mentions of 'uuid'

------------------------------------------
[...truncated 119208 lines...]
[INFO] --- maven-source-plugin:2.1.2:jar (bundle-source-jar) @ cayenne-project ---
[INFO] Building jar: <https://builds.apache.org/job/Cayenne-trunk/./cayenneTestConnection=h2,jdk=JDK%201.5%20(latest),label=Ubuntu/ws/trunk/framework/cayenne-project/target/cayenne-project-3.2M1-SNAPSHOT-sources.jar>
[INFO] 
[INFO] --- maven-install-plugin:2.3.1:install (default-install) @ cayenne-project ---
[INFO] Installing <https://builds.apache.org/job/Cayenne-trunk/./cayenneTestConnection=h2,jdk=JDK%201.5%20(latest),label=Ubuntu/ws/trunk/framework/cayenne-project/target/cayenne-project-3.2M1-SNAPSHOT.jar>
to /home/jenkins/.m2/repository/org/apache/cayenne/cayenne-project/3.2M1-SNAPSHOT/cayenne-project-3.2M1-SNAPSHOT.jar
[INFO] Installing <https://builds.apache.org/job/Cayenne-trunk/./cayenneTestConnection=h2,jdk=JDK%201.5%20(latest),label=Ubuntu/ws/trunk/framework/cayenne-project/pom.xml>
to /home/jenkins/.m2/repository/org/apache/cayenne/cayenne-project/3.2M1-SNAPSHOT/cayenne-project-3.2M1-SNAPSHOT.pom
[INFO] Installing <https://builds.apache.org/job/Cayenne-trunk/./cayenneTestConnection=h2,jdk=JDK%201.5%20(latest),label=Ubuntu/ws/trunk/framework/cayenne-project/target/cayenne-project-3.2M1-SNAPSHOT-sources.jar>
to /home/jenkins/.m2/repository/org/apache/cayenne/cayenne-project/3.2M1-SNAPSHOT/cayenne-project-3.2M1-SNAPSHOT-sources.jar
[INFO]                                                                         
[INFO] ------------------------------------------------------------------------
[INFO] Building Cayenne Tools 3.2M1-SNAPSHOT
[INFO] ------------------------------------------------------------------------
[INFO] 
[INFO] --- maven-clean-plugin:2.4.1:clean (default-clean) @ cayenne-tools ---
[INFO] 
[INFO] --- maven-resources-plugin:2.4.3:resources (default-resources) @ cayenne-tools ---
[INFO] Using 'UTF-8' encoding to copy filtered resources.
[INFO] Copying 16 resources
[INFO] 
[INFO] --- maven-remote-resources-plugin:1.2:process (default) @ cayenne-tools ---
[INFO] Setting property: classpath.resource.loader.class => 'org.codehaus.plexus.velocity.ContextClassLoaderResourceLoader'.
[INFO] Setting property: velocimacro.messages.on => 'false'.
[INFO] Setting property: resource.loader => 'classpath'.
[INFO] Setting property: resource.manager.logwhenfound => 'false'.
[INFO] 
[INFO] --- maven-compiler-plugin:2.3.2:compile (default-compile) @ cayenne-tools ---
[WARNING] File encoding has not been set, using platform encoding ANSI_X3.4-1968, i.e. build
is platform dependent!
[INFO] Compiling 28 source files to <https://builds.apache.org/job/Cayenne-trunk/./cayenneTestConnection=h2,jdk=JDK%201.5%20(latest),label=Ubuntu/ws/trunk/framework/cayenne-tools/target/classes>
[INFO] 
[INFO] --- maven-resources-plugin:2.4.3:testResources (default-testResources) @ cayenne-tools
---
[INFO] Using 'UTF-8' encoding to copy filtered resources.
[INFO] Copying 5 resources
[INFO] Copying 54 resources
[INFO] 
[INFO] --- maven-compiler-plugin:2.3.2:testCompile (default-testCompile) @ cayenne-tools ---
[WARNING] File encoding has not been set, using platform encoding ANSI_X3.4-1968, i.e. build
is platform dependent!
[INFO] Compiling 11 source files to <https://builds.apache.org/job/Cayenne-trunk/./cayenneTestConnection=h2,jdk=JDK%201.5%20(latest),label=Ubuntu/ws/trunk/framework/cayenne-tools/target/test-classes>
[INFO] 
[INFO] --- maven-surefire-plugin:2.5:test (default-test) @ cayenne-tools ---
[INFO] Surefire report directory: <https://builds.apache.org/job/Cayenne-trunk/./cayenneTestConnection=h2,jdk=JDK%201.5%20(latest),label=Ubuntu/ws/trunk/framework/cayenne-tools/target/surefire-reports>

-------------------------------------------------------
 T E S T S
-------------------------------------------------------
Running org.apache.cayenne.access.AbstractDbLoaderDelegateTest
Tests run: 5, Failures: 0, Errors: 0, Skipped: 0, Time elapsed: 0.05 sec
Running org.apache.cayenne.gen.StringUtilsTest
Tests run: 1, Failures: 0, Errors: 0, Skipped: 0, Time elapsed: 0.007 sec
Running org.apache.cayenne.gen.EntityUtilsTest
Tests run: 1, Failures: 0, Errors: 0, Skipped: 0, Time elapsed: 0.009 sec
Running org.apache.cayenne.gen.ImportUtilsTest
Tests run: 14, Failures: 0, Errors: 0, Skipped: 0, Time elapsed: 0.011 sec
Running org.apache.cayenne.tools.CayenneGeneratorTaskTest
Tests run: 7, Failures: 0, Errors: 0, Skipped: 0, Time elapsed: 1.13 sec
Running org.apache.cayenne.gen.ClassGenerationActionTest
Tests run: 7, Failures: 0, Errors: 0, Skipped: 0, Time elapsed: 0.185 sec
Running org.apache.cayenne.tools.DbGeneratorTaskTest
Tests run: 4, Failures: 0, Errors: 0, Skipped: 0, Time elapsed: 0.07 sec
Running org.apache.cayenne.tools.NamePatternMatcherTest
Tests run: 3, Failures: 0, Errors: 0, Skipped: 0, Time elapsed: 0.003 sec
Running org.apache.cayenne.tools.CayenneGeneratorTaskCrossMapRelationshipsTest
Tests run: 1, Failures: 0, Errors: 0, Skipped: 0, Time elapsed: 0.046 sec
Running org.apache.cayenne.map.naming.SmartNamingStrategyTest
Tests run: 1, Failures: 0, Errors: 0, Skipped: 0, Time elapsed: 0.046 sec
Running org.apache.cayenne.tools.AntDataPortDelegateTest
Tests run: 1, Failures: 0, Errors: 0, Skipped: 0, Time elapsed: 0.003 sec

Results :

Tests run: 45, Failures: 0, Errors: 0, Skipped: 0

[INFO] 
[INFO] --- maven-jar-plugin:2.3.1:jar (default-jar) @ cayenne-tools ---
[INFO] Building jar: <https://builds.apache.org/job/Cayenne-trunk/./cayenneTestConnection=h2,jdk=JDK%201.5%20(latest),label=Ubuntu/ws/trunk/framework/cayenne-tools/target/cayenne-tools-3.2M1-SNAPSHOT.jar>
[INFO] 
[INFO] >>> maven-source-plugin:2.1.2:jar (bundle-source-jar) @ cayenne-tools >>>
[INFO] 
[INFO] <<< maven-source-plugin:2.1.2:jar (bundle-source-jar) @ cayenne-tools <<<
[INFO] 
[INFO] --- maven-source-plugin:2.1.2:jar (bundle-source-jar) @ cayenne-tools ---
[INFO] org already added, skipping
[INFO] org/apache already added, skipping
[INFO] org/apache/cayenne already added, skipping
[INFO] org/apache/cayenne/tools already added, skipping
[INFO] org already added, skipping
[INFO] org/apache already added, skipping
[INFO] org/apache/cayenne already added, skipping
[INFO] org/apache/cayenne/tools already added, skipping
[INFO] org/apache/cayenne/gen already added, skipping
[INFO] org/apache/cayenne/map already added, skipping
[INFO] org/apache/cayenne/map/naming already added, skipping
[INFO] org/apache/cayenne/access already added, skipping
[INFO] templates already added, skipping
[INFO] templates/v1_2 already added, skipping
[INFO] org/apache/cayenne/tools/antlib.xml already added, skipping
[INFO] templates/v1_2/datamap-superclass.vm already added, skipping
[INFO] templates/v1_2/embeddable-singleclass.vm already added, skipping
[INFO] templates/v1_2/client-datamap-singleclass.vm already added, skipping
[INFO] templates/v1_2/superclass.vm already added, skipping
[INFO] templates/v1_2/client-superclass.vm already added, skipping
[INFO] templates/v1_2/datamap-subclass.vm already added, skipping
[INFO] templates/v1_2/client-datamap-superclass.vm already added, skipping
[INFO] templates/v1_2/embeddable-subclass.vm already added, skipping
[INFO] templates/v1_2/client-subclass.vm already added, skipping
[INFO] templates/v1_2/datamap-singleclass.vm already added, skipping
[INFO] templates/v1_2/subclass.vm already added, skipping
[INFO] templates/v1_2/embeddable-superclass.vm already added, skipping
[INFO] templates/v1_2/light-superclass.vm already added, skipping
[INFO] templates/v1_2/singleclass.vm already added, skipping
[INFO] templates/v1_2/client-datamap-subclass.vm already added, skipping
[INFO] Building jar: <https://builds.apache.org/job/Cayenne-trunk/./cayenneTestConnection=h2,jdk=JDK%201.5%20(latest),label=Ubuntu/ws/trunk/framework/cayenne-tools/target/cayenne-tools-3.2M1-SNAPSHOT-sources.jar>
[INFO] org already added, skipping
[INFO] org/apache already added, skipping
[INFO] org/apache/cayenne already added, skipping
[INFO] org/apache/cayenne/tools already added, skipping
[INFO] org already added, skipping
[INFO] org/apache already added, skipping
[INFO] org/apache/cayenne already added, skipping
[INFO] org/apache/cayenne/tools already added, skipping
[INFO] org/apache/cayenne/gen already added, skipping
[INFO] org/apache/cayenne/map already added, skipping
[INFO] org/apache/cayenne/map/naming already added, skipping
[INFO] org/apache/cayenne/access already added, skipping
[INFO] templates already added, skipping
[INFO] templates/v1_2 already added, skipping
[INFO] org/apache/cayenne/tools/antlib.xml already added, skipping
[INFO] templates/v1_2/datamap-superclass.vm already added, skipping
[INFO] templates/v1_2/embeddable-singleclass.vm already added, skipping
[INFO] templates/v1_2/client-datamap-singleclass.vm already added, skipping
[INFO] templates/v1_2/superclass.vm already added, skipping
[INFO] templates/v1_2/client-superclass.vm already added, skipping
[INFO] templates/v1_2/datamap-subclass.vm already added, skipping
[INFO] templates/v1_2/client-datamap-superclass.vm already added, skipping
[INFO] templates/v1_2/embeddable-subclass.vm already added, skipping
[INFO] templates/v1_2/client-subclass.vm already added, skipping
[INFO] templates/v1_2/datamap-singleclass.vm already added, skipping
[INFO] templates/v1_2/subclass.vm already added, skipping
[INFO] templates/v1_2/embeddable-superclass.vm already added, skipping
[INFO] templates/v1_2/light-superclass.vm already added, skipping
[INFO] templates/v1_2/singleclass.vm already added, skipping
[INFO] templates/v1_2/client-datamap-subclass.vm already added, skipping
[INFO] 
[INFO] --- maven-install-plugin:2.3.1:install (default-install) @ cayenne-tools ---
[INFO] Installing <https://builds.apache.org/job/Cayenne-trunk/./cayenneTestConnection=h2,jdk=JDK%201.5%20(latest),label=Ubuntu/ws/trunk/framework/cayenne-tools/target/cayenne-tools-3.2M1-SNAPSHOT.jar>
to /home/jenkins/.m2/repository/org/apache/cayenne/cayenne-tools/3.2M1-SNAPSHOT/cayenne-tools-3.2M1-SNAPSHOT.jar
[INFO] Installing <https://builds.apache.org/job/Cayenne-trunk/./cayenneTestConnection=h2,jdk=JDK%201.5%20(latest),label=Ubuntu/ws/trunk/framework/cayenne-tools/pom.xml>
to /home/jenkins/.m2/repository/org/apache/cayenne/cayenne-tools/3.2M1-SNAPSHOT/cayenne-tools-3.2M1-SNAPSHOT.pom
[INFO] ------------------------------------------------------------------------
[INFO] Reactor Summary:
[INFO] 
[INFO] Cayenne ........................................... SUCCESS [1.198s]
[INFO] Common Unit Test Utilities ........................ SUCCESS [4.107s]
[INFO] Cayenne Internal Build Plugin ..................... SUCCESS [4.240s]
[INFO] Cayenne Build Tools Parent ........................ SUCCESS [0.032s]
[INFO] Cayenne License and Notice Bundle ................. SUCCESS [1.181s]
[INFO] Cayenne Dependency Injection Container ............ SUCCESS [2.682s]
[INFO] Cayenne Java 1.5 Unpublished ...................... SUCCESS [1:32.866s]
[INFO] Cayenne WebObjects Compatibility Library .......... SUCCESS [2.815s]
[INFO] Cayenne Aggregated Server Jar ..................... SUCCESS [2.950s]
[INFO] Cayenne Aggregated Client Jar ..................... SUCCESS [2.227s]
[INFO] Cayenne Project ................................... SUCCESS [3.345s]
[INFO] Cayenne Tools ..................................... FAILURE [6.134s]
[INFO] Library: cayenne-lifecycle ........................ SKIPPED
[INFO] Cayenne Maven Plugin .............................. SKIPPED
[INFO] Cayenne Framework Aggregator Project .............. SKIPPED
[INFO] Cayenne Integration Tests Parent .................. SKIPPED
[INFO] Integration Tests - Cayenne Runtime ............... SKIPPED
[INFO] Integration Tests - Cayenne Tools ................. SKIPPED
[INFO] Cayenne Modeler ................................... SKIPPED
[INFO] Cayenne Modeler Maven Plugin ...................... SKIPPED
[INFO] Cayenne Modeler Parent ............................ SKIPPED
[INFO] Cayenne Tutorial .................................. SKIPPED
[INFO] Cayenne ROP Server Tutorial ....................... SKIPPED
[INFO] Cayenne ROP Client Tutorial ....................... SKIPPED
[INFO] Cayenne Tutorials ................................. SKIPPED
[INFO] Cayenne Documentation ............................. SKIPPED
[INFO] Cayenne Documenation Parent ....................... SKIPPED
[INFO] Cayenne Docbook Documentation ..................... SKIPPED
[INFO] Docbook: Cayenne Guide ............................ SKIPPED
[INFO] Docbook: Getting Started with Cayenne ............. SKIPPED
[INFO] Docbook: Getting Started with Cayenne ROP ......... SKIPPED
[INFO] Docbook: Cayenne New Features and Upgrade Guide ... SKIPPED
[INFO] ------------------------------------------------------------------------
[INFO] BUILD FAILURE
[INFO] ------------------------------------------------------------------------
[INFO] Total time: 2:06.200s
[INFO] Finished at: Fri Oct 19 13:26:31 UTC 2012
[INFO] Final Memory: 37M/291M
[INFO] ------------------------------------------------------------------------
[ERROR] Failed to execute goal org.apache.maven.plugins:maven-install-plugin:2.3.1:install
(default-install) on project cayenne-tools: Failed to install metadata org.apache.cayenne:cayenne-tools:3.2M1-SNAPSHOT/maven-metadata.xml:
Could not read metadata /home/jenkins/.m2/repository/org/apache/cayenne/cayenne-tools/3.2M1-SNAPSHOT/maven-metadata-local.xml:
input contained no data -> [Help 1]
org.apache.maven.lifecycle.LifecycleExecutionException: Failed to execute goal org.apache.maven.plugins:maven-install-plugin:2.3.1:install
(default-install) on project cayenne-tools: Failed to install metadata org.apache.cayenne:cayenne-tools:3.2M1-SNAPSHOT/maven-metadata.xml:
Could not read metadata /home/jenkins/.m2/repository/org/apache/cayenne/cayenne-tools/3.2M1-SNAPSHOT/maven-metadata-local.xml:
input contained no data
	at org.apache.maven.lifecycle.internal.MojoExecutor.execute(MojoExecutor.java:217)
	at org.apache.maven.lifecycle.internal.MojoExecutor.execute(MojoExecutor.java:153)
	at org.apache.maven.lifecycle.internal.MojoExecutor.execute(MojoExecutor.java:145)
	at org.apache.maven.lifecycle.internal.LifecycleModuleBuilder.buildProject(LifecycleModuleBuilder.java:84)
	at org.apache.maven.lifecycle.internal.LifecycleModuleBuilder.buildProject(LifecycleModuleBuilder.java:59)
	at org.apache.maven.lifecycle.internal.LifecycleStarter.singleThreadedBuild(LifecycleStarter.java:183)
	at org.apache.maven.lifecycle.internal.LifecycleStarter.execute(LifecycleStarter.java:161)
	at org.apache.maven.DefaultMaven.doExecute(DefaultMaven.java:319)
	at org.apache.maven.DefaultMaven.execute(DefaultMaven.java:156)
	at org.apache.maven.cli.MavenCli.execute(MavenCli.java:537)
	at org.apache.maven.cli.MavenCli.doMain(MavenCli.java:196)
	at org.apache.maven.cli.MavenCli.main(MavenCli.java:141)
	at sun.reflect.NativeMethodAccessorImpl.invoke0(Native Method)
	at sun.reflect.NativeMethodAccessorImpl.invoke(NativeMethodAccessorImpl.java:39)
	at sun.reflect.DelegatingMethodAccessorImpl.invoke(DelegatingMethodAccessorImpl.java:25)
	at java.lang.reflect.Method.invoke(Method.java:592)
	at org.codehaus.plexus.classworlds.launcher.Launcher.launchEnhanced(Launcher.java:290)
	at org.codehaus.plexus.classworlds.launcher.Launcher.launch(Launcher.java:230)
	at org.codehaus.plexus.classworlds.launcher.Launcher.mainWithExitCode(Launcher.java:409)
	at org.codehaus.plexus.classworlds.launcher.Launcher.main(Launcher.java:352)
Caused by: org.apache.maven.plugin.MojoExecutionException: Failed to install metadata org.apache.cayenne:cayenne-tools:3.2M1-SNAPSHOT/maven-metadata.xml:
Could not read metadata /home/jenkins/.m2/repository/org/apache/cayenne/cayenne-tools/3.2M1-SNAPSHOT/maven-metadata-local.xml:
input contained no data
	at org.apache.maven.plugin.install.InstallMojo.execute(InstallMojo.java:139)
	at org.apache.maven.plugin.DefaultBuildPluginManager.executeMojo(DefaultBuildPluginManager.java:101)
	at org.apache.maven.lifecycle.internal.MojoExecutor.execute(MojoExecutor.java:209)
	... 19 more
Caused by: org.apache.maven.artifact.installer.ArtifactInstallationException: Failed to install
metadata org.apache.cayenne:cayenne-tools:3.2M1-SNAPSHOT/maven-metadata.xml: Could not read
metadata /home/jenkins/.m2/repository/org/apache/cayenne/cayenne-tools/3.2M1-SNAPSHOT/maven-metadata-local.xml:
input contained no data
	at org.apache.maven.artifact.installer.DefaultArtifactInstaller.install(DefaultArtifactInstaller.java:111)
	at org.apache.maven.plugin.install.InstallMojo.execute(InstallMojo.java:103)
	... 21 more
Caused by: org.sonatype.aether.installation.InstallationException: Failed to install metadata
org.apache.cayenne:cayenne-tools:3.2M1-SNAPSHOT/maven-metadata.xml: Could not read metadata
/home/jenkins/.m2/repository/org/apache/cayenne/cayenne-tools/3.2M1-SNAPSHOT/maven-metadata-local.xml:
input contained no data
	at org.sonatype.aether.impl.internal.DefaultInstaller.install(DefaultInstaller.java:317)
	at org.sonatype.aether.impl.internal.DefaultInstaller.install(DefaultInstaller.java:215)
	at org.sonatype.aether.impl.internal.DefaultInstaller.install(DefaultInstaller.java:162)
	at org.sonatype.aether.impl.internal.DefaultRepositorySystem.install(DefaultRepositorySystem.java:473)
	at org.apache.maven.artifact.installer.DefaultArtifactInstaller.install(DefaultArtifactInstaller.java:107)
	... 22 more
Caused by: org.sonatype.aether.RepositoryException: Could not read metadata /home/jenkins/.m2/repository/org/apache/cayenne/cayenne-tools/3.2M1-SNAPSHOT/maven-metadata-local.xml:
input contained no data
	at org.apache.maven.repository.internal.MavenMetadata.read(MavenMetadata.java:101)
	at org.apache.maven.repository.internal.MavenMetadata.merge(MavenMetadata.java:69)
	at org.sonatype.aether.impl.internal.DefaultInstaller.install(DefaultInstaller.java:305)
	... 26 more
Caused by: java.io.EOFException: input contained no data
	at org.codehaus.plexus.util.xml.pull.MXParser.fillBuf(MXParser.java:3005)
	at org.codehaus.plexus.util.xml.pull.MXParser.more(MXParser.java:3048)
	at org.codehaus.plexus.util.xml.pull.MXParser.parseProlog(MXParser.java:1422)
	at org.codehaus.plexus.util.xml.pull.MXParser.nextImpl(MXParser.java:1407)
	at org.codehaus.plexus.util.xml.pull.MXParser.next(MXParser.java:1105)
	at org.apache.maven.artifact.repository.metadata.io.xpp3.MetadataXpp3Reader.read(MetadataXpp3Reader.java:1193)
	at org.apache.maven.artifact.repository.metadata.io.xpp3.MetadataXpp3Reader.read(MetadataXpp3Reader.java:1122)
	at org.apache.maven.repository.internal.MavenMetadata.read(MavenMetadata.java:97)
	... 28 more
[ERROR] 
[ERROR] Re-run Maven using the -X switch to enable full debug logging.
[ERROR] 
[ERROR] For more information about the errors and possible solutions, please read the following
articles:
[ERROR] [Help 1] http://cwiki.apache.org/confluence/display/MAVEN/MojoExecutionException
[ERROR] 
[ERROR] After correcting the problems, you can resume the build with the command
[ERROR]   mvn <goals> -rf :cayenne-tools
Build step 'Invoke top-level Maven targets' marked build as failure
Archiving artifacts

Mime
View raw message