cayenne-commits mailing list archives

Site index · List index
Message view « Date » · « Thread »
Top « Date » · « Thread »
From Apache Jenkins Server <jenk...@builds.apache.org>
Subject Build failed in Jenkins: Cayenne-31 » derby,JDK 1.7 (latest),Ubuntu #21
Date Sat, 20 Oct 2012 13:30:44 GMT
See <https://builds.apache.org/job/Cayenne-31/./cayenneTestConnection=derby,jdk=JDK%201.7%20(latest),label=Ubuntu/21/changes>

Changes:

[aadamchik] docs: starting on queries

(cherry picked from commit 2f606ecb0d9c90ae60cc7ff97541d2ffbf687794)

[aadamchik] finished webapps section

(cherry picked from commit 3da6ab4797f57a9d5c41bc12219f078bf76f3819)

------------------------------------------
[...truncated 119937 lines...]
[INFO] org already added, skipping
[INFO] org/apache already added, skipping
[INFO] org/apache/cayenne already added, skipping
[INFO] org/apache/cayenne/lifecycle already added, skipping
[INFO] org/apache/cayenne/lifecycle/changeset already added, skipping
[INFO] org/apache/cayenne/lifecycle/relationship already added, skipping
[INFO] org/apache/cayenne/lifecycle/id already added, skipping
[INFO] org/apache/cayenne/lifecycle/sort already added, skipping
[INFO] org/apache/cayenne/lifecycle/cache already added, skipping
[INFO] org/apache/cayenne/lifecycle/audit already added, skipping
[INFO] Building jar: <https://builds.apache.org/job/Cayenne-31/./cayenneTestConnection=derby,jdk=JDK%201.7%20(latest),label=Ubuntu/21/artifact/stable/framework/cayenne-lifecycle/target/cayenne-lifecycle-3.1B2-SNAPSHOT-sources.jar>
[INFO] org already added, skipping
[INFO] org/apache already added, skipping
[INFO] org/apache/cayenne already added, skipping
[INFO] org/apache/cayenne/lifecycle already added, skipping
[INFO] org/apache/cayenne/lifecycle/changeset already added, skipping
[INFO] org/apache/cayenne/lifecycle/relationship already added, skipping
[INFO] org/apache/cayenne/lifecycle/id already added, skipping
[INFO] org/apache/cayenne/lifecycle/sort already added, skipping
[INFO] org/apache/cayenne/lifecycle/cache already added, skipping
[INFO] org/apache/cayenne/lifecycle/audit already added, skipping
[INFO] 
[INFO] --- maven-install-plugin:2.3.1:install (default-install) @ cayenne-lifecycle ---
[INFO] Installing <https://builds.apache.org/job/Cayenne-31/./cayenneTestConnection=derby,jdk=JDK%201.7%20(latest),label=Ubuntu/21/artifact/stable/framework/cayenne-lifecycle/target/cayenne-lifecycle-3.1B2-SNAPSHOT.jar>
to /home/jenkins/.m2/repository/org/apache/cayenne/cayenne-lifecycle/3.1B2-SNAPSHOT/cayenne-lifecycle-3.1B2-SNAPSHOT.jar
[INFO] Installing <https://builds.apache.org/job/Cayenne-31/./cayenneTestConnection=derby,jdk=JDK%201.7%20(latest),label=Ubuntu/ws/stable/framework/cayenne-lifecycle/pom.xml>
to /home/jenkins/.m2/repository/org/apache/cayenne/cayenne-lifecycle/3.1B2-SNAPSHOT/cayenne-lifecycle-3.1B2-SNAPSHOT.pom
[INFO] Installing <https://builds.apache.org/job/Cayenne-31/./cayenneTestConnection=derby,jdk=JDK%201.7%20(latest),label=Ubuntu/21/artifact/stable/framework/cayenne-lifecycle/target/cayenne-lifecycle-3.1B2-SNAPSHOT-sources.jar>
to /home/jenkins/.m2/repository/org/apache/cayenne/cayenne-lifecycle/3.1B2-SNAPSHOT/cayenne-lifecycle-3.1B2-SNAPSHOT-sources.jar
[INFO]                                                                         
[INFO] ------------------------------------------------------------------------
[INFO] Building Cayenne Maven Plugin 3.1B2-SNAPSHOT
[INFO] ------------------------------------------------------------------------
[INFO] 
[INFO] --- maven-clean-plugin:2.4.1:clean (default-clean) @ maven-cayenne-plugin ---
[INFO] 
[INFO] --- maven-plugin-plugin:2.7:descriptor (default-descriptor) @ maven-cayenne-plugin
---
[WARNING] Using platform encoding (ANSI_X3.4-1968 actually) to read mojo metadata, i.e. build
is platform dependent!
[INFO] Applying mojo extractor for language: java
[INFO] Mojo extractor for language: java found 3 mojo descriptors.
[INFO] Applying mojo extractor for language: bsh
[INFO] Mojo extractor for language: bsh found 0 mojo descriptors.
[INFO] 
[INFO] --- maven-resources-plugin:2.4.3:resources (default-resources) @ maven-cayenne-plugin
---
[INFO] Using 'UTF-8' encoding to copy filtered resources.
[INFO] Copying 1 resource
[INFO] 
[INFO] --- maven-compiler-plugin:2.3.2:compile (default-compile) @ maven-cayenne-plugin ---
[WARNING] File encoding has not been set, using platform encoding ANSI_X3.4-1968, i.e. build
is platform dependent!
[INFO] Compiling 4 source files to <https://builds.apache.org/job/Cayenne-31/./cayenneTestConnection=derby,jdk=JDK%201.7%20(latest),label=Ubuntu/ws/stable/framework/maven-cayenne-plugin/target/classes>
[INFO] 
[INFO] --- maven-resources-plugin:2.4.3:testResources (default-testResources) @ maven-cayenne-plugin
---
[INFO] Using 'UTF-8' encoding to copy filtered resources.
[INFO] Copying 3 resources
[INFO] 
[INFO] --- maven-compiler-plugin:2.3.2:testCompile (default-testCompile) @ maven-cayenne-plugin
---
[WARNING] File encoding has not been set, using platform encoding ANSI_X3.4-1968, i.e. build
is platform dependent!
[INFO] Compiling 1 source file to <https://builds.apache.org/job/Cayenne-31/./cayenneTestConnection=derby,jdk=JDK%201.7%20(latest),label=Ubuntu/ws/stable/framework/maven-cayenne-plugin/target/test-classes>
[INFO] 
[INFO] --- maven-surefire-plugin:2.5:test (default-test) @ maven-cayenne-plugin ---
[INFO] Surefire report directory: <https://builds.apache.org/job/Cayenne-31/./cayenneTestConnection=derby,jdk=JDK%201.7%20(latest),label=Ubuntu/ws/stable/framework/maven-cayenne-plugin/target/surefire-reports>

-------------------------------------------------------
 T E S T S
-------------------------------------------------------
Running org.apache.cayenne.tools.CayenneGeneratorMojoTest
[INFO] Generating superclass file: <https://builds.apache.org/job/Cayenne-31/./cayenneTestConnection=derby,jdk=JDK%201.7%20(latest),label=Ubuntu/ws/stable/framework/maven-cayenne-plugin/target/cayenneGeneratedClasses/superPkg/_TestEntity.txt>
[INFO] Generating class file: <https://builds.apache.org/job/Cayenne-31/./cayenneTestConnection=derby,jdk=JDK%201.7%20(latest),label=Ubuntu/ws/stable/framework/maven-cayenne-plugin/target/cayenneGeneratedClasses/pack/TestEntity.txt>
[INFO] Generating superclass file: <https://builds.apache.org/job/Cayenne-31/./cayenneTestConnection=derby,jdk=JDK%201.7%20(latest),label=Ubuntu/ws/stable/framework/maven-cayenne-plugin/target/cayenneGeneratedClasses/superPkg/_Embeddable.txt>
[INFO] Generating class file: <https://builds.apache.org/job/Cayenne-31/./cayenneTestConnection=derby,jdk=JDK%201.7%20(latest),label=Ubuntu/ws/stable/framework/maven-cayenne-plugin/target/cayenneGeneratedClasses/pack/Embeddable.txt>
[INFO] Generating superclass file: <https://builds.apache.org/job/Cayenne-31/./cayenneTestConnection=derby,jdk=JDK%201.7%20(latest),label=Ubuntu/ws/stable/framework/maven-cayenne-plugin/target/cayenneGeneratedClasses/superPkg/_TestDomainMap.txt>
[INFO] Generating class file: <https://builds.apache.org/job/Cayenne-31/./cayenneTestConnection=derby,jdk=JDK%201.7%20(latest),label=Ubuntu/ws/stable/framework/maven-cayenne-plugin/target/cayenneGeneratedClasses/pack/TestDomainMap.txt>
Tests run: 1, Failures: 0, Errors: 0, Skipped: 0, Time elapsed: 0.754 sec

Results :

Tests run: 1, Failures: 0, Errors: 0, Skipped: 0

[INFO] 
[INFO] --- maven-jar-plugin:2.3.1:jar (default-jar) @ maven-cayenne-plugin ---
[INFO] Building jar: <https://builds.apache.org/job/Cayenne-31/./cayenneTestConnection=derby,jdk=JDK%201.7%20(latest),label=Ubuntu/ws/stable/framework/maven-cayenne-plugin/target/maven-cayenne-plugin-3.1B2-SNAPSHOT.jar>
[INFO] 
[INFO] --- maven-plugin-plugin:2.7:addPluginArtifactMetadata (default-addPluginArtifactMetadata)
@ maven-cayenne-plugin ---
[INFO] 
[INFO] --- maven-install-plugin:2.3.1:install (default-install) @ maven-cayenne-plugin ---
[INFO] Installing <https://builds.apache.org/job/Cayenne-31/./cayenneTestConnection=derby,jdk=JDK%201.7%20(latest),label=Ubuntu/ws/stable/framework/maven-cayenne-plugin/target/maven-cayenne-plugin-3.1B2-SNAPSHOT.jar>
to /home/jenkins/.m2/repository/org/apache/cayenne/plugins/maven-cayenne-plugin/3.1B2-SNAPSHOT/maven-cayenne-plugin-3.1B2-SNAPSHOT.jar
[INFO] Installing <https://builds.apache.org/job/Cayenne-31/./cayenneTestConnection=derby,jdk=JDK%201.7%20(latest),label=Ubuntu/ws/stable/framework/maven-cayenne-plugin/pom.xml>
to /home/jenkins/.m2/repository/org/apache/cayenne/plugins/maven-cayenne-plugin/3.1B2-SNAPSHOT/maven-cayenne-plugin-3.1B2-SNAPSHOT.pom
[INFO]                                                                         
[INFO] ------------------------------------------------------------------------
[INFO] Building Cayenne Framework Aggregator Project 3.1B2-SNAPSHOT
[INFO] ------------------------------------------------------------------------
[INFO] 
[INFO] --- maven-clean-plugin:2.4.1:clean (default-clean) @ cayenne-framework-parent ---
[INFO] 
[INFO] --- maven-install-plugin:2.3.1:install (default-install) @ cayenne-framework-parent
---
[INFO] Installing <https://builds.apache.org/job/Cayenne-31/./cayenneTestConnection=derby,jdk=JDK%201.7%20(latest),label=Ubuntu/ws/stable/framework/pom.xml>
to /home/jenkins/.m2/repository/org/apache/cayenne/parents/cayenne-framework-parent/3.1B2-SNAPSHOT/cayenne-framework-parent-3.1B2-SNAPSHOT.pom
[INFO]                                                                         
[INFO] ------------------------------------------------------------------------
[INFO] Building Cayenne Integration Tests Parent 3.1B2-SNAPSHOT
[INFO] ------------------------------------------------------------------------
[INFO] 
[INFO] --- maven-clean-plugin:2.4.1:clean (default-clean) @ cayenne-itests-parent ---
[INFO] 
[INFO] --- maven-install-plugin:2.3.1:install (default-install) @ cayenne-itests-parent ---
[INFO] Installing <https://builds.apache.org/job/Cayenne-31/./cayenneTestConnection=derby,jdk=JDK%201.7%20(latest),label=Ubuntu/ws/stable/itests/pom.xml>
to /home/jenkins/.m2/repository/org/apache/cayenne/itests/cayenne-itests-parent/3.1B2-SNAPSHOT/cayenne-itests-parent-3.1B2-SNAPSHOT.pom
[INFO]                                                                         
[INFO] ------------------------------------------------------------------------
[INFO] Building Integration Tests - Cayenne Runtime 3.1B2-SNAPSHOT
[INFO] ------------------------------------------------------------------------
[INFO] 
[INFO] --- maven-clean-plugin:2.4.1:clean (default-clean) @ cayenne-runtime-itest ---
[INFO] 
[INFO] --- maven-resources-plugin:2.4.3:resources (default-resources) @ cayenne-runtime-itest
---
[INFO] Using 'UTF-8' encoding to copy filtered resources.
[INFO] Copying 3 resources
[INFO] 
[INFO] --- maven-compiler-plugin:2.3.2:compile (default-compile) @ cayenne-runtime-itest ---
[WARNING] File encoding has not been set, using platform encoding ANSI_X3.4-1968, i.e. build
is platform dependent!
[INFO] Compiling 6 source files to <https://builds.apache.org/job/Cayenne-31/./cayenneTestConnection=derby,jdk=JDK%201.7%20(latest),label=Ubuntu/ws/stable/itests/cayenne-runtime-itest/target/classes>
[INFO] 
[INFO] --- maven-resources-plugin:2.4.3:testResources (default-testResources) @ cayenne-runtime-itest
---
[INFO] Using 'UTF-8' encoding to copy filtered resources.
[INFO] skip non existing resourceDirectory <https://builds.apache.org/job/Cayenne-31/./cayenneTestConnection=derby,jdk=JDK%201.7%20(latest),label=Ubuntu/ws/stable/itests/cayenne-runtime-itest/src/test/resources>
[INFO] 
[INFO] --- maven-compiler-plugin:2.3.2:testCompile (default-testCompile) @ cayenne-runtime-itest
---
[WARNING] File encoding has not been set, using platform encoding ANSI_X3.4-1968, i.e. build
is platform dependent!
[INFO] Compiling 1 source file to <https://builds.apache.org/job/Cayenne-31/./cayenneTestConnection=derby,jdk=JDK%201.7%20(latest),label=Ubuntu/ws/stable/itests/cayenne-runtime-itest/target/test-classes>
[INFO] ------------------------------------------------------------------------
[INFO] Reactor Summary:
[INFO] 
[INFO] Cayenne ........................................... SUCCESS [0.268s]
[INFO] Common Unit Test Utilities ........................ SUCCESS [1.789s]
[INFO] Cayenne Internal Build Plugin ..................... SUCCESS [1.871s]
[INFO] Cayenne Build Tools Parent ........................ SUCCESS [0.038s]
[INFO] Cayenne License and Notice Bundle ................. SUCCESS [0.675s]
[INFO] Cayenne Dependency Injection Container ............ SUCCESS [3.372s]
[INFO] Cayenne Java 1.5 Unpublished ...................... SUCCESS [1:32.004s]
[INFO] Cayenne WebObjects Compatibility Library .......... SUCCESS [3.071s]
[INFO] Cayenne Aggregated Server Jar ..................... SUCCESS [2.388s]
[INFO] Cayenne Aggregated Client Jar ..................... SUCCESS [2.921s]
[INFO] Cayenne Project ................................... SUCCESS [3.336s]
[INFO] Cayenne Tools ..................................... SUCCESS [5.593s]
[INFO] Library: cayenne-lifecycle ........................ SUCCESS [4.540s]
[INFO] Cayenne Maven Plugin .............................. SUCCESS [2.309s]
[INFO] Cayenne Framework Aggregator Project .............. SUCCESS [0.011s]
[INFO] Cayenne Integration Tests Parent .................. SUCCESS [0.009s]
[INFO] Integration Tests - Cayenne Runtime ............... FAILURE [4.597s]
[INFO] Integration Tests - Cayenne Tools ................. SKIPPED
[INFO] Cayenne Modeler ................................... SKIPPED
[INFO] Cayenne Modeler Maven Plugin ...................... SKIPPED
[INFO] Cayenne Modeler Parent ............................ SKIPPED
[INFO] Cayenne Tutorial .................................. SKIPPED
[INFO] Cayenne ROP Server Tutorial ....................... SKIPPED
[INFO] Cayenne ROP Client Tutorial ....................... SKIPPED
[INFO] Cayenne Tutorials ................................. SKIPPED
[INFO] Cayenne Documentation ............................. SKIPPED
[INFO] Cayenne Documenation Parent ....................... SKIPPED
[INFO] Cayenne Docbook Documentation ..................... SKIPPED
[INFO] Docbook: Cayenne Guide ............................ SKIPPED
[INFO] Docbook: Getting Started with Cayenne ............. SKIPPED
[INFO] Docbook: Getting Started with Cayenne ROP ......... SKIPPED
[INFO] Docbook: Cayenne New Features and Upgrade Guide ... SKIPPED
[INFO] ------------------------------------------------------------------------
[INFO] BUILD FAILURE
[INFO] ------------------------------------------------------------------------
[INFO] Total time: 2:10.084s
[INFO] Finished at: Sat Oct 20 13:30:41 UTC 2012
[INFO] Final Memory: 37M/1925M
[INFO] ------------------------------------------------------------------------
[ERROR] Failed to execute goal org.apache.maven.plugins:maven-compiler-plugin:2.3.2:testCompile
(default-testCompile) on project cayenne-runtime-itest: Fatal error compiling: Error while
executing the compiler. InvocationTargetException: PermGen space -> [Help 1]
org.apache.maven.lifecycle.LifecycleExecutionException: Failed to execute goal org.apache.maven.plugins:maven-compiler-plugin:2.3.2:testCompile
(default-testCompile) on project cayenne-runtime-itest: Fatal error compiling
	at org.apache.maven.lifecycle.internal.MojoExecutor.execute(MojoExecutor.java:217)
	at org.apache.maven.lifecycle.internal.MojoExecutor.execute(MojoExecutor.java:153)
	at org.apache.maven.lifecycle.internal.MojoExecutor.execute(MojoExecutor.java:145)
	at org.apache.maven.lifecycle.internal.LifecycleModuleBuilder.buildProject(LifecycleModuleBuilder.java:84)
	at org.apache.maven.lifecycle.internal.LifecycleModuleBuilder.buildProject(LifecycleModuleBuilder.java:59)
	at org.apache.maven.lifecycle.internal.LifecycleStarter.singleThreadedBuild(LifecycleStarter.java:183)
	at org.apache.maven.lifecycle.internal.LifecycleStarter.execute(LifecycleStarter.java:161)
	at org.apache.maven.DefaultMaven.doExecute(DefaultMaven.java:319)
	at org.apache.maven.DefaultMaven.execute(DefaultMaven.java:156)
	at org.apache.maven.cli.MavenCli.execute(MavenCli.java:537)
	at org.apache.maven.cli.MavenCli.doMain(MavenCli.java:196)
	at org.apache.maven.cli.MavenCli.main(MavenCli.java:141)
	at sun.reflect.NativeMethodAccessorImpl.invoke0(Native Method)
	at sun.reflect.NativeMethodAccessorImpl.invoke(NativeMethodAccessorImpl.java:57)
	at sun.reflect.DelegatingMethodAccessorImpl.invoke(DelegatingMethodAccessorImpl.java:43)
	at java.lang.reflect.Method.invoke(Method.java:601)
	at org.codehaus.plexus.classworlds.launcher.Launcher.launchEnhanced(Launcher.java:290)
	at org.codehaus.plexus.classworlds.launcher.Launcher.launch(Launcher.java:230)
	at org.codehaus.plexus.classworlds.launcher.Launcher.mainWithExitCode(Launcher.java:409)
	at org.codehaus.plexus.classworlds.launcher.Launcher.main(Launcher.java:352)
Caused by: org.apache.maven.plugin.MojoExecutionException: Fatal error compiling
	at org.apache.maven.plugin.AbstractCompilerMojo.execute(AbstractCompilerMojo.java:610)
	at org.apache.maven.plugin.TestCompilerMojo.execute(TestCompilerMojo.java:161)
	at org.apache.maven.plugin.DefaultBuildPluginManager.executeMojo(DefaultBuildPluginManager.java:101)
	at org.apache.maven.lifecycle.internal.MojoExecutor.execute(MojoExecutor.java:209)
	... 19 more
Caused by: org.codehaus.plexus.compiler.CompilerException: Error while executing the compiler.
	at org.codehaus.plexus.compiler.javac.JavacCompiler.compileInProcess(JavacCompiler.java:568)
	at org.codehaus.plexus.compiler.javac.JavacCompiler.compile(JavacCompiler.java:161)
	at org.apache.maven.plugin.AbstractCompilerMojo.execute(AbstractCompilerMojo.java:605)
	... 22 more
Caused by: java.lang.reflect.InvocationTargetException
	at sun.reflect.NativeMethodAccessorImpl.invoke0(Native Method)
	at sun.reflect.NativeMethodAccessorImpl.invoke(NativeMethodAccessorImpl.java:57)
	at sun.reflect.DelegatingMethodAccessorImpl.invoke(DelegatingMethodAccessorImpl.java:43)
	at java.lang.reflect.Method.invoke(Method.java:601)
	at org.codehaus.plexus.compiler.javac.JavacCompiler.compileInProcess(JavacCompiler.java:554)
	... 24 more
Caused by: java.lang.OutOfMemoryError: PermGen space
	at java.lang.ClassLoader.defineClass1(Native Method)
	at java.lang.ClassLoader.defineClass(ClassLoader.java:791)
	at java.security.SecureClassLoader.defineClass(SecureClassLoader.java:142)
	at java.net.URLClassLoader.defineClass(URLClassLoader.java:449)
	at java.net.URLClassLoader.access$100(URLClassLoader.java:71)
	at java.net.URLClassLoader$1.run(URLClassLoader.java:361)
	at java.net.URLClassLoader$1.run(URLClassLoader.java:355)
	at java.security.AccessController.doPrivileged(Native Method)
	at java.net.URLClassLoader.findClass(URLClassLoader.java:354)
	at org.codehaus.plexus.compiler.javac.IsolatedClassLoader.loadClass(IsolatedClassLoader.java:56)
	at java.util.ResourceBundle$Control.newBundle(ResourceBundle.java:2565)
	at java.util.ResourceBundle.loadBundle(ResourceBundle.java:1436)
	at java.util.ResourceBundle.findBundle(ResourceBundle.java:1400)
	at java.util.ResourceBundle.findBundle(ResourceBundle.java:1354)
	at java.util.ResourceBundle.findBundle(ResourceBundle.java:1354)
	at java.util.ResourceBundle.getBundleImpl(ResourceBundle.java:1296)
	at java.util.ResourceBundle.getBundle(ResourceBundle.java:796)
	at com.sun.tools.javac.util.JavacMessages.getBundles(JavacMessages.java:121)
	at com.sun.tools.javac.util.JavacMessages.setCurrentLocale(JavacMessages.java:73)
	at com.sun.tools.javac.util.JavacMessages.<init>(JavacMessages.java:98)
	at com.sun.tools.javac.util.JavacMessages.<init>(JavacMessages.java:88)
	at com.sun.tools.javac.main.Main.getLocalizedString(Main.java:584)
	at com.sun.tools.javac.main.Main.resourceMessage(Main.java:527)
	at com.sun.tools.javac.main.Main.compile(Main.java:459)
	at com.sun.tools.javac.main.Main.compile(Main.java:353)
	at com.sun.tools.javac.main.Main.compile(Main.java:342)
	at com.sun.tools.javac.main.Main.compile(Main.java:333)
	at com.sun.tools.javac.Main.compile(Main.java:94)
	at sun.reflect.NativeMethodAccessorImpl.invoke0(Native Method)
	at sun.reflect.NativeMethodAccessorImpl.invoke(NativeMethodAccessorImpl.java:57)
	at sun.reflect.DelegatingMethodAccessorImpl.invoke(DelegatingMethodAccessorImpl.java:43)
	at java.lang.reflect.Method.invoke(Method.java:601)
[ERROR] 
[ERROR] Re-run Maven using the -X switch to enable full debug logging.
[ERROR] 
[ERROR] For more information about the errors and possible solutions, please read the following
articles:
[ERROR] [Help 1] http://cwiki.apache.org/confluence/display/MAVEN/MojoExecutionException
[ERROR] 
[ERROR] After correcting the problems, you can resume the build with the command
[ERROR]   mvn <goals> -rf :cayenne-runtime-itest
Build step 'Invoke top-level Maven targets' marked build as failure
Archiving artifacts

Mime
View raw message