cayenne-commits mailing list archives

Site index · List index
Message view « Date » · « Thread »
Top « Date » · « Thread »
From Apache Jenkins Server <jenk...@builds.apache.org>
Subject Build failed in Jenkins: Cayenne-trunk » HSQLDB,true,JDK 1.6 (latest),Ubuntu #740
Date Mon, 16 Jul 2012 00:28:24 GMT
See <https://builds.apache.org/job/Cayenne-trunk/./cayenneTestConnection=HSQLDB,collationCi=true,jdk=JDK%201.6%20(latest),label=Ubuntu/740/changes>

Changes:

[johnthuss] CAY-1647 Easily switch to/from ObjEntity and DbEntity in Modeler

[johnthuss] CAY-1646 Synchronize tabs in Modeler between ObjEntity and DbEntity editor panes

[aadamchik] docs

[aadamchik] documenting API throughts..

[aadamchik] unit test

[johnthuss] Refactor rename reflect.Property to PropertyDescriptor to avoid confusion with
new exp.Property

[johnthuss] CAY-1724 Add 'Property' class for easier and better Expression creation

[aadamchik] CAY-1725 NullPointerException from call to removeToManyTarget

release notes

[aadamchik] CAY-1725 NullPointerException from call to removeToManyTarget

proper quoting of the query

[aadamchik] CAY-1725 NullPointerException from call to removeToManyTarget

do not swallow the underlying exception that confuses the users downstream

[aadamchik] fixing compile error - replacing removed constructor

[aadamchik] this test is no longer needed

[aadamchik] CAY-1718 Remove everything deprecated in 3.1

release notes

[aadamchik] cleanup

[aadamchik] CAY-1718 Remove everything deprecated in 3.1

in progress

[aadamchik] CAY-1718 Remove everything deprecated in 3.1

in progress

[aadamchik] CAY-1718 Remove everything deprecated in 3.1

in progress

[aadamchik] CAY-1718 Remove everything deprecated in 3.1

in progress

[aadamchik] CAY-1718 Remove everything deprecated in 3.1

in progress

[aadamchik] CAY-1718 Remove everything deprecated in 3.1

in progress

[aadamchik] CAY-1718 Remove everything deprecated in 3.1

in progress

[aadamchik] CAY-1718 Remove everything deprecated in 3.1

in progress

[aadamchik] CAY-1718 Remove everything deprecated in 3.1

in progress

[aadamchik] CAY-1718 Remove everything deprecated in 3.1

in progress

[aadamchik] CAY-1718 Remove everything deprecated in 3.1

in progress

[aadamchik] CAY-1718 Remove everything deprecated in 3.1

in progress

[aadamchik] CAY-1718 Remove everything deprecated in 3.1

in progress

[aadamchik] CAY-1718 Remove everything deprecated in 3.1

in progress

[aadamchik] CAY-1718 Remove everything deprecated in 3.1

in progress

[aadamchik] CAY-1718 Remove everything deprecated in 3.1

in progress

[aadamchik] CAY-1718 Remove everything deprecated in 3.1

in progress

[aadamchik] CAY-1718 Remove everything deprecated in 3.1

in progress

[aadamchik] CAY-1718 Remove everything deprecated in 3.1

in progress

[aadamchik] CAY-1718 Remove everything deprecated in 3.1

in progress

[aadamchik] CAY-1718 Remove everything deprecated in 3.1

in progress

[aadamchik] CAY-1718 Remove everything deprecated in 3.1

in progress

[aadamchik] CAY-1718 Remove everything deprecated in 3.1

in progress

[aadamchik] CAY-1718 Remove everything deprecated in 3.1

in progress

[aadamchik] CAY-1718 Remove everything deprecated in 3.1

in progress - removing XML package

[aadamchik] CAY-1718 Remove everything deprecated in 3.1

in progress - removing XML package

[aadamchik] turning tutorials to a maven project

[aadamchik] CAY-1718 Remove everything deprecated in 3.1

in progress

[aadamchik] CAY-1718 Remove everything deprecated in 3.1

in progress

[aadamchik] trimming release notes even more radically

[aadamchik] removing very old RELEASE-NOTES records from trunk version to avoid confusion
as to when and what was fixed

[aadamchik] syncing multiple release info

[oltka] CAY-1721 added note to RELEASE-NOTES.txt
(cherry picked from commit f51d7a6e39b870b84a63a6099753748c027efbdd)

[oltka] CAY-1721 Writing blobs fails (Oracle)

[johnthuss] Forgot to actually add comment back in for last commit

[johnthuss] CAY-1719 Modeler - Obj Attribute Java Type editor won't focus sometimes

[johnthuss] CAY-1677 Modeler: text fields discard input unless you press enter

[aadamchik] merging RELEASE-NOTES from 3.1 stable to master

all 3.1 bug fixes should appears as history on 3.2

[aadamchik] CAY-1689 [PATCH] LOB*QueryBuilders do not check isQuotingSQLIdentifiers

minor cleanup

[aadamchik] CAY-1689 [PATCH] LOB*QueryBuilders do not check isQuotingSQLIdentifiers

patch by Joerg Schoenfisch

[aadamchik] CAY-1717 [PATCH] Implement JDBC compatibility layer methods

patch by Joerg Schoenfisch

[oltka] CAY-1715 changed the test name

[oltka] CAY-1715 Passing parameters to mapped EJBQL queries

[johnthuss] Rename inconsistently named property 'cayenne.rop.service.timeout'

[mgentry] Added missing @Deprecated annotations from methods which only had @deprecated in
the JavaDoc section.

[amaniatis] Fix location of OGNL library

[amaniatis] Update release notes with some dates I was able to locate and fix current release
as b1 not M4

[aadamchik] CAY-1709 Some typos in setup.xml and including-cayenne-in-project.xml files

patch by Gilberto C Andrade

------------------------------------------
[...truncated 115923 lines...]
Jul 16, 2012 12:28:22 AM org.apache.cayenne.log.CommonsJdbcEventLogger logCommitTransaction
INFO: +++ transaction committed.
Jul 16, 2012 12:28:22 AM org.apache.cayenne.test.jdbc.UtilityLogger log
INFO: update ARTIST set ARTIST_NAME = ? where ARTIST_ID = ?
Jul 16, 2012 12:28:22 AM org.apache.cayenne.log.CommonsJdbcEventLogger logBeginTransaction
INFO: --- transaction started.
Jul 16, 2012 12:28:22 AM org.apache.cayenne.log.CommonsJdbcEventLogger logQuery
INFO: SELECT t0.DATE_OF_BIRTH, t0.ARTIST_ID, t0.ARTIST_NAME FROM ARTIST t0
Jul 16, 2012 12:28:22 AM org.apache.cayenne.log.CommonsJdbcEventLogger logSelectCount
INFO: === returned 1 row. - took 0 ms.
Jul 16, 2012 12:28:22 AM org.apache.cayenne.log.CommonsJdbcEventLogger logCommitTransaction
INFO: +++ transaction committed.
Tests run: 4, Failures: 0, Errors: 0, Skipped: 0, Time elapsed: 0.041 sec
Running org.apache.cayenne.access.NestedDataContextParentPeerEventsTest
Jul 16, 2012 12:28:22 AM org.apache.cayenne.configuration.XMLDataChannelDescriptorLoader load
INFO: Loading XML configuration resource from <https://builds.apache.org/job/Cayenne-trunk/./cayenneTestConnection=HSQLDB,collationCi=true,jdk=JDK%201.6%20(latest),label=Ubuntu/ws/trunk/framework/cayenne-jdk1.5-unpublished/target/test-classes/cayenne-relationships.xml>
Jul 16, 2012 12:28:22 AM org.apache.cayenne.configuration.XMLDataChannelDescriptorLoader$DataChannelChildrenHandler
createChildTagHandler
INFO: Loading XML DataMap resource from <https://builds.apache.org/job/Cayenne-trunk/./cayenneTestConnection=HSQLDB,collationCi=true,jdk=JDK%201.6%20(latest),label=Ubuntu/ws/trunk/framework/cayenne-jdk1.5-unpublished/target/test-classes/relationships.map.xml>
Jul 16, 2012 12:28:22 AM org.apache.cayenne.map.EntityResolver applyDBLayerDefaults
INFO: added runtime complimentary DbRelationship from DELETE_RULE_TEST3 to DELETE_RULE_TEST1
Jul 16, 2012 12:28:22 AM org.apache.cayenne.map.EntityResolver applyObjectLayerDefaults
INFO: added runtime complimentary ObjRelationship from FlattenedTest3 to FlattenedTest1
Jul 16, 2012 12:28:22 AM org.apache.cayenne.map.EntityResolver applyObjectLayerDefaults
INFO: added runtime complimentary ObjRelationship from FlattenedTest4 to FlattenedTest1
Jul 16, 2012 12:28:22 AM org.apache.cayenne.log.CommonsJdbcEventLogger logBeginTransaction
INFO: --- transaction started.
Jul 16, 2012 12:28:22 AM org.apache.cayenne.log.CommonsJdbcEventLogger logQuery
INFO: SELECT NEXT_ID FROM AUTO_PK_SUPPORT WHERE TABLE_NAME = 'MASTER'
Jul 16, 2012 12:28:22 AM org.apache.cayenne.log.CommonsJdbcEventLogger logSelectCount
INFO: === returned 1 row. - took 0 ms.
Jul 16, 2012 12:28:22 AM org.apache.cayenne.log.CommonsJdbcEventLogger logQuery
INFO: UPDATE AUTO_PK_SUPPORT SET NEXT_ID = NEXT_ID + 20 WHERE TABLE_NAME = 'MASTER'
Jul 16, 2012 12:28:22 AM org.apache.cayenne.log.CommonsJdbcEventLogger logUpdateCount
INFO: === updated 1 row.
Jul 16, 2012 12:28:22 AM org.apache.cayenne.log.CommonsJdbcEventLogger logQuery
INFO: INSERT INTO MASTER (ID, NAME) VALUES (?, ?)
Jul 16, 2012 12:28:22 AM org.apache.cayenne.log.CommonsJdbcEventLogger logQueryParameters
INFO: [bind: 1->ID:200, 2->NAME:'X']
Jul 16, 2012 12:28:22 AM org.apache.cayenne.log.CommonsJdbcEventLogger logUpdateCount
INFO: === updated 1 row.
Jul 16, 2012 12:28:22 AM org.apache.cayenne.log.CommonsJdbcEventLogger logCommitTransaction
INFO: +++ transaction committed.
Jul 16, 2012 12:28:22 AM org.apache.cayenne.log.CommonsJdbcEventLogger logBeginTransaction
INFO: --- transaction started.
Jul 16, 2012 12:28:22 AM org.apache.cayenne.log.CommonsJdbcEventLogger logQuery
INFO: UPDATE MASTER SET NAME = ? WHERE ID = ?
Jul 16, 2012 12:28:22 AM org.apache.cayenne.log.CommonsJdbcEventLogger logQueryParameters
INFO: [bind: 1->NAME:'Y', 2->ID:200]
Jul 16, 2012 12:28:22 AM org.apache.cayenne.log.CommonsJdbcEventLogger logUpdateCount
INFO: === updated 1 row.
Jul 16, 2012 12:28:22 AM org.apache.cayenne.log.CommonsJdbcEventLogger logCommitTransaction
INFO: +++ transaction committed.
Jul 16, 2012 12:28:23 AM org.apache.cayenne.configuration.XMLDataChannelDescriptorLoader load
INFO: Loading XML configuration resource from <https://builds.apache.org/job/Cayenne-trunk/./cayenneTestConnection=HSQLDB,collationCi=true,jdk=JDK%201.6%20(latest),label=Ubuntu/ws/trunk/framework/cayenne-jdk1.5-unpublished/target/test-classes/cayenne-relationships.xml>
Jul 16, 2012 12:28:23 AM org.apache.cayenne.configuration.XMLDataChannelDescriptorLoader$DataChannelChildrenHandler
createChildTagHandler
INFO: Loading XML DataMap resource from <https://builds.apache.org/job/Cayenne-trunk/./cayenneTestConnection=HSQLDB,collationCi=true,jdk=JDK%201.6%20(latest),label=Ubuntu/ws/trunk/framework/cayenne-jdk1.5-unpublished/target/test-classes/relationships.map.xml>
Jul 16, 2012 12:28:23 AM org.apache.cayenne.map.EntityResolver applyDBLayerDefaults
INFO: added runtime complimentary DbRelationship from DELETE_RULE_TEST3 to DELETE_RULE_TEST1
Jul 16, 2012 12:28:23 AM org.apache.cayenne.map.EntityResolver applyObjectLayerDefaults
INFO: added runtime complimentary ObjRelationship from FlattenedTest3 to FlattenedTest1
Jul 16, 2012 12:28:23 AM org.apache.cayenne.map.EntityResolver applyObjectLayerDefaults
INFO: added runtime complimentary ObjRelationship from FlattenedTest4 to FlattenedTest1
Jul 16, 2012 12:28:23 AM org.apache.cayenne.log.CommonsJdbcEventLogger logBeginTransaction
INFO: --- transaction started.
Jul 16, 2012 12:28:23 AM org.apache.cayenne.log.CommonsJdbcEventLogger logQuery
INFO: SELECT NEXT_ID FROM AUTO_PK_SUPPORT WHERE TABLE_NAME = 'CHILD'
Jul 16, 2012 12:28:23 AM org.apache.cayenne.log.CommonsJdbcEventLogger logSelectCount
INFO: === returned 1 row. - took 0 ms.
Jul 16, 2012 12:28:23 AM org.apache.cayenne.log.CommonsJdbcEventLogger logQuery
INFO: UPDATE AUTO_PK_SUPPORT SET NEXT_ID = NEXT_ID + 20 WHERE TABLE_NAME = 'CHILD'
Jul 16, 2012 12:28:23 AM org.apache.cayenne.log.CommonsJdbcEventLogger logUpdateCount
INFO: === updated 1 row.
Jul 16, 2012 12:28:23 AM org.apache.cayenne.log.CommonsJdbcEventLogger logQuery
INFO: INSERT INTO MASTER (ID, NAME) VALUES (?, ?)
Jul 16, 2012 12:28:23 AM org.apache.cayenne.log.CommonsJdbcEventLogger logQueryParameters
INFO: [bind: 1->ID:201, 2->NAME:'X']
Jul 16, 2012 12:28:23 AM org.apache.cayenne.log.CommonsJdbcEventLogger logUpdateCount
INFO: === updated 1 row.
Jul 16, 2012 12:28:23 AM org.apache.cayenne.log.CommonsJdbcEventLogger logQueryParameters
INFO: [bind: 1->ID:202, 2->NAME:'Y']
Jul 16, 2012 12:28:23 AM org.apache.cayenne.log.CommonsJdbcEventLogger logUpdateCount
INFO: === updated 1 row.
Jul 16, 2012 12:28:23 AM org.apache.cayenne.log.CommonsJdbcEventLogger logQuery
INFO: INSERT INTO CHILD (ID, MASTER_ID) VALUES (?, ?)
Jul 16, 2012 12:28:23 AM org.apache.cayenne.log.CommonsJdbcEventLogger logQueryParameters
INFO: [bind: 1->ID:200, 2->MASTER_ID:201]
Jul 16, 2012 12:28:23 AM org.apache.cayenne.log.CommonsJdbcEventLogger logUpdateCount
INFO: === updated 1 row.
Jul 16, 2012 12:28:23 AM org.apache.cayenne.log.CommonsJdbcEventLogger logCommitTransaction
INFO: +++ transaction committed.
Jul 16, 2012 12:28:23 AM org.apache.cayenne.log.CommonsJdbcEventLogger logBeginTransaction
INFO: --- transaction started.
Jul 16, 2012 12:28:23 AM org.apache.cayenne.log.CommonsJdbcEventLogger logQuery
INFO: UPDATE CHILD SET MASTER_ID = ? WHERE ID = ?
Jul 16, 2012 12:28:23 AM org.apache.cayenne.log.CommonsJdbcEventLogger logQueryParameters
INFO: [bind: 1->MASTER_ID:202, 2->ID:200]
Jul 16, 2012 12:28:23 AM org.apache.cayenne.log.CommonsJdbcEventLogger logUpdateCount
INFO: === updated 1 row.
Jul 16, 2012 12:28:23 AM org.apache.cayenne.log.CommonsJdbcEventLogger logCommitTransaction
INFO: +++ transaction committed.
Jul 16, 2012 12:28:23 AM org.apache.cayenne.configuration.XMLDataChannelDescriptorLoader load
INFO: Loading XML configuration resource from <https://builds.apache.org/job/Cayenne-trunk/./cayenneTestConnection=HSQLDB,collationCi=true,jdk=JDK%201.6%20(latest),label=Ubuntu/ws/trunk/framework/cayenne-jdk1.5-unpublished/target/test-classes/cayenne-relationships.xml>
Jul 16, 2012 12:28:23 AM org.apache.cayenne.configuration.XMLDataChannelDescriptorLoader$DataChannelChildrenHandler
createChildTagHandler
INFO: Loading XML DataMap resource from <https://builds.apache.org/job/Cayenne-trunk/./cayenneTestConnection=HSQLDB,collationCi=true,jdk=JDK%201.6%20(latest),label=Ubuntu/ws/trunk/framework/cayenne-jdk1.5-unpublished/target/test-classes/relationships.map.xml>
Jul 16, 2012 12:28:23 AM org.apache.cayenne.map.EntityResolver applyDBLayerDefaults
INFO: added runtime complimentary DbRelationship from DELETE_RULE_TEST3 to DELETE_RULE_TEST1
Jul 16, 2012 12:28:23 AM org.apache.cayenne.map.EntityResolver applyObjectLayerDefaults
INFO: added runtime complimentary ObjRelationship from FlattenedTest3 to FlattenedTest1
Jul 16, 2012 12:28:23 AM org.apache.cayenne.map.EntityResolver applyObjectLayerDefaults
INFO: added runtime complimentary ObjRelationship from FlattenedTest4 to FlattenedTest1
Jul 16, 2012 12:28:23 AM org.apache.cayenne.log.CommonsJdbcEventLogger logBeginTransaction
INFO: --- transaction started.
Jul 16, 2012 12:28:23 AM org.apache.cayenne.log.CommonsJdbcEventLogger logQuery
INFO: INSERT INTO MASTER (ID, NAME) VALUES (?, ?)
Jul 16, 2012 12:28:23 AM org.apache.cayenne.log.CommonsJdbcEventLogger logQueryParameters
INFO: [bind: 1->ID:203, 2->NAME:'X']
Jul 16, 2012 12:28:23 AM org.apache.cayenne.log.CommonsJdbcEventLogger logUpdateCount
INFO: === updated 1 row.
Jul 16, 2012 12:28:23 AM org.apache.cayenne.log.CommonsJdbcEventLogger logQuery
INFO: INSERT INTO CHILD (ID, MASTER_ID) VALUES (?, ?)
Jul 16, 2012 12:28:23 AM org.apache.cayenne.log.CommonsJdbcEventLogger logQueryParameters
INFO: [bind: 1->ID:201, 2->MASTER_ID:203]
Jul 16, 2012 12:28:23 AM org.apache.cayenne.log.CommonsJdbcEventLogger logUpdateCount
INFO: === updated 1 row.
Jul 16, 2012 12:28:23 AM org.apache.cayenne.log.CommonsJdbcEventLogger logQueryParameters
INFO: [bind: 1->ID:202, 2->MASTER_ID:NULL]
Jul 16, 2012 12:28:23 AM org.apache.cayenne.log.CommonsJdbcEventLogger logUpdateCount
INFO: === updated 1 row.
Jul 16, 2012 12:28:23 AM org.apache.cayenne.log.CommonsJdbcEventLogger logCommitTransaction
INFO: +++ transaction committed.
Jul 16, 2012 12:28:23 AM org.apache.cayenne.log.CommonsJdbcEventLogger logBeginTransaction
INFO: --- transaction started.
Jul 16, 2012 12:28:23 AM org.apache.cayenne.log.CommonsJdbcEventLogger logQuery
INFO: UPDATE CHILD SET MASTER_ID = ? WHERE ID = ?
Jul 16, 2012 12:28:23 AM org.apache.cayenne.log.CommonsJdbcEventLogger logQueryParameters
INFO: [bind: 1->MASTER_ID:203, 2->ID:202]
Jul 16, 2012 12:28:23 AM org.apache.cayenne.log.CommonsJdbcEventLogger logUpdateCount
INFO: === updated 1 row.
Jul 16, 2012 12:28:23 AM org.apache.cayenne.log.CommonsJdbcEventLogger logCommitTransaction
INFO: +++ transaction committed.
Jul 16, 2012 12:28:23 AM org.apache.cayenne.log.CommonsJdbcEventLogger logBeginTransaction
INFO: --- transaction started.
Jul 16, 2012 12:28:23 AM org.apache.cayenne.log.CommonsJdbcEventLogger logQuery
INFO: SELECT t0.MASTER_ID, t0.ID FROM CHILD t0 WHERE t0.MASTER_ID = ? [bind: 1->MASTER_ID:203]
Jul 16, 2012 12:28:23 AM org.apache.cayenne.log.CommonsJdbcEventLogger logSelectCount
INFO: === returned 2 rows. - took 1 ms.
Jul 16, 2012 12:28:23 AM org.apache.cayenne.log.CommonsJdbcEventLogger logCommitTransaction
INFO: +++ transaction committed.
Tests run: 3, Failures: 0, Errors: 0, Skipped: 0, Time elapsed: 0.939 sec
Running org.apache.cayenne.DataRowTest
Tests run: 2, Failures: 0, Errors: 0, Skipped: 0, Time elapsed: 0.002 sec
Running org.apache.cayenne.access.types.EnumTypeTest
Tests run: 7, Failures: 0, Errors: 0, Skipped: 0, Time elapsed: 0.002 sec

Results :

Failed tests: 
  testSelectNotLikeIgnoreCaseSingleWildcardMatch(org.apache.cayenne.query.SelectQueryTest)
  testSelectLikeIgnoreCaseObjects1(org.apache.cayenne.query.SelectQueryTest)

Tests run: 2095, Failures: 2, Errors: 0, Skipped: 0

[INFO] ------------------------------------------------------------------------
[INFO] Reactor Summary:
[INFO] 
[INFO] Cayenne ........................................... SUCCESS [0.221s]
[INFO] Common Unit Test Utilities ........................ SUCCESS [1.753s]
[INFO] Cayenne Internal Build Plugin ..................... SUCCESS [8.317s]
[INFO] Cayenne Internal Documentation Build Plugin ....... SUCCESS [1.585s]
[INFO] Cayenne Build Tools Parent ........................ SUCCESS [0.005s]
[INFO] Cayenne License and Notice Bundle ................. SUCCESS [0.441s]
[INFO] Cayenne Dependency Injection Container ............ SUCCESS [1.850s]
[INFO] Cayenne Java 1.5 Unpublished ...................... FAILURE [1:03.235s]
[INFO] Cayenne WebObjects Compatibility Library .......... SKIPPED
[INFO] Cayenne Aggregated Server Jar ..................... SKIPPED
[INFO] Cayenne Aggregated Client Jar ..................... SKIPPED
[INFO] Cayenne Project ................................... SKIPPED
[INFO] Cayenne Tools ..................................... SKIPPED
[INFO] Library: cayenne-lifecycle ........................ SKIPPED
[INFO] Cayenne Maven Plugin .............................. SKIPPED
[INFO] Cayenne Framework Aggregator Project .............. SKIPPED
[INFO] Cayenne Integration Tests Parent .................. SKIPPED
[INFO] Integration Tests - Cayenne Runtime ............... SKIPPED
[INFO] Integration Tests - Cayenne Tools ................. SKIPPED
[INFO] Cayenne Modeler ................................... SKIPPED
[INFO] Cayenne Modeler Maven Plugin ...................... SKIPPED
[INFO] Cayenne Modeler Parent ............................ SKIPPED
[INFO] Cayenne Tutorial .................................. SKIPPED
[INFO] Cayenne ROP Server Tutorial ....................... SKIPPED
[INFO] Cayenne ROP Client Tutorial ....................... SKIPPED
[INFO] Cayenne Tutorials ................................. SKIPPED
[INFO] Cayenne Documentation ............................. SKIPPED
[INFO] Cayenne Documenation Parent ....................... SKIPPED
[INFO] Cayenne Docbook Documentation ..................... SKIPPED
[INFO] Docbook: Cayenne Guide ............................ SKIPPED
[INFO] Docbook: Getting Started with Cayenne ............. SKIPPED
[INFO] Docbook: Getting Started with Cayenne ROP ......... SKIPPED
[INFO] Docbook: Cayenne New Features and Upgrade Guide ... SKIPPED
[INFO] ------------------------------------------------------------------------
[INFO] BUILD FAILURE
[INFO] ------------------------------------------------------------------------
[INFO] Total time: 1:18.418s
[INFO] Finished at: Mon Jul 16 00:28:24 UTC 2012
[INFO] Final Memory: 46M/384M
[INFO] ------------------------------------------------------------------------
[ERROR] Failed to execute goal org.apache.maven.plugins:maven-surefire-plugin:2.5:test (default-test)
on project cayenne-jdk1.5-unpublished: There are test failures.
[ERROR] 
[ERROR] Please refer to <https://builds.apache.org/job/Cayenne-trunk/./cayenneTestConnection=HSQLDB,collationCi=true,jdk=JDK%201.6%20(latest),label=Ubuntu/ws/trunk/framework/cayenne-jdk1.5-unpublished/target/surefire-reports>
for the individual test results.
[ERROR] -> [Help 1]
org.apache.maven.lifecycle.LifecycleExecutionException: Failed to execute goal org.apache.maven.plugins:maven-surefire-plugin:2.5:test
(default-test) on project cayenne-jdk1.5-unpublished: There are test failures.

Please refer to <https://builds.apache.org/job/Cayenne-trunk/./cayenneTestConnection=HSQLDB,collationCi=true,jdk=JDK%201.6%20(latest),label=Ubuntu/ws/trunk/framework/cayenne-jdk1.5-unpublished/target/surefire-reports>
for the individual test results.
	at org.apache.maven.lifecycle.internal.MojoExecutor.execute(MojoExecutor.java:213)
	at org.apache.maven.lifecycle.internal.MojoExecutor.execute(MojoExecutor.java:153)
	at org.apache.maven.lifecycle.internal.MojoExecutor.execute(MojoExecutor.java:145)
	at org.apache.maven.lifecycle.internal.LifecycleModuleBuilder.buildProject(LifecycleModuleBuilder.java:84)
	at org.apache.maven.lifecycle.internal.LifecycleModuleBuilder.buildProject(LifecycleModuleBuilder.java:59)
	at org.apache.maven.lifecycle.internal.LifecycleStarter.singleThreadedBuild(LifecycleStarter.java:183)
	at org.apache.maven.lifecycle.internal.LifecycleStarter.execute(LifecycleStarter.java:161)
	at org.apache.maven.DefaultMaven.doExecute(DefaultMaven.java:319)
	at org.apache.maven.DefaultMaven.execute(DefaultMaven.java:156)
	at org.apache.maven.cli.MavenCli.execute(MavenCli.java:537)
	at org.apache.maven.cli.MavenCli.doMain(MavenCli.java:196)
	at org.apache.maven.cli.MavenCli.main(MavenCli.java:141)
	at sun.reflect.NativeMethodAccessorImpl.invoke0(Native Method)
	at sun.reflect.NativeMethodAccessorImpl.invoke(NativeMethodAccessorImpl.java:39)
	at sun.reflect.DelegatingMethodAccessorImpl.invoke(DelegatingMethodAccessorImpl.java:25)
	at java.lang.reflect.Method.invoke(Method.java:597)
	at org.codehaus.plexus.classworlds.launcher.Launcher.launchEnhanced(Launcher.java:290)
	at org.codehaus.plexus.classworlds.launcher.Launcher.launch(Launcher.java:230)
	at org.codehaus.plexus.classworlds.launcher.Launcher.mainWithExitCode(Launcher.java:409)
	at org.codehaus.plexus.classworlds.launcher.Launcher.main(Launcher.java:352)
Caused by: org.apache.maven.plugin.MojoFailureException: There are test failures.

Please refer to <https://builds.apache.org/job/Cayenne-trunk/./cayenneTestConnection=HSQLDB,collationCi=true,jdk=JDK%201.6%20(latest),label=Ubuntu/ws/trunk/framework/cayenne-jdk1.5-unpublished/target/surefire-reports>
for the individual test results.
	at org.apache.maven.plugin.surefire.SurefirePlugin.execute(SurefirePlugin.java:629)
	at org.apache.maven.plugin.DefaultBuildPluginManager.executeMojo(DefaultBuildPluginManager.java:101)
	at org.apache.maven.lifecycle.internal.MojoExecutor.execute(MojoExecutor.java:209)
	... 19 more
[ERROR] 
[ERROR] Re-run Maven using the -X switch to enable full debug logging.
[ERROR] 
[ERROR] For more information about the errors and possible solutions, please read the following
articles:
[ERROR] [Help 1] http://cwiki.apache.org/confluence/display/MAVEN/MojoFailureException
[ERROR] 
[ERROR] After correcting the problems, you can resume the build with the command
[ERROR]   mvn <goals> -rf :cayenne-jdk1.5-unpublished
Build step 'Invoke top-level Maven targets' marked build as failure
Archiving artifacts

Mime
View raw message