cayenne-commits mailing list archives

Site index · List index
Message view « Date » · « Thread »
Top « Date » · « Thread »
From Apache Jenkins Server <jenk...@builds.apache.org>
Subject Build failed in Jenkins: Cayenne-trunk » HSQLDB,true,JDK 1.5 (latest),Ubuntu #740
Date Mon, 16 Jul 2012 00:35:58 GMT
See <https://builds.apache.org/job/Cayenne-trunk/./cayenneTestConnection=HSQLDB,collationCi=true,jdk=JDK%201.5%20(latest),label=Ubuntu/740/changes>

Changes:

[johnthuss] CAY-1647 Easily switch to/from ObjEntity and DbEntity in Modeler

[johnthuss] CAY-1646 Synchronize tabs in Modeler between ObjEntity and DbEntity editor panes

[aadamchik] docs

[aadamchik] documenting API throughts..

[aadamchik] unit test

[johnthuss] Refactor rename reflect.Property to PropertyDescriptor to avoid confusion with
new exp.Property

[johnthuss] CAY-1724 Add 'Property' class for easier and better Expression creation

[aadamchik] CAY-1725 NullPointerException from call to removeToManyTarget

release notes

[aadamchik] CAY-1725 NullPointerException from call to removeToManyTarget

proper quoting of the query

[aadamchik] CAY-1725 NullPointerException from call to removeToManyTarget

do not swallow the underlying exception that confuses the users downstream

[aadamchik] fixing compile error - replacing removed constructor

[aadamchik] this test is no longer needed

[aadamchik] CAY-1718 Remove everything deprecated in 3.1

release notes

[aadamchik] cleanup

[aadamchik] CAY-1718 Remove everything deprecated in 3.1

in progress

[aadamchik] CAY-1718 Remove everything deprecated in 3.1

in progress

[aadamchik] CAY-1718 Remove everything deprecated in 3.1

in progress

[aadamchik] CAY-1718 Remove everything deprecated in 3.1

in progress

[aadamchik] CAY-1718 Remove everything deprecated in 3.1

in progress

[aadamchik] CAY-1718 Remove everything deprecated in 3.1

in progress

[aadamchik] CAY-1718 Remove everything deprecated in 3.1

in progress

[aadamchik] CAY-1718 Remove everything deprecated in 3.1

in progress

[aadamchik] CAY-1718 Remove everything deprecated in 3.1

in progress

[aadamchik] CAY-1718 Remove everything deprecated in 3.1

in progress

[aadamchik] CAY-1718 Remove everything deprecated in 3.1

in progress

[aadamchik] CAY-1718 Remove everything deprecated in 3.1

in progress

[aadamchik] CAY-1718 Remove everything deprecated in 3.1

in progress

[aadamchik] CAY-1718 Remove everything deprecated in 3.1

in progress

[aadamchik] CAY-1718 Remove everything deprecated in 3.1

in progress

[aadamchik] CAY-1718 Remove everything deprecated in 3.1

in progress

[aadamchik] CAY-1718 Remove everything deprecated in 3.1

in progress

[aadamchik] CAY-1718 Remove everything deprecated in 3.1

in progress

[aadamchik] CAY-1718 Remove everything deprecated in 3.1

in progress

[aadamchik] CAY-1718 Remove everything deprecated in 3.1

in progress

[aadamchik] CAY-1718 Remove everything deprecated in 3.1

in progress

[aadamchik] CAY-1718 Remove everything deprecated in 3.1

in progress

[aadamchik] CAY-1718 Remove everything deprecated in 3.1

in progress

[aadamchik] CAY-1718 Remove everything deprecated in 3.1

in progress

[aadamchik] CAY-1718 Remove everything deprecated in 3.1

in progress - removing XML package

[aadamchik] CAY-1718 Remove everything deprecated in 3.1

in progress - removing XML package

[aadamchik] turning tutorials to a maven project

[aadamchik] CAY-1718 Remove everything deprecated in 3.1

in progress

[aadamchik] CAY-1718 Remove everything deprecated in 3.1

in progress

[aadamchik] trimming release notes even more radically

[aadamchik] removing very old RELEASE-NOTES records from trunk version to avoid confusion
as to when and what was fixed

[aadamchik] syncing multiple release info

[oltka] CAY-1721 added note to RELEASE-NOTES.txt
(cherry picked from commit f51d7a6e39b870b84a63a6099753748c027efbdd)

[oltka] CAY-1721 Writing blobs fails (Oracle)

[johnthuss] Forgot to actually add comment back in for last commit

[johnthuss] CAY-1719 Modeler - Obj Attribute Java Type editor won't focus sometimes

[johnthuss] CAY-1677 Modeler: text fields discard input unless you press enter

[aadamchik] merging RELEASE-NOTES from 3.1 stable to master

all 3.1 bug fixes should appears as history on 3.2

[aadamchik] CAY-1689 [PATCH] LOB*QueryBuilders do not check isQuotingSQLIdentifiers

minor cleanup

[aadamchik] CAY-1689 [PATCH] LOB*QueryBuilders do not check isQuotingSQLIdentifiers

patch by Joerg Schoenfisch

[aadamchik] CAY-1717 [PATCH] Implement JDBC compatibility layer methods

patch by Joerg Schoenfisch

[oltka] CAY-1715 changed the test name

[oltka] CAY-1715 Passing parameters to mapped EJBQL queries

[johnthuss] Rename inconsistently named property 'cayenne.rop.service.timeout'

[mgentry] Added missing @Deprecated annotations from methods which only had @deprecated in
the JavaDoc section.

[amaniatis] Fix location of OGNL library

[amaniatis] Update release notes with some dates I was able to locate and fix current release
as b1 not M4

[aadamchik] CAY-1709 Some typos in setup.xml and including-cayenne-in-project.xml files

patch by Gilberto C Andrade

------------------------------------------
[...truncated 4216 lines...]
[INFO] skip non existing resourceDirectory <https://builds.apache.org/job/Cayenne-trunk/./cayenneTestConnection=HSQLDB,collationCi=true,jdk=JDK%201.5%20(latest),label=Ubuntu/ws/trunk/framework/cayenne-legal-unpublished/src/test/resources>
[INFO] 
[INFO] --- maven-compiler-plugin:2.3.2:testCompile (default-testCompile) @ cayenne-legal-unpublished
---
[INFO] No sources to compile
[INFO] 
[INFO] --- maven-surefire-plugin:2.5:test (default-test) @ cayenne-legal-unpublished ---
[INFO] No tests to run.
[INFO] 
[INFO] --- maven-jar-plugin:2.3.1:jar (default-jar) @ cayenne-legal-unpublished ---
[INFO] Building jar: <https://builds.apache.org/job/Cayenne-trunk/./cayenneTestConnection=HSQLDB,collationCi=true,jdk=JDK%201.5%20(latest),label=Ubuntu/ws/trunk/framework/cayenne-legal-unpublished/target/cayenne-legal-unpublished-3.2M1-SNAPSHOT.jar>
[INFO] 
[INFO] >>> maven-source-plugin:2.1.2:jar (bundle-source-jar) @ cayenne-legal-unpublished
>>>
[INFO] 
[INFO] --- maven-cayenne-build-plugin:3.2M1-SNAPSHOT:date (date) @ cayenne-legal-unpublished
---
[INFO] 
[INFO] <<< maven-source-plugin:2.1.2:jar (bundle-source-jar) @ cayenne-legal-unpublished
<<<
[INFO] 
[INFO] --- maven-source-plugin:2.1.2:jar (bundle-source-jar) @ cayenne-legal-unpublished ---
[INFO] Building jar: <https://builds.apache.org/job/Cayenne-trunk/./cayenneTestConnection=HSQLDB,collationCi=true,jdk=JDK%201.5%20(latest),label=Ubuntu/ws/trunk/framework/cayenne-legal-unpublished/target/cayenne-legal-unpublished-3.2M1-SNAPSHOT-sources.jar>
[INFO] 
[INFO] --- maven-install-plugin:2.3.1:install (default-install) @ cayenne-legal-unpublished
---
[INFO] Installing <https://builds.apache.org/job/Cayenne-trunk/./cayenneTestConnection=HSQLDB,collationCi=true,jdk=JDK%201.5%20(latest),label=Ubuntu/ws/trunk/framework/cayenne-legal-unpublished/target/cayenne-legal-unpublished-3.2M1-SNAPSHOT.jar>
to /home/jenkins/.m2/repository/org/apache/cayenne/unpublished/cayenne-legal-unpublished/3.2M1-SNAPSHOT/cayenne-legal-unpublished-3.2M1-SNAPSHOT.jar
[INFO] Installing <https://builds.apache.org/job/Cayenne-trunk/./cayenneTestConnection=HSQLDB,collationCi=true,jdk=JDK%201.5%20(latest),label=Ubuntu/ws/trunk/framework/cayenne-legal-unpublished/pom.xml>
to /home/jenkins/.m2/repository/org/apache/cayenne/unpublished/cayenne-legal-unpublished/3.2M1-SNAPSHOT/cayenne-legal-unpublished-3.2M1-SNAPSHOT.pom
[INFO] Installing <https://builds.apache.org/job/Cayenne-trunk/./cayenneTestConnection=HSQLDB,collationCi=true,jdk=JDK%201.5%20(latest),label=Ubuntu/ws/trunk/framework/cayenne-legal-unpublished/target/cayenne-legal-unpublished-3.2M1-SNAPSHOT-sources.jar>
to /home/jenkins/.m2/repository/org/apache/cayenne/unpublished/cayenne-legal-unpublished/3.2M1-SNAPSHOT/cayenne-legal-unpublished-3.2M1-SNAPSHOT-sources.jar
[INFO]                                                                         
[INFO] ------------------------------------------------------------------------
[INFO] Building Cayenne Dependency Injection Container 3.2M1-SNAPSHOT
[INFO] ------------------------------------------------------------------------
[INFO] 
[INFO] --- maven-clean-plugin:2.4.1:clean (default-clean) @ cayenne-di-unpublished ---
[INFO] 
[INFO] --- maven-cayenne-build-plugin:3.2M1-SNAPSHOT:date (date) @ cayenne-di-unpublished
---
[INFO] 
[INFO] --- maven-resources-plugin:2.4.3:resources (default-resources) @ cayenne-di-unpublished
---
[INFO] Using 'UTF-8' encoding to copy filtered resources.
[INFO] Copying 1 resource
[INFO] 
[INFO] --- maven-compiler-plugin:2.3.2:compile (default-compile) @ cayenne-di-unpublished
---
[WARNING] File encoding has not been set, using platform encoding ANSI_X3.4-1968, i.e. build
is platform dependent!
[INFO] Compiling 38 source files to <https://builds.apache.org/job/Cayenne-trunk/./cayenneTestConnection=HSQLDB,collationCi=true,jdk=JDK%201.5%20(latest),label=Ubuntu/ws/trunk/framework/cayenne-di-unpublished/target/classes>
[INFO] 
[INFO] --- maven-resources-plugin:2.4.3:testResources (default-testResources) @ cayenne-di-unpublished
---
[INFO] Using 'UTF-8' encoding to copy filtered resources.
[INFO] skip non existing resourceDirectory <https://builds.apache.org/job/Cayenne-trunk/./cayenneTestConnection=HSQLDB,collationCi=true,jdk=JDK%201.5%20(latest),label=Ubuntu/ws/trunk/framework/cayenne-di-unpublished/src/test/resources>
[INFO] 
[INFO] --- maven-compiler-plugin:2.3.2:testCompile (default-testCompile) @ cayenne-di-unpublished
---
[WARNING] File encoding has not been set, using platform encoding ANSI_X3.4-1968, i.e. build
is platform dependent!
[INFO] Compiling 38 source files to <https://builds.apache.org/job/Cayenne-trunk/./cayenneTestConnection=HSQLDB,collationCi=true,jdk=JDK%201.5%20(latest),label=Ubuntu/ws/trunk/framework/cayenne-di-unpublished/target/test-classes>
[INFO] 
[INFO] --- maven-surefire-plugin:2.5:test (default-test) @ cayenne-di-unpublished ---
[INFO] Surefire report directory: <https://builds.apache.org/job/Cayenne-trunk/./cayenneTestConnection=HSQLDB,collationCi=true,jdk=JDK%201.5%20(latest),label=Ubuntu/ws/trunk/framework/cayenne-di-unpublished/target/surefire-reports>

-------------------------------------------------------
 T E S T S
-------------------------------------------------------
Running org.apache.cayenne.di.KeyTest
Tests run: 3, Failures: 0, Errors: 0, Skipped: 0, Time elapsed: 0.022 sec
Running org.apache.cayenne.CayenneExceptionTest
Tests run: 6, Failures: 0, Errors: 0, Skipped: 0, Time elapsed: 0.011 sec
Running org.apache.cayenne.di.DIBootstrapTest
Tests run: 3, Failures: 0, Errors: 0, Skipped: 0, Time elapsed: 0.029 sec
Running org.apache.cayenne.CayenneRuntimeExceptionTest
Tests run: 8, Failures: 0, Errors: 0, Skipped: 0, Time elapsed: 0.008 sec
Running org.apache.cayenne.di.spi.DefaultInjectorBindingTest
Tests run: 5, Failures: 0, Errors: 0, Skipped: 0, Time elapsed: 0.015 sec
Running org.apache.cayenne.di.spi.DefaultInjectorTest
Tests run: 4, Failures: 0, Errors: 0, Skipped: 0, Time elapsed: 0.012 sec
Running org.apache.cayenne.di.spi.DefaultInjectorScopeTest
Tests run: 6, Failures: 0, Errors: 0, Skipped: 0, Time elapsed: 0.012 sec
Running org.apache.cayenne.di.spi.DefaultInjectorInjectionTest
Tests run: 15, Failures: 0, Errors: 0, Skipped: 0, Time elapsed: 0.045 sec
Running org.apache.cayenne.di.spi.DefaultInjectorCircularInjectionTest
Tests run: 4, Failures: 0, Errors: 0, Skipped: 0, Time elapsed: 0.012 sec

Results :

Tests run: 54, Failures: 0, Errors: 0, Skipped: 0

[INFO] 
[INFO] --- maven-jar-plugin:2.3.1:jar (default-jar) @ cayenne-di-unpublished ---
[INFO] Building jar: <https://builds.apache.org/job/Cayenne-trunk/./cayenneTestConnection=HSQLDB,collationCi=true,jdk=JDK%201.5%20(latest),label=Ubuntu/ws/trunk/framework/cayenne-di-unpublished/target/cayenne-di-unpublished-3.2M1-SNAPSHOT.jar>
[INFO] 
[INFO] >>> maven-source-plugin:2.1.2:jar (bundle-source-jar) @ cayenne-di-unpublished
>>>
[INFO] 
[INFO] --- maven-cayenne-build-plugin:3.2M1-SNAPSHOT:date (date) @ cayenne-di-unpublished
---
[INFO] 
[INFO] <<< maven-source-plugin:2.1.2:jar (bundle-source-jar) @ cayenne-di-unpublished
<<<
[INFO] 
[INFO] --- maven-source-plugin:2.1.2:jar (bundle-source-jar) @ cayenne-di-unpublished ---
[INFO] org already added, skipping
[INFO] org/apache already added, skipping
[INFO] org/apache/cayenne already added, skipping
[INFO] Building jar: <https://builds.apache.org/job/Cayenne-trunk/./cayenneTestConnection=HSQLDB,collationCi=true,jdk=JDK%201.5%20(latest),label=Ubuntu/ws/trunk/framework/cayenne-di-unpublished/target/cayenne-di-unpublished-3.2M1-SNAPSHOT-sources.jar>
[INFO] org already added, skipping
[INFO] org/apache already added, skipping
[INFO] org/apache/cayenne already added, skipping
[INFO] 
[INFO] --- maven-install-plugin:2.3.1:install (default-install) @ cayenne-di-unpublished ---
[INFO] Installing <https://builds.apache.org/job/Cayenne-trunk/./cayenneTestConnection=HSQLDB,collationCi=true,jdk=JDK%201.5%20(latest),label=Ubuntu/ws/trunk/framework/cayenne-di-unpublished/target/cayenne-di-unpublished-3.2M1-SNAPSHOT.jar>
to /home/jenkins/.m2/repository/org/apache/cayenne/unpublished/cayenne-di-unpublished/3.2M1-SNAPSHOT/cayenne-di-unpublished-3.2M1-SNAPSHOT.jar
[INFO] Installing <https://builds.apache.org/job/Cayenne-trunk/./cayenneTestConnection=HSQLDB,collationCi=true,jdk=JDK%201.5%20(latest),label=Ubuntu/ws/trunk/framework/cayenne-di-unpublished/pom.xml>
to /home/jenkins/.m2/repository/org/apache/cayenne/unpublished/cayenne-di-unpublished/3.2M1-SNAPSHOT/cayenne-di-unpublished-3.2M1-SNAPSHOT.pom
[INFO] Installing <https://builds.apache.org/job/Cayenne-trunk/./cayenneTestConnection=HSQLDB,collationCi=true,jdk=JDK%201.5%20(latest),label=Ubuntu/ws/trunk/framework/cayenne-di-unpublished/target/cayenne-di-unpublished-3.2M1-SNAPSHOT-sources.jar>
to /home/jenkins/.m2/repository/org/apache/cayenne/unpublished/cayenne-di-unpublished/3.2M1-SNAPSHOT/cayenne-di-unpublished-3.2M1-SNAPSHOT-sources.jar
[INFO]                                                                         
[INFO] ------------------------------------------------------------------------
[INFO] Building Cayenne Java 1.5 Unpublished 3.2M1-SNAPSHOT
[INFO] ------------------------------------------------------------------------
[INFO] 
[INFO] --- maven-clean-plugin:2.4.1:clean (default-clean) @ cayenne-jdk1.5-unpublished ---
[INFO] 
[INFO] --- maven-cayenne-build-plugin:3.2M1-SNAPSHOT:date (date) @ cayenne-jdk1.5-unpublished
---
[INFO] 
[INFO] --- javacc-maven-plugin:2.6:jjtree-javacc (jjtree-ejbql) @ cayenne-jdk1.5-unpublished
---
[WARNING] File encoding for grammars has not been configured, using platform default encoding,
i.e. build is platform dependent!
Java Compiler Compiler Version 5.0 (Tree Builder)
(type "jjtree" with no arguments for help)
Reading from file <https://builds.apache.org/job/Cayenne-trunk/./cayenneTestConnection=HSQLDB,collationCi=true,jdk=JDK%201.5%20(latest),label=Ubuntu/ws/trunk/framework/cayenne-jdk1.5-unpublished/src/main/jjtree/org/apache/cayenne/ejbql/EJBQLParser.jjt>
. . .
File "Node.java" does not exist.  Will create one.
File "EJBQLTreeConstants.java" does not exist.  Will create one.
File "JJTEJBQLState.java" does not exist.  Will create one.
Annotated grammar generated successfully in <https://builds.apache.org/job/Cayenne-trunk/./cayenneTestConnection=HSQLDB,collationCi=true,jdk=JDK%201.5%20(latest),label=Ubuntu/ws/trunk/framework/cayenne-jdk1.5-unpublished/target/javacc-1342398952465/node/EJBQLParser.jj>
Java Compiler Compiler Version 5.0 (Parser Generator)
(type "javacc" with no arguments for help)
Reading from file <https://builds.apache.org/job/Cayenne-trunk/./cayenneTestConnection=HSQLDB,collationCi=true,jdk=JDK%201.5%20(latest),label=Ubuntu/ws/trunk/framework/cayenne-jdk1.5-unpublished/target/javacc-1342398952465/node/EJBQLParser.jj>
. . .
Warning: Choice conflict in (...)* construct at line 840, column 17.
         Expansion nested within construct and expansion following construct
         have common prefixes, one of which is: "+"
         Consider using a lookahead of 2 or more for nested expansion.
Warning: Choice conflict in (...)* construct at line 849, column 17.
         Expansion nested within construct and expansion following construct
         have common prefixes, one of which is: "*"
         Consider using a lookahead of 2 or more for nested expansion.
File "TokenMgrError.java" does not exist.  Will create one.
File "ParseException.java" does not exist.  Will create one.
File "Token.java" does not exist.  Will create one.
File "JavaCharStream.java" does not exist.  Will create one.
Parser generated with 0 errors and 2 warnings.
[INFO] Processed 1 grammar
[INFO] 
[INFO] --- maven-antrun-plugin:1.3:run (default) @ cayenne-jdk1.5-unpublished ---
[INFO] Executing tasks
[INFO] Executed tasks
[INFO] 
[INFO] --- maven-resources-plugin:2.4.3:resources (default-resources) @ cayenne-jdk1.5-unpublished
---
[INFO] Using 'UTF-8' encoding to copy filtered resources.
[INFO] Copying 17 resources
[INFO] 
[INFO] --- maven-compiler-plugin:2.3.2:compile (default-compile) @ cayenne-jdk1.5-unpublished
---
[WARNING] File encoding has not been set, using platform encoding ANSI_X3.4-1968, i.e. build
is platform dependent!
[INFO] Compiling 921 source files to <https://builds.apache.org/job/Cayenne-trunk/./cayenneTestConnection=HSQLDB,collationCi=true,jdk=JDK%201.5%20(latest),label=Ubuntu/ws/trunk/framework/cayenne-jdk1.5-unpublished/target/classes>
[INFO] -------------------------------------------------------------
[ERROR] COMPILATION ERROR : 
[INFO] -------------------------------------------------------------
[ERROR] <https://builds.apache.org/job/Cayenne-trunk/./cayenneTestConnection=HSQLDB,collationCi=true,jdk=JDK%201.5%20(latest),label=Ubuntu/ws/trunk/framework/cayenne-jdk1.5-unpublished/src/main/java/org/apache/cayenne/access/DataNode.java>:[411,22]
cannot find symbol
symbol  : constructor SQLException(java.lang.ClassCastException)
location: class java.sql.SQLException
[INFO] 1 error
[INFO] -------------------------------------------------------------
[INFO] ------------------------------------------------------------------------
[INFO] Reactor Summary:
[INFO] 
[INFO] Cayenne ........................................... SUCCESS [0.243s]
[INFO] Common Unit Test Utilities ........................ SUCCESS [1.358s]
[INFO] Cayenne Internal Build Plugin ..................... SUCCESS [1.111s]
[INFO] Cayenne Internal Documentation Build Plugin ....... SUCCESS [1.413s]
[INFO] Cayenne Build Tools Parent ........................ SUCCESS [0.005s]
[INFO] Cayenne License and Notice Bundle ................. SUCCESS [0.752s]
[INFO] Cayenne Dependency Injection Container ............ SUCCESS [2.125s]
[INFO] Cayenne Java 1.5 Unpublished ...................... FAILURE [6.010s]
[INFO] Cayenne WebObjects Compatibility Library .......... SKIPPED
[INFO] Cayenne Aggregated Server Jar ..................... SKIPPED
[INFO] Cayenne Aggregated Client Jar ..................... SKIPPED
[INFO] Cayenne Project ................................... SKIPPED
[INFO] Cayenne Tools ..................................... SKIPPED
[INFO] Library: cayenne-lifecycle ........................ SKIPPED
[INFO] Cayenne Maven Plugin .............................. SKIPPED
[INFO] Cayenne Framework Aggregator Project .............. SKIPPED
[INFO] Cayenne Integration Tests Parent .................. SKIPPED
[INFO] Integration Tests - Cayenne Runtime ............... SKIPPED
[INFO] Integration Tests - Cayenne Tools ................. SKIPPED
[INFO] Cayenne Modeler ................................... SKIPPED
[INFO] Cayenne Modeler Maven Plugin ...................... SKIPPED
[INFO] Cayenne Modeler Parent ............................ SKIPPED
[INFO] Cayenne Tutorial .................................. SKIPPED
[INFO] Cayenne ROP Server Tutorial ....................... SKIPPED
[INFO] Cayenne ROP Client Tutorial ....................... SKIPPED
[INFO] Cayenne Tutorials ................................. SKIPPED
[INFO] Cayenne Documentation ............................. SKIPPED
[INFO] Cayenne Documenation Parent ....................... SKIPPED
[INFO] Cayenne Docbook Documentation ..................... SKIPPED
[INFO] Docbook: Cayenne Guide ............................ SKIPPED
[INFO] Docbook: Getting Started with Cayenne ............. SKIPPED
[INFO] Docbook: Getting Started with Cayenne ROP ......... SKIPPED
[INFO] Docbook: Cayenne New Features and Upgrade Guide ... SKIPPED
[INFO] ------------------------------------------------------------------------
[INFO] BUILD FAILURE
[INFO] ------------------------------------------------------------------------
[INFO] Total time: 26.217s
[INFO] Finished at: Mon Jul 16 00:35:58 UTC 2012
[INFO] Final Memory: 20M/308M
[INFO] ------------------------------------------------------------------------
[ERROR] Failed to execute goal org.apache.maven.plugins:maven-compiler-plugin:2.3.2:compile
(default-compile) on project cayenne-jdk1.5-unpublished: Compilation failure
[ERROR] <https://builds.apache.org/job/Cayenne-trunk/./cayenneTestConnection=HSQLDB,collationCi=true,jdk=JDK%201.5%20(latest),label=Ubuntu/ws/trunk/framework/cayenne-jdk1.5-unpublished/src/main/java/org/apache/cayenne/access/DataNode.java>:[411,22]
cannot find symbol
[ERROR] symbol  : constructor SQLException(java.lang.ClassCastException)
[ERROR] location: class java.sql.SQLException
[ERROR] -> [Help 1]
org.apache.maven.lifecycle.LifecycleExecutionException: Failed to execute goal org.apache.maven.plugins:maven-compiler-plugin:2.3.2:compile
(default-compile) on project cayenne-jdk1.5-unpublished: Compilation failure
<https://builds.apache.org/job/Cayenne-trunk/./cayenneTestConnection=HSQLDB,collationCi=true,jdk=JDK%201.5%20(latest),label=Ubuntu/ws/trunk/framework/cayenne-jdk1.5-unpublished/src/main/java/org/apache/cayenne/access/DataNode.java>:[411,22]
cannot find symbol
symbol  : constructor SQLException(java.lang.ClassCastException)
location: class java.sql.SQLException

	at org.apache.maven.lifecycle.internal.MojoExecutor.execute(MojoExecutor.java:213)
	at org.apache.maven.lifecycle.internal.MojoExecutor.execute(MojoExecutor.java:153)
	at org.apache.maven.lifecycle.internal.MojoExecutor.execute(MojoExecutor.java:145)
	at org.apache.maven.lifecycle.internal.LifecycleModuleBuilder.buildProject(LifecycleModuleBuilder.java:84)
	at org.apache.maven.lifecycle.internal.LifecycleModuleBuilder.buildProject(LifecycleModuleBuilder.java:59)
	at org.apache.maven.lifecycle.internal.LifecycleStarter.singleThreadedBuild(LifecycleStarter.java:183)
	at org.apache.maven.lifecycle.internal.LifecycleStarter.execute(LifecycleStarter.java:161)
	at org.apache.maven.DefaultMaven.doExecute(DefaultMaven.java:319)
	at org.apache.maven.DefaultMaven.execute(DefaultMaven.java:156)
	at org.apache.maven.cli.MavenCli.execute(MavenCli.java:537)
	at org.apache.maven.cli.MavenCli.doMain(MavenCli.java:196)
	at org.apache.maven.cli.MavenCli.main(MavenCli.java:141)
	at sun.reflect.NativeMethodAccessorImpl.invoke0(Native Method)
	at sun.reflect.NativeMethodAccessorImpl.invoke(NativeMethodAccessorImpl.java:39)
	at sun.reflect.DelegatingMethodAccessorImpl.invoke(DelegatingMethodAccessorImpl.java:25)
	at java.lang.reflect.Method.invoke(Method.java:592)
	at org.codehaus.plexus.classworlds.launcher.Launcher.launchEnhanced(Launcher.java:290)
	at org.codehaus.plexus.classworlds.launcher.Launcher.launch(Launcher.java:230)
	at org.codehaus.plexus.classworlds.launcher.Launcher.mainWithExitCode(Launcher.java:409)
	at org.codehaus.plexus.classworlds.launcher.Launcher.main(Launcher.java:352)
Caused by: org.apache.maven.plugin.CompilationFailureException: Compilation failure
<https://builds.apache.org/job/Cayenne-trunk/./cayenneTestConnection=HSQLDB,collationCi=true,jdk=JDK%201.5%20(latest),label=Ubuntu/ws/trunk/framework/cayenne-jdk1.5-unpublished/src/main/java/org/apache/cayenne/access/DataNode.java>:[411,22]
cannot find symbol
symbol  : constructor SQLException(java.lang.ClassCastException)
location: class java.sql.SQLException

	at org.apache.maven.plugin.AbstractCompilerMojo.execute(AbstractCompilerMojo.java:656)
	at org.apache.maven.plugin.CompilerMojo.execute(CompilerMojo.java:128)
	at org.apache.maven.plugin.DefaultBuildPluginManager.executeMojo(DefaultBuildPluginManager.java:101)
	at org.apache.maven.lifecycle.internal.MojoExecutor.execute(MojoExecutor.java:209)
	... 19 more
[ERROR] 
[ERROR] Re-run Maven using the -X switch to enable full debug logging.
[ERROR] 
[ERROR] For more information about the errors and possible solutions, please read the following
articles:
[ERROR] [Help 1] http://cwiki.apache.org/confluence/display/MAVEN/MojoFailureException
[ERROR] 
[ERROR] After correcting the problems, you can resume the build with the command
[ERROR]   mvn <goals> -rf :cayenne-jdk1.5-unpublished
Build step 'Invoke top-level Maven targets' marked build as failure
Archiving artifacts

Mime
View raw message