cayenne-commits mailing list archives

Site index · List index
Message view « Date » · « Thread »
Top « Date » · « Thread »
From Apache Jenkins Server <jenk...@builds.apache.org>
Subject Build failed in Jenkins: Cayenne-trunk » h2,false,JDK 1.6 (latest),Ubuntu #641
Date Wed, 25 Jan 2012 17:28:27 GMT
See <https://builds.apache.org/job/Cayenne-trunk/./cayenneTestConnection=h2,collationCi=false,jdk=JDK%201.6%20(latest),label=Ubuntu/641/changes>

Changes:

[oltka] CAY-1459 add note to RELEASE-NOTES about this task

[oltka] CAY-1459 Modeler: DbEntities from other DataMaps under same domain are not displayed

------------------------------------------
[...truncated 83110 lines...]
	Password: *******
Jan 25, 2012 5:28:04 PM org.apache.cayenne.log.CommonsJdbcEventLogger logConnectFailure
INFO: *** Connecting: FAILURE.
java.sql.SQLException: User not found: 
	at org.hsqldb.jdbc.Util.sqlException(Unknown Source)
	at org.hsqldb.jdbc.jdbcConnection.<init>(Unknown Source)
	at org.hsqldb.jdbcDriver.getConnection(Unknown Source)
	at org.hsqldb.jdbcDriver.connect(Unknown Source)
	at org.apache.cayenne.conn.DriverDataSource.getConnection(DriverDataSource.java:157)
	at org.apache.cayenne.conn.PooledConnectionImpl.reconnect(PooledConnectionImpl.java:83)
	at org.apache.cayenne.conn.PooledConnectionImpl.getConnection(PooledConnectionImpl.java:120)
	at org.apache.cayenne.conn.PoolManager.uncheckConnection(PoolManager.java:397)
	at org.apache.cayenne.conn.PoolManager.getConnection(PoolManager.java:381)
	at org.apache.cayenne.conn.PoolManager.getConnection(PoolManager.java:354)
	at org.apache.cayenne.configuration.server.DefaultDbAdapterFactory.detectAdapter(DefaultDbAdapterFactory.java:98)
	at org.apache.cayenne.configuration.server.DefaultDbAdapterFactory$1.get(DefaultDbAdapterFactory.java:85)
	at org.apache.cayenne.configuration.server.DefaultDbAdapterFactory$1.get(DefaultDbAdapterFactory.java:82)
	at org.apache.cayenne.dba.AutoAdapter.loadAdapter(AutoAdapter.java:93)
	at org.apache.cayenne.dba.AutoAdapter.getAdapter(AutoAdapter.java:81)
	at org.apache.cayenne.dba.AutoAdapter.tableTypeForTable(AutoAdapter.java:186)
	at org.apache.cayenne.access.dbsync.CreateIfNoSchemaStrategy.getNameTablesInDB(CreateIfNoSchemaStrategy.java:94)
	at org.apache.cayenne.access.dbsync.CreateIfNoSchemaStrategy.processSchemaUpdate(CreateIfNoSchemaStrategy.java:47)
	at org.apache.cayenne.access.dbsync.BaseSchemaUpdateStrategy.updateSchema(BaseSchemaUpdateStrategy.java:48)
	at org.apache.cayenne.configuration.server.ServerRuntimeCase.setUp(ServerRuntimeCase.java:60)
	at junit.framework.TestCase.runBare(TestCase.java:125)
	at junit.framework.TestResult$1.protect(TestResult.java:106)
	at junit.framework.TestResult.runProtected(TestResult.java:124)
	at junit.framework.TestResult.run(TestResult.java:109)
	at junit.framework.TestCase.run(TestCase.java:118)
	at junit.framework.TestSuite.runTest(TestSuite.java:208)
	at junit.framework.TestSuite.run(TestSuite.java:203)
	at sun.reflect.NativeMethodAccessorImpl.invoke0(Native Method)
	at sun.reflect.NativeMethodAccessorImpl.invoke(NativeMethodAccessorImpl.java:39)
	at sun.reflect.DelegatingMethodAccessorImpl.invoke(DelegatingMethodAccessorImpl.java:25)
	at java.lang.reflect.Method.invoke(Method.java:597)
	at org.apache.maven.surefire.junit.JUnitTestSet.execute(JUnitTestSet.java:213)
	at org.apache.maven.surefire.suite.AbstractDirectoryTestSuite.executeTestSet(AbstractDirectoryTestSuite.java:115)
	at org.apache.maven.surefire.suite.AbstractDirectoryTestSuite.execute(AbstractDirectoryTestSuite.java:102)
	at org.apache.maven.surefire.Surefire.run(Surefire.java:180)
	at sun.reflect.NativeMethodAccessorImpl.invoke0(Native Method)
	at sun.reflect.NativeMethodAccessorImpl.invoke(NativeMethodAccessorImpl.java:39)
	at sun.reflect.DelegatingMethodAccessorImpl.invoke(DelegatingMethodAccessorImpl.java:25)
	at java.lang.reflect.Method.invoke(Method.java:597)
	at org.apache.maven.surefire.booter.SurefireBooter.runSuitesInProcess(SurefireBooter.java:350)
	at org.apache.maven.surefire.booter.SurefireBooter.main(SurefireBooter.java:1021)
Jan 25, 2012 5:28:04 PM org.apache.cayenne.configuration.XMLDataChannelDescriptorLoader load
INFO: Loading XML configuration resource from <https://builds.apache.org/job/Cayenne-trunk/./cayenneTestConnection=h2,collationCi=false,jdk=JDK%201.6%20(latest),label=Ubuntu/ws/trunk/itests/cayenne-runtime-itest/target/classes/cayenne-DEFAULT.xml>
Jan 25, 2012 5:28:04 PM org.apache.cayenne.configuration.XMLDataChannelDescriptorLoader$DataSourceChildrenHandler
createChildTagHandler
INFO: loading user name and password.
Jan 25, 2012 5:28:04 PM org.apache.cayenne.log.CommonsJdbcEventLogger logPoolCreated
INFO: Created connection pool: jdbc:hsqldb:mem:DEFAULT
	Driver class: org.hsqldb.jdbcDriver
	Min. connections in the pool: 1
	Max. connections in the pool: 1
Jan 25, 2012 5:28:04 PM org.apache.cayenne.log.CommonsJdbcEventLogger logConnect
INFO: Opening connection: jdbc:hsqldb:mem:DEFAULT
	Login: 
	Password: *******
Jan 25, 2012 5:28:04 PM org.apache.cayenne.log.CommonsJdbcEventLogger logConnectFailure
INFO: *** Connecting: FAILURE.
java.sql.SQLException: User not found: 
	at org.hsqldb.jdbc.Util.sqlException(Unknown Source)
	at org.hsqldb.jdbc.jdbcConnection.<init>(Unknown Source)
	at org.hsqldb.jdbcDriver.getConnection(Unknown Source)
	at org.hsqldb.jdbcDriver.connect(Unknown Source)
	at org.apache.cayenne.conn.DriverDataSource.getConnection(DriverDataSource.java:157)
	at org.apache.cayenne.conn.PooledConnectionImpl.reconnect(PooledConnectionImpl.java:83)
	at org.apache.cayenne.conn.PooledConnectionImpl.getConnection(PooledConnectionImpl.java:120)
	at org.apache.cayenne.conn.PoolManager.uncheckConnection(PoolManager.java:397)
	at org.apache.cayenne.conn.PoolManager.getConnection(PoolManager.java:368)
	at org.apache.cayenne.conn.PoolManager.getConnection(PoolManager.java:354)
	at org.apache.cayenne.configuration.server.DefaultDbAdapterFactory.detectAdapter(DefaultDbAdapterFactory.java:98)
	at org.apache.cayenne.configuration.server.DefaultDbAdapterFactory$1.get(DefaultDbAdapterFactory.java:85)
	at org.apache.cayenne.configuration.server.DefaultDbAdapterFactory$1.get(DefaultDbAdapterFactory.java:82)
	at org.apache.cayenne.dba.AutoAdapter.loadAdapter(AutoAdapter.java:93)
	at org.apache.cayenne.dba.AutoAdapter.getAdapter(AutoAdapter.java:81)
	at org.apache.cayenne.dba.AutoAdapter.tableTypeForTable(AutoAdapter.java:186)
	at org.apache.cayenne.access.dbsync.CreateIfNoSchemaStrategy.getNameTablesInDB(CreateIfNoSchemaStrategy.java:94)
	at org.apache.cayenne.access.dbsync.CreateIfNoSchemaStrategy.processSchemaUpdate(CreateIfNoSchemaStrategy.java:47)
	at org.apache.cayenne.access.dbsync.BaseSchemaUpdateStrategy.updateSchema(BaseSchemaUpdateStrategy.java:48)
	at org.apache.cayenne.configuration.server.ServerRuntimeCase.setUp(ServerRuntimeCase.java:60)
	at junit.framework.TestCase.runBare(TestCase.java:125)
	at junit.framework.TestResult$1.protect(TestResult.java:106)
	at junit.framework.TestResult.runProtected(TestResult.java:124)
	at junit.framework.TestResult.run(TestResult.java:109)
	at junit.framework.TestCase.run(TestCase.java:118)
	at junit.framework.TestSuite.runTest(TestSuite.java:208)
	at junit.framework.TestSuite.run(TestSuite.java:203)
	at sun.reflect.NativeMethodAccessorImpl.invoke0(Native Method)
	at sun.reflect.NativeMethodAccessorImpl.invoke(NativeMethodAccessorImpl.java:39)
	at sun.reflect.DelegatingMethodAccessorImpl.invoke(DelegatingMethodAccessorImpl.java:25)
	at java.lang.reflect.Method.invoke(Method.java:597)
	at org.apache.maven.surefire.junit.JUnitTestSet.execute(JUnitTestSet.java:213)
	at org.apache.maven.surefire.suite.AbstractDirectoryTestSuite.executeTestSet(AbstractDirectoryTestSuite.java:115)
	at org.apache.maven.surefire.suite.AbstractDirectoryTestSuite.execute(AbstractDirectoryTestSuite.java:102)
	at org.apache.maven.surefire.Surefire.run(Surefire.java:180)
	at sun.reflect.NativeMethodAccessorImpl.invoke0(Native Method)
	at sun.reflect.NativeMethodAccessorImpl.invoke(NativeMethodAccessorImpl.java:39)
	at sun.reflect.DelegatingMethodAccessorImpl.invoke(DelegatingMethodAccessorImpl.java:25)
	at java.lang.reflect.Method.invoke(Method.java:597)
	at org.apache.maven.surefire.booter.SurefireBooter.runSuitesInProcess(SurefireBooter.java:350)
	at org.apache.maven.surefire.booter.SurefireBooter.main(SurefireBooter.java:1021)
Jan 25, 2012 5:28:04 PM org.apache.cayenne.log.CommonsJdbcEventLogger logConnect
INFO: Opening connection: jdbc:hsqldb:mem:DEFAULT
	Login: 
	Password: *******
Jan 25, 2012 5:28:04 PM org.apache.cayenne.log.CommonsJdbcEventLogger logConnectFailure
INFO: *** Connecting: FAILURE.
java.sql.SQLException: User not found: 
	at org.hsqldb.jdbc.Util.sqlException(Unknown Source)
	at org.hsqldb.jdbc.jdbcConnection.<init>(Unknown Source)
	at org.hsqldb.jdbcDriver.getConnection(Unknown Source)
	at org.hsqldb.jdbcDriver.connect(Unknown Source)
	at org.apache.cayenne.conn.DriverDataSource.getConnection(DriverDataSource.java:157)
	at org.apache.cayenne.conn.PooledConnectionImpl.reconnect(PooledConnectionImpl.java:83)
	at org.apache.cayenne.conn.PooledConnectionImpl.getConnection(PooledConnectionImpl.java:120)
	at org.apache.cayenne.conn.PoolManager.uncheckConnection(PoolManager.java:397)
	at org.apache.cayenne.conn.PoolManager.getConnection(PoolManager.java:381)
	at org.apache.cayenne.conn.PoolManager.getConnection(PoolManager.java:354)
	at org.apache.cayenne.configuration.server.DefaultDbAdapterFactory.detectAdapter(DefaultDbAdapterFactory.java:98)
	at org.apache.cayenne.configuration.server.DefaultDbAdapterFactory$1.get(DefaultDbAdapterFactory.java:85)
	at org.apache.cayenne.configuration.server.DefaultDbAdapterFactory$1.get(DefaultDbAdapterFactory.java:82)
	at org.apache.cayenne.dba.AutoAdapter.loadAdapter(AutoAdapter.java:93)
	at org.apache.cayenne.dba.AutoAdapter.getAdapter(AutoAdapter.java:81)
	at org.apache.cayenne.dba.AutoAdapter.tableTypeForTable(AutoAdapter.java:186)
	at org.apache.cayenne.access.dbsync.CreateIfNoSchemaStrategy.getNameTablesInDB(CreateIfNoSchemaStrategy.java:94)
	at org.apache.cayenne.access.dbsync.CreateIfNoSchemaStrategy.processSchemaUpdate(CreateIfNoSchemaStrategy.java:47)
	at org.apache.cayenne.access.dbsync.BaseSchemaUpdateStrategy.updateSchema(BaseSchemaUpdateStrategy.java:48)
	at org.apache.cayenne.configuration.server.ServerRuntimeCase.setUp(ServerRuntimeCase.java:60)
	at junit.framework.TestCase.runBare(TestCase.java:125)
	at junit.framework.TestResult$1.protect(TestResult.java:106)
	at junit.framework.TestResult.runProtected(TestResult.java:124)
	at junit.framework.TestResult.run(TestResult.java:109)
	at junit.framework.TestCase.run(TestCase.java:118)
	at junit.framework.TestSuite.runTest(TestSuite.java:208)
	at junit.framework.TestSuite.run(TestSuite.java:203)
	at sun.reflect.NativeMethodAccessorImpl.invoke0(Native Method)
	at sun.reflect.NativeMethodAccessorImpl.invoke(NativeMethodAccessorImpl.java:39)
	at sun.reflect.DelegatingMethodAccessorImpl.invoke(DelegatingMethodAccessorImpl.java:25)
	at java.lang.reflect.Method.invoke(Method.java:597)
	at org.apache.maven.surefire.junit.JUnitTestSet.execute(JUnitTestSet.java:213)
	at org.apache.maven.surefire.suite.AbstractDirectoryTestSuite.executeTestSet(AbstractDirectoryTestSuite.java:115)
	at org.apache.maven.surefire.suite.AbstractDirectoryTestSuite.execute(AbstractDirectoryTestSuite.java:102)
	at org.apache.maven.surefire.Surefire.run(Surefire.java:180)
	at sun.reflect.NativeMethodAccessorImpl.invoke0(Native Method)
	at sun.reflect.NativeMethodAccessorImpl.invoke(NativeMethodAccessorImpl.java:39)
	at sun.reflect.DelegatingMethodAccessorImpl.invoke(DelegatingMethodAccessorImpl.java:25)
	at java.lang.reflect.Method.invoke(Method.java:597)
	at org.apache.maven.surefire.booter.SurefireBooter.runSuitesInProcess(SurefireBooter.java:350)
	at org.apache.maven.surefire.booter.SurefireBooter.main(SurefireBooter.java:1021)
Tests run: 4, Failures: 0, Errors: 4, Skipped: 0, Time elapsed: 0.471 sec <<< FAILURE!

Results :

Tests in error: 
  testGetDomain_singleton(org.apache.cayenne.configuration.server.ServerRuntimeIntegrationTest)
  testContext_notSingleton(org.apache.cayenne.configuration.server.ServerRuntimeIntegrationTest)
  testNewContext_separateObjects(org.apache.cayenne.configuration.server.ServerRuntimeIntegrationTest)
  testShutdown(org.apache.cayenne.configuration.server.ServerRuntimeIntegrationTest)

Tests run: 4, Failures: 0, Errors: 4, Skipped: 0

[INFO] ------------------------------------------------------------------------
[INFO] Reactor Summary:
[INFO] 
[INFO] Cayenne ........................................... SUCCESS [0.244s]
[INFO] Common Unit Test Utilities ........................ SUCCESS [1.463s]
[INFO] Cayenne Internal Build Plugin ..................... SUCCESS [1.121s]
[INFO] Cayenne Internal Documentation Build Plugin ....... SUCCESS [6.331s]
[INFO] Cayenne Build Tools Parent ........................ SUCCESS [0.005s]
[INFO] Cayenne License and Notice Bundle ................. SUCCESS [0.483s]
[INFO] Cayenne Dependency Injection Container ............ SUCCESS [2.064s]
[INFO] Cayenne Java 1.5 Unpublished ...................... SUCCESS [1:11.714s]
[INFO] Cayenne WebObjects Compatibility Library .......... SUCCESS [2.339s]
[INFO] Cayenne Aggregated Server Jar ..................... SUCCESS [2.532s]
[INFO] Cayenne Aggregated Client Jar ..................... SUCCESS [3.411s]
[INFO] Cayenne Project ................................... SUCCESS [2.552s]
[INFO] Cayenne Tools ..................................... SUCCESS [4.284s]
[INFO] Library: cayenne-lifecycle ........................ SUCCESS [2.971s]
[INFO] Cayenne Maven Plugin .............................. SUCCESS [1.942s]
[INFO] Cayenne Framework Aggregator Project .............. SUCCESS [0.006s]
[INFO] Cayenne Integration Tests Parent .................. SUCCESS [0.004s]
[INFO] Integration Tests - Cayenne Runtime ............... FAILURE [1.569s]
[INFO] Integration Tests - Cayenne Tools ................. SKIPPED
[INFO] Cayenne Modeler ................................... SKIPPED
[INFO] Cayenne Modeler Maven Plugin ...................... SKIPPED
[INFO] Cayenne Modeler Parent ............................ SKIPPED
[INFO] Cayenne Tutorial .................................. SKIPPED
[INFO] Cayenne ROP Server Tutorial ....................... SKIPPED
[INFO] Cayenne ROP Client Tutorial ....................... SKIPPED
[INFO] Cayenne Tutorials ................................. SKIPPED
[INFO] Cayenne Documentation ............................. SKIPPED
[INFO] Cayenne Documenation Parent ....................... SKIPPED
[INFO] Cayenne Docbook Documenation ...................... SKIPPED
[INFO] Docbook: Cayenne Guide ............................ SKIPPED
[INFO] Docbook: Getting Started with Cayenne ............. SKIPPED
[INFO] Docbook: Getting Started with Cayenne ROP ......... SKIPPED
[INFO] Docbook: Cayenne New Features and Upgrade Guide ... SKIPPED
[INFO] ------------------------------------------------------------------------
[INFO] BUILD FAILURE
[INFO] ------------------------------------------------------------------------
[INFO] Total time: 1:46.379s
[INFO] Finished at: Wed Jan 25 17:28:04 UTC 2012
[INFO] Final Memory: 85M/376M
[INFO] ------------------------------------------------------------------------
[ERROR] Failed to execute goal org.apache.maven.plugins:maven-surefire-plugin:2.5:test (default-test)
on project cayenne-runtime-itest: There are test failures.
[ERROR] 
[ERROR] Please refer to <https://builds.apache.org/job/Cayenne-trunk/./cayenneTestConnection=h2,collationCi=false,jdk=JDK%201.6%20(latest),label=Ubuntu/ws/trunk/itests/cayenne-runtime-itest/target/surefire-reports>
for the individual test results.
[ERROR] -> [Help 1]
org.apache.maven.lifecycle.LifecycleExecutionException: Failed to execute goal org.apache.maven.plugins:maven-surefire-plugin:2.5:test
(default-test) on project cayenne-runtime-itest: There are test failures.

Please refer to <https://builds.apache.org/job/Cayenne-trunk/./cayenneTestConnection=h2,collationCi=false,jdk=JDK%201.6%20(latest),label=Ubuntu/ws/trunk/itests/cayenne-runtime-itest/target/surefire-reports>
for the individual test results.
	at org.apache.maven.lifecycle.internal.MojoExecutor.execute(MojoExecutor.java:213)
	at org.apache.maven.lifecycle.internal.MojoExecutor.execute(MojoExecutor.java:153)
	at org.apache.maven.lifecycle.internal.MojoExecutor.execute(MojoExecutor.java:145)
	at org.apache.maven.lifecycle.internal.LifecycleModuleBuilder.buildProject(LifecycleModuleBuilder.java:84)
	at org.apache.maven.lifecycle.internal.LifecycleModuleBuilder.buildProject(LifecycleModuleBuilder.java:59)
	at org.apache.maven.lifecycle.internal.LifecycleStarter.singleThreadedBuild(LifecycleStarter.java:183)
	at org.apache.maven.lifecycle.internal.LifecycleStarter.execute(LifecycleStarter.java:161)
	at org.apache.maven.DefaultMaven.doExecute(DefaultMaven.java:319)
	at org.apache.maven.DefaultMaven.execute(DefaultMaven.java:156)
	at org.apache.maven.cli.MavenCli.execute(MavenCli.java:537)
	at org.apache.maven.cli.MavenCli.doMain(MavenCli.java:196)
	at org.apache.maven.cli.MavenCli.main(MavenCli.java:141)
	at sun.reflect.NativeMethodAccessorImpl.invoke0(Native Method)
	at sun.reflect.NativeMethodAccessorImpl.invoke(NativeMethodAccessorImpl.java:39)
	at sun.reflect.DelegatingMethodAccessorImpl.invoke(DelegatingMethodAccessorImpl.java:25)
	at java.lang.reflect.Method.invoke(Method.java:597)
	at org.codehaus.plexus.classworlds.launcher.Launcher.launchEnhanced(Launcher.java:290)
	at org.codehaus.plexus.classworlds.launcher.Launcher.launch(Launcher.java:230)
	at org.codehaus.plexus.classworlds.launcher.Launcher.mainWithExitCode(Launcher.java:409)
	at org.codehaus.plexus.classworlds.launcher.Launcher.main(Launcher.java:352)
Caused by: org.apache.maven.plugin.MojoFailureException: There are test failures.

Please refer to <https://builds.apache.org/job/Cayenne-trunk/./cayenneTestConnection=h2,collationCi=false,jdk=JDK%201.6%20(latest),label=Ubuntu/ws/trunk/itests/cayenne-runtime-itest/target/surefire-reports>
for the individual test results.
	at org.apache.maven.plugin.surefire.SurefirePlugin.execute(SurefirePlugin.java:629)
	at org.apache.maven.plugin.DefaultBuildPluginManager.executeMojo(DefaultBuildPluginManager.java:101)
	at org.apache.maven.lifecycle.internal.MojoExecutor.execute(MojoExecutor.java:209)
	... 19 more
[ERROR] 
[ERROR] Re-run Maven using the -X switch to enable full debug logging.
[ERROR] 
[ERROR] For more information about the errors and possible solutions, please read the following
articles:
[ERROR] [Help 1] http://cwiki.apache.org/confluence/display/MAVEN/MojoFailureException
[ERROR] 
[ERROR] After correcting the problems, you can resume the build with the command
[ERROR]   mvn <goals> -rf :cayenne-runtime-itest
Build step 'Invoke top-level Maven targets' marked build as failure
Archiving artifacts


Mime
View raw message